directory-notifications mailing list archives

Site index · List index
Message view « Date » · « Thread »
Top « Date » · « Thread »
From Apache Jenkins Server <jenk...@builds.apache.org>
Subject Build failed in Jenkins: dir-studio-ui-tests-in-docker #195
Date Wed, 10 Oct 2018 15:26:17 GMT
See <https://builds.apache.org/job/dir-studio-ui-tests-in-docker/195/display/redirect?page=changes>

Changes:

[mail] DIRSTUDIO-1195: Update to Eclipse 2018-09

[mail] DIRSTUDIO-1195: Fix ClassCastException with Eclipse 2018-09

------------------------------------------
[...truncated 2.39 MB...]
testGetDisplayValue[InPlaceOidValueEditor - INVALID](org.apache.directory.studio.test.integration.ui.ValueEditorTest)
 Time elapsed: 0 sec
testGetStringOrBinaryValue[InPlaceOidValueEditor - INVALID](org.apache.directory.studio.test.integration.ui.ValueEditorTest)
 Time elapsed: 0.001 sec
testHasValue[InPlaceOidValueEditor - INVALID](org.apache.directory.studio.test.integration.ui.ValueEditorTest)
 Time elapsed: 0 sec
testGetRawValue[InPlaceOidValueEditor - INVALID](org.apache.directory.studio.test.integration.ui.ValueEditorTest)
 Time elapsed: 0 sec
testGetDisplayValue[InPlaceOidValueEditor - bytearray numeric OID](org.apache.directory.studio.test.integration.ui.ValueEditorTest)
 Time elapsed: 0 sec
testGetStringOrBinaryValue[InPlaceOidValueEditor - bytearray numeric OID](org.apache.directory.studio.test.integration.ui.ValueEditorTest)
 Time elapsed: 0.001 sec
testHasValue[InPlaceOidValueEditor - bytearray numeric OID](org.apache.directory.studio.test.integration.ui.ValueEditorTest)
 Time elapsed: 0 sec
testGetRawValue[InPlaceOidValueEditor - bytearray numeric OID](org.apache.directory.studio.test.integration.ui.ValueEditorTest)
 Time elapsed: 0 sec
testGetDisplayValue[InPlaceOidValueEditor - bytearray INVALID](org.apache.directory.studio.test.integration.ui.ValueEditorTest)
 Time elapsed: 0 sec
testGetStringOrBinaryValue[InPlaceOidValueEditor - bytearray INVALID](org.apache.directory.studio.test.integration.ui.ValueEditorTest)
 Time elapsed: 0 sec
testHasValue[InPlaceOidValueEditor - bytearray INVALID](org.apache.directory.studio.test.integration.ui.ValueEditorTest)
 Time elapsed: 0.001 sec
testGetRawValue[InPlaceOidValueEditor - bytearray INVALID](org.apache.directory.studio.test.integration.ui.ValueEditorTest)
 Time elapsed: 0 sec
testGetDisplayValue[TextValueEditor - empty string value](org.apache.directory.studio.test.integration.ui.ValueEditorTest)
 Time elapsed: 0 sec
testGetStringOrBinaryValue[TextValueEditor - empty string value](org.apache.directory.studio.test.integration.ui.ValueEditorTest)
 Time elapsed: 0 sec
testHasValue[TextValueEditor - empty string value](org.apache.directory.studio.test.integration.ui.ValueEditorTest)
 Time elapsed: 0 sec
testGetRawValue[TextValueEditor - empty string value](org.apache.directory.studio.test.integration.ui.ValueEditorTest)
 Time elapsed: 0 sec
testGetDisplayValue[TextValueEditor - empty string](org.apache.directory.studio.test.integration.ui.ValueEditorTest)
 Time elapsed: 0 sec
testGetStringOrBinaryValue[TextValueEditor - empty string](org.apache.directory.studio.test.integration.ui.ValueEditorTest)
 Time elapsed: 0 sec
testHasValue[TextValueEditor - empty string](org.apache.directory.studio.test.integration.ui.ValueEditorTest)
 Time elapsed: 0 sec
testGetRawValue[TextValueEditor - empty string](org.apache.directory.studio.test.integration.ui.ValueEditorTest)
 Time elapsed: 0 sec
testGetDisplayValue[TextValueEditor - ascii](org.apache.directory.studio.test.integration.ui.ValueEditorTest)
 Time elapsed: 0 sec
testGetStringOrBinaryValue[TextValueEditor - ascii](org.apache.directory.studio.test.integration.ui.ValueEditorTest)
 Time elapsed: 0 sec
testHasValue[TextValueEditor - ascii](org.apache.directory.studio.test.integration.ui.ValueEditorTest)
 Time elapsed: 0 sec
testGetRawValue[TextValueEditor - ascii](org.apache.directory.studio.test.integration.ui.ValueEditorTest)
 Time elapsed: 0 sec
testGetDisplayValue[TextValueEditor - unicode](org.apache.directory.studio.test.integration.ui.ValueEditorTest)
 Time elapsed: 0 sec
testGetStringOrBinaryValue[TextValueEditor - unicode](org.apache.directory.studio.test.integration.ui.ValueEditorTest)
 Time elapsed: 0 sec
testHasValue[TextValueEditor - unicode](org.apache.directory.studio.test.integration.ui.ValueEditorTest)
 Time elapsed: 0 sec
testGetRawValue[TextValueEditor - unicode](org.apache.directory.studio.test.integration.ui.ValueEditorTest)
 Time elapsed: 0 sec
testGetDisplayValue[TextValueEditor - empty binary value](org.apache.directory.studio.test.integration.ui.ValueEditorTest)
 Time elapsed: 0 sec
testGetStringOrBinaryValue[TextValueEditor - empty binary value](org.apache.directory.studio.test.integration.ui.ValueEditorTest)
 Time elapsed: 0 sec
testHasValue[TextValueEditor - empty binary value](org.apache.directory.studio.test.integration.ui.ValueEditorTest)
 Time elapsed: 0.001 sec
testGetRawValue[TextValueEditor - empty binary value](org.apache.directory.studio.test.integration.ui.ValueEditorTest)
 Time elapsed: 0 sec
testGetDisplayValue[TextValueEditor - empty bytearray](org.apache.directory.studio.test.integration.ui.ValueEditorTest)
 Time elapsed: 0 sec
testGetStringOrBinaryValue[TextValueEditor - empty bytearray](org.apache.directory.studio.test.integration.ui.ValueEditorTest)
 Time elapsed: 0 sec
testHasValue[TextValueEditor - empty bytearray](org.apache.directory.studio.test.integration.ui.ValueEditorTest)
 Time elapsed: 0 sec
testGetRawValue[TextValueEditor - empty bytearray](org.apache.directory.studio.test.integration.ui.ValueEditorTest)
 Time elapsed: 0 sec
testGetDisplayValue[TextValueEditor - bytearray UTF8](org.apache.directory.studio.test.integration.ui.ValueEditorTest)
 Time elapsed: 0 sec
testGetStringOrBinaryValue[TextValueEditor - bytearray UTF8](org.apache.directory.studio.test.integration.ui.ValueEditorTest)
 Time elapsed: 0 sec
testHasValue[TextValueEditor - bytearray UTF8](org.apache.directory.studio.test.integration.ui.ValueEditorTest)
 Time elapsed: 0 sec
testGetRawValue[TextValueEditor - bytearray UTF8](org.apache.directory.studio.test.integration.ui.ValueEditorTest)
 Time elapsed: 0 sec
testGetDisplayValue[TextValueEditor - bytearray ISO-8859-1](org.apache.directory.studio.test.integration.ui.ValueEditorTest)
 Time elapsed: 0 sec
testGetStringOrBinaryValue[TextValueEditor - bytearray ISO-8859-1](org.apache.directory.studio.test.integration.ui.ValueEditorTest)
 Time elapsed: 0 sec
testHasValue[TextValueEditor - bytearray ISO-8859-1](org.apache.directory.studio.test.integration.ui.ValueEditorTest)
 Time elapsed: 0 sec
testGetRawValue[TextValueEditor - bytearray ISO-8859-1](org.apache.directory.studio.test.integration.ui.ValueEditorTest)
 Time elapsed: 0 sec
testGetDisplayValue[TextValueEditor - bytearray PNG](org.apache.directory.studio.test.integration.ui.ValueEditorTest)
 Time elapsed: 0 sec
testGetStringOrBinaryValue[TextValueEditor - bytearray PNG](org.apache.directory.studio.test.integration.ui.ValueEditorTest)
 Time elapsed: 0 sec
testHasValue[TextValueEditor - bytearray PNG](org.apache.directory.studio.test.integration.ui.ValueEditorTest)
 Time elapsed: 0 sec
testGetRawValue[TextValueEditor - bytearray PNG](org.apache.directory.studio.test.integration.ui.ValueEditorTest)
 Time elapsed: 0 sec
testGetDisplayValue[HexValueEditor - empty string value](org.apache.directory.studio.test.integration.ui.ValueEditorTest)
 Time elapsed: 0.001 sec
testGetStringOrBinaryValue[HexValueEditor - empty string value](org.apache.directory.studio.test.integration.ui.ValueEditorTest)
 Time elapsed: 0.002 sec
testHasValue[HexValueEditor - empty string value](org.apache.directory.studio.test.integration.ui.ValueEditorTest)
 Time elapsed: 0 sec
testGetRawValue[HexValueEditor - empty string value](org.apache.directory.studio.test.integration.ui.ValueEditorTest)
 Time elapsed: 0 sec
testGetDisplayValue[HexValueEditor - empty string](org.apache.directory.studio.test.integration.ui.ValueEditorTest)
 Time elapsed: 0 sec
testGetStringOrBinaryValue[HexValueEditor - empty string](org.apache.directory.studio.test.integration.ui.ValueEditorTest)
 Time elapsed: 0 sec
testHasValue[HexValueEditor - empty string](org.apache.directory.studio.test.integration.ui.ValueEditorTest)
 Time elapsed: 0 sec
testGetRawValue[HexValueEditor - empty string](org.apache.directory.studio.test.integration.ui.ValueEditorTest)
 Time elapsed: 0 sec
testGetDisplayValue[HexValueEditor - ascii](org.apache.directory.studio.test.integration.ui.ValueEditorTest)
 Time elapsed: 0 sec
testGetStringOrBinaryValue[HexValueEditor - ascii](org.apache.directory.studio.test.integration.ui.ValueEditorTest)
 Time elapsed: 0 sec
testHasValue[HexValueEditor - ascii](org.apache.directory.studio.test.integration.ui.ValueEditorTest)
 Time elapsed: 0 sec
testGetRawValue[HexValueEditor - ascii](org.apache.directory.studio.test.integration.ui.ValueEditorTest)
 Time elapsed: 0 sec
testGetDisplayValue[HexValueEditor - empty binary value](org.apache.directory.studio.test.integration.ui.ValueEditorTest)
 Time elapsed: 0 sec
testGetStringOrBinaryValue[HexValueEditor - empty binary value](org.apache.directory.studio.test.integration.ui.ValueEditorTest)
 Time elapsed: 0 sec
testHasValue[HexValueEditor - empty binary value](org.apache.directory.studio.test.integration.ui.ValueEditorTest)
 Time elapsed: 0 sec
testGetRawValue[HexValueEditor - empty binary value](org.apache.directory.studio.test.integration.ui.ValueEditorTest)
 Time elapsed: 0 sec
testGetDisplayValue[HexValueEditor - empty bytearray](org.apache.directory.studio.test.integration.ui.ValueEditorTest)
 Time elapsed: 0 sec
testGetStringOrBinaryValue[HexValueEditor - empty bytearray](org.apache.directory.studio.test.integration.ui.ValueEditorTest)
 Time elapsed: 0 sec
testHasValue[HexValueEditor - empty bytearray](org.apache.directory.studio.test.integration.ui.ValueEditorTest)
 Time elapsed: 0 sec
testGetRawValue[HexValueEditor - empty bytearray](org.apache.directory.studio.test.integration.ui.ValueEditorTest)
 Time elapsed: 0 sec
testGetDisplayValue[HexValueEditor - bytearray UTF8](org.apache.directory.studio.test.integration.ui.ValueEditorTest)
 Time elapsed: 0 sec
testGetStringOrBinaryValue[HexValueEditor - bytearray UTF8](org.apache.directory.studio.test.integration.ui.ValueEditorTest)
 Time elapsed: 0 sec
testHasValue[HexValueEditor - bytearray UTF8](org.apache.directory.studio.test.integration.ui.ValueEditorTest)
 Time elapsed: 0 sec
testGetRawValue[HexValueEditor - bytearray UTF8](org.apache.directory.studio.test.integration.ui.ValueEditorTest)
 Time elapsed: 0 sec
testGetDisplayValue[HexValueEditor - bytearray ISO-8859-1](org.apache.directory.studio.test.integration.ui.ValueEditorTest)
 Time elapsed: 0 sec
testGetStringOrBinaryValue[HexValueEditor - bytearray ISO-8859-1](org.apache.directory.studio.test.integration.ui.ValueEditorTest)
 Time elapsed: 0 sec
testHasValue[HexValueEditor - bytearray ISO-8859-1](org.apache.directory.studio.test.integration.ui.ValueEditorTest)
 Time elapsed: 0 sec
testGetRawValue[HexValueEditor - bytearray ISO-8859-1](org.apache.directory.studio.test.integration.ui.ValueEditorTest)
 Time elapsed: 0 sec
testGetDisplayValue[HexValueEditor - bytearray PNG](org.apache.directory.studio.test.integration.ui.ValueEditorTest)
 Time elapsed: 0 sec
testGetStringOrBinaryValue[HexValueEditor - bytearray PNG](org.apache.directory.studio.test.integration.ui.ValueEditorTest)
 Time elapsed: 0 sec
testHasValue[HexValueEditor - bytearray PNG](org.apache.directory.studio.test.integration.ui.ValueEditorTest)
 Time elapsed: 0 sec
testGetRawValue[HexValueEditor - bytearray PNG](org.apache.directory.studio.test.integration.ui.ValueEditorTest)
 Time elapsed: 0 sec
Running org.apache.directory.studio.test.integration.ui.SchemaEditorSearchTest
Tests run: 1, Failures: 0, Errors: 1, Skipped: 0, Time elapsed: 13.82 sec <<< FAILURE!
- in org.apache.directory.studio.test.integration.ui.SchemaEditorSearchTest
testSearchForAliases(org.apache.directory.studio.test.integration.ui.SchemaEditorSearchTest)
 Time elapsed: 10.316 sec  <<< ERROR!
org.eclipse.swtbot.swt.finder.exceptions.WidgetNotFoundException: Could not find widget matching:
(of type 'Text' and with label (with mnemonic 'Project name:'))
	at org.apache.directory.studio.test.integration.ui.SchemaEditorSearchTest.testSearchForAliases(SchemaEditorSearchTest.java:71)
Caused by: org.eclipse.swtbot.swt.finder.widgets.TimeoutException: Timeout after: 10000 ms.:
Could not find widget matching: (of type 'Text' and with label (with mnemonic 'Project name:'))
	at org.apache.directory.studio.test.integration.ui.SchemaEditorSearchTest.testSearchForAliases(SchemaEditorSearchTest.java:71)

Running org.apache.directory.studio.test.integration.ui.NewConnectionWizardTest
Tests run: 6, Failures: 0, Errors: 0, Skipped: 0, Time elapsed: 8.215 sec - in org.apache.directory.studio.test.integration.ui.NewConnectionWizardTest
testCheckAuthenticationButtonNotOK(org.apache.directory.studio.test.integration.ui.NewConnectionWizardTest)
 Time elapsed: 0.671 sec
testCreateConnection(org.apache.directory.studio.test.integration.ui.NewConnectionWizardTest)
 Time elapsed: 1.106 sec
testCheckNetworkParameterButtonNotOK(org.apache.directory.studio.test.integration.ui.NewConnectionWizardTest)
 Time elapsed: 1.135 sec
testCheckAuthenticationButtonOK(org.apache.directory.studio.test.integration.ui.NewConnectionWizardTest)
 Time elapsed: 0.658 sec
testCheckNetworkParameterButtonOK(org.apache.directory.studio.test.integration.ui.NewConnectionWizardTest)
 Time elapsed: 0.662 sec
testEnabledDisabledWidgets(org.apache.directory.studio.test.integration.ui.NewConnectionWizardTest)
 Time elapsed: 0.861 sec
Running org.apache.directory.studio.test.integration.ui.ApacheDSPluginTest
Tests run: 5, Failures: 0, Errors: 0, Skipped: 0, Time elapsed: 62.472 sec - in org.apache.directory.studio.test.integration.ui.ApacheDSPluginTest
editRemoteConfig(org.apache.directory.studio.test.integration.ui.ApacheDSPluginTest)  Time
elapsed: 14.67 sec
repairAndStartAndStop(org.apache.directory.studio.test.integration.ui.ApacheDSPluginTest)
 Time elapsed: 27.571 sec
verifyServerNameCollisionInNewWizard(org.apache.directory.studio.test.integration.ui.ApacheDSPluginTest)
 Time elapsed: 1.299 sec
testSetEnabledProtocols(org.apache.directory.studio.test.integration.ui.ApacheDSPluginTest)
 Time elapsed: 3.413 sec
serverCreationStartCreateConnectionStopAndDeletion(org.apache.directory.studio.test.integration.ui.ApacheDSPluginTest)
 Time elapsed: 12.294 sec
Running org.apache.directory.studio.test.integration.ui.BrowserTest
Tests run: 15, Failures: 0, Errors: 1, Skipped: 0, Time elapsed: 64.518 sec <<< FAILURE!
- in org.apache.directory.studio.test.integration.ui.BrowserTest
testBookmark(org.apache.directory.studio.test.integration.ui.BrowserTest)  Time elapsed: 0.827
sec
testRefreshRootDSE(org.apache.directory.studio.test.integration.ui.BrowserTest)  Time elapsed:
5.163 sec
testSetInputOnlyOnce(org.apache.directory.studio.test.integration.ui.BrowserTest)  Time elapsed:
11.978 sec  <<< ERROR!
org.eclipse.swtbot.swt.finder.widgets.TimeoutException: Timeout after: 10000 ms.: Entry uid=user.2
was not selected, but uid=user.3
	at org.apache.directory.studio.test.integration.ui.BrowserTest.testSetInputOnlyOnce(BrowserTest.java:648)

testBrowseAndRefreshEntryWithMvRdn(org.apache.directory.studio.test.integration.ui.BrowserTest)
 Time elapsed: 4.466 sec
testBrowseDnWithIpHostNumber(org.apache.directory.studio.test.integration.ui.BrowserTest)
 Time elapsed: 1.993 sec
testRefreshParent(org.apache.directory.studio.test.integration.ui.BrowserTest)  Time elapsed:
3.231 sec
testCopyPasteValueToBookmark(org.apache.directory.studio.test.integration.ui.BrowserTest)
 Time elapsed: 2.517 sec
testBrowseDnWithTrailingEqualsCharacter(org.apache.directory.studio.test.integration.ui.BrowserTest)
 Time elapsed: 1.725 sec
testRefreshSearchContinuation(org.apache.directory.studio.test.integration.ui.BrowserTest)
 Time elapsed: 3.713 sec
testDeleteDontUpdateUI(org.apache.directory.studio.test.integration.ui.BrowserTest)  Time
elapsed: 3.494 sec
testBrowseDnWithSharpAndHexSequence(org.apache.directory.studio.test.integration.ui.BrowserTest)
 Time elapsed: 1.652 sec
testBrowseDnWithBackslash(org.apache.directory.studio.test.integration.ui.BrowserTest)  Time
elapsed: 2.309 sec
testNoModificationWhileBrowsingAndRefreshing(org.apache.directory.studio.test.integration.ui.BrowserTest)
 Time elapsed: 7.796 sec
testRefreshContextEntry(org.apache.directory.studio.test.integration.ui.BrowserTest)  Time
elapsed: 4.207 sec
testOnlyOneSearchRequestWhenExpandingEntry(org.apache.directory.studio.test.integration.ui.BrowserTest)
 Time elapsed: 1.214 sec
Running org.apache.directory.studio.test.integration.ui.SwtResourcesTest
### SWT resouces count: 422
Tests run: 2, Failures: 0, Errors: 0, Skipped: 0, Time elapsed: 51.555 sec - in org.apache.directory.studio.test.integration.ui.SwtResourcesTest
testSwtResourcesCount(org.apache.directory.studio.test.integration.ui.SwtResourcesTest)  Time
elapsed: 0.555 sec
testSwtResourcesDelta(org.apache.directory.studio.test.integration.ui.SwtResourcesTest)  Time
elapsed: 41.928 sec
Running org.apache.directory.studio.test.integration.ui.SchemaBrowserTest
Tests run: 1, Failures: 0, Errors: 0, Skipped: 0, Time elapsed: 3.994 sec - in org.apache.directory.studio.test.integration.ui.SchemaBrowserTest
testRawSchemaDefinitionIsFilled(org.apache.directory.studio.test.integration.ui.SchemaBrowserTest)
 Time elapsed: 1.174 sec
Running org.apache.directory.studio.test.integration.ui.ReferralDialogTest
Tests run: 5, Failures: 0, Errors: 0, Skipped: 0, Time elapsed: 12.431 sec - in org.apache.directory.studio.test.integration.ui.ReferralDialogTest
testBrowseAndFollowManuallyContinuationReference(org.apache.directory.studio.test.integration.ui.ReferralDialogTest)
 Time elapsed: 1.38 sec
testBrowseAndFollowContinuationReference(org.apache.directory.studio.test.integration.ui.ReferralDialogTest)
 Time elapsed: 1.567 sec
testBrowseAndCancelFollowingContinuationReference(org.apache.directory.studio.test.integration.ui.ReferralDialogTest)
 Time elapsed: 1.376 sec
testBrowseAndIgnoreReferral(org.apache.directory.studio.test.integration.ui.ReferralDialogTest)
 Time elapsed: 1.21 sec
testBrowseAndManageReferralEntry(org.apache.directory.studio.test.integration.ui.ReferralDialogTest)
 Time elapsed: 1.362 sec
Running org.apache.directory.studio.test.integration.ui.PreferencesTest
Tests run: 3, Failures: 0, Errors: 0, Skipped: 0, Time elapsed: 7.487 sec - in org.apache.directory.studio.test.integration.ui.PreferencesTest
testCertificatValidationSettingsSaved(org.apache.directory.studio.test.integration.ui.PreferencesTest)
 Time elapsed: 0.571 sec
testCertificatValidationPage(org.apache.directory.studio.test.integration.ui.PreferencesTest)
 Time elapsed: 0.721 sec
testConnectionPasswordsKeystore(org.apache.directory.studio.test.integration.ui.PreferencesTest)
 Time elapsed: 2.968 sec
Running org.apache.directory.studio.test.integration.ui.SearchTest
Tests run: 3, Failures: 0, Errors: 0, Skipped: 0, Time elapsed: 11.187 sec - in org.apache.directory.studio.test.integration.ui.SearchTest
testOnlyOneUiUpdateOnQuickSearch(org.apache.directory.studio.test.integration.ui.SearchTest)
 Time elapsed: 1.944 sec
testRefresh(org.apache.directory.studio.test.integration.ui.SearchTest)  Time elapsed: 2.548
sec
testCopyPasteSearchBetweenConnections(org.apache.directory.studio.test.integration.ui.SearchTest)
 Time elapsed: 1.543 sec
Running org.apache.directory.studio.test.integration.ui.RenameEntryDialogTest
Tests run: 4, Failures: 0, Errors: 0, Skipped: 0, Time elapsed: 14.239 sec - in org.apache.directory.studio.test.integration.ui.RenameEntryDialogTest
testRenameMultiValuedRdn(org.apache.directory.studio.test.integration.ui.RenameEntryDialogTest)
 Time elapsed: 2.409 sec
testRenameRdnWithEscapedCharacters(org.apache.directory.studio.test.integration.ui.RenameEntryDialogTest)
 Time elapsed: 2.524 sec
testRenameRdnWithTrailingSpace(org.apache.directory.studio.test.integration.ui.RenameEntryDialogTest)
 Time elapsed: 3.077 sec
testRenameRdnWithSharp(org.apache.directory.studio.test.integration.ui.RenameEntryDialogTest)
 Time elapsed: 2.278 sec
Running org.apache.directory.studio.test.integration.ui.NewEntryWizardTest
Tests run: 9, Failures: 0, Errors: 0, Skipped: 0, Time elapsed: 26.045 sec - in org.apache.directory.studio.test.integration.ui.NewEntryWizardTest
testCreatePersonEntry(org.apache.directory.studio.test.integration.ui.NewEntryWizardTest)
 Time elapsed: 1.781 sec
testCreateEntryBelowReferralObjectCancel(org.apache.directory.studio.test.integration.ui.NewEntryWizardTest)
 Time elapsed: 3.38 sec
testCreateEntryBelowReferralObjectFollow(org.apache.directory.studio.test.integration.ui.NewEntryWizardTest)
 Time elapsed: 2.891 sec
testCreateOrganizationEntry(org.apache.directory.studio.test.integration.ui.NewEntryWizardTest)
 Time elapsed: 1.736 sec
testCreateEntryWithSharp(org.apache.directory.studio.test.integration.ui.NewEntryWizardTest)
 Time elapsed: 1.706 sec
testCreateEntryWithSlash(org.apache.directory.studio.test.integration.ui.NewEntryWizardTest)
 Time elapsed: 2.025 sec
testCreateMvRdnWithSameAttribute(org.apache.directory.studio.test.integration.ui.NewEntryWizardTest)
 Time elapsed: 1.798 sec
testCreateUpperCaseOrganizationEntries(org.apache.directory.studio.test.integration.ui.NewEntryWizardTest)
 Time elapsed: 2.452 sec
testCreateMvRdnWithNumericOid(org.apache.directory.studio.test.integration.ui.NewEntryWizardTest)
 Time elapsed: 1.967 sec

Results :

Tests in error: 
  BrowserTest.testSetInputOnlyOnce:648 » Timeout Timeout after: 10000 ms.: Entry...
  SchemaEditorSearchTest.testSearchForAliases:71 » WidgetNotFound Could not find...

Tests run: 234, Failures: 0, Errors: 2, Skipped: 1

Job found still running after platform shutdown.  Jobs should be canceled by the plugin that
scheduled them during shutdown: org.apache.directory.studio.common.core.jobs.StudioProgressMonitorWatcherJob
[INFO] ------------------------------------------------------------------------
[INFO] Reactor Summary:
[INFO] 
[INFO] Apache Directory Studio Parent ..................... SUCCESS [  1.245 s]
[INFO] Apache Directory Studio Target Platform for Eclipse  SUCCESS [  0.161 s]
[INFO] Apache Directory Studio Plugins .................... SUCCESS [  0.999 s]
[INFO] Apache Directory Studio Common UI .................. SUCCESS [  4.611 s]
[INFO] Apache Directory Studio Common Core ................ SUCCESS [  0.240 s]
[INFO] Apache Directory Studio LDIF Parser ................ SUCCESS [  1.956 s]
[INFO] Apache Directory Studio Connection Core ............ SUCCESS [  1.150 s]
[INFO] Apache Directory Studio Connection UI .............. SUCCESS [  0.942 s]
[INFO] Apache Directory Studio LDAP Browser Core .......... SUCCESS [  3.009 s]
[INFO] Apache Directory Studio LDAP Browser Common ........ SUCCESS [  2.923 s]
[INFO] Apache Directory Studio Value Editors .............. SUCCESS [  1.768 s]
[INFO] Apache Directory Studio ACI Item Editor ............ SUCCESS [  0.752 s]
[INFO] Apache Directory Studio ApacheDS Configuration ..... SUCCESS [  0.868 s]
[INFO] Apache Directory Studio LDIF Editor ................ SUCCESS [  0.598 s]
[INFO] Apache Directory Studio LDAP Browser UI ............ SUCCESS [  1.194 s]
[INFO] Apache Directory Studio LDAP Servers ............... SUCCESS [  0.490 s]
[INFO] Apache Directory Studio ApacheDS LDAP Server Adapter SUCCESS [  3.174 s]
[INFO] Apache Directory Studio RCP ........................ SUCCESS [  0.371 s]
[INFO] Apache Directory Studio Schema Editor .............. SUCCESS [  3.063 s]
[INFO] Apache Directory Studio eDirecotry ................. SUCCESS [  0.222 s]
[INFO] Apache Directory Studio OpenLDAP Common UI ......... SUCCESS [  1.481 s]
[INFO] Apache Directory Studio OpenLDAP Syncrepl .......... SUCCESS [  1.111 s]
[INFO] Apache Directory Studio OpenLDAP Configuration Editor SUCCESS [  2.880 s]
[INFO] Apache Directory Studio OpenLDAP ACL Configuration Editor SUCCESS [  2.670 s]
[INFO] Apache Directory Studio Template Editor ............ SUCCESS [  2.007 s]
[INFO] Apache Directory Studio Combined Editor ............ SUCCESS [  0.394 s]
[INFO] Apache Directory Studio SLF4J to Eclipse Log Binding SUCCESS [  0.250 s]
[INFO] Apache Directory Studio Help Plugins ............... SUCCESS [  0.017 s]
[INFO] Apache Directory Studio Apache DS Help ............. SUCCESS [  4.477 s]
[INFO] Apache Directory Studio LDAP Browser Help .......... SUCCESS [  8.087 s]
[INFO] Apache Directory Studio LDIF Editor Help ........... SUCCESS [  1.642 s]
[INFO] Apache Directory Studio RCP Help ................... SUCCESS [  1.529 s]
[INFO] Apache Directory Studio Schema Editor Help ......... SUCCESS [  2.311 s]
[INFO] Apache Directory Studio Feature Plugins ............ SUCCESS [  0.029 s]
[INFO] Apache Directory Studio ApacheDS Feature ........... SUCCESS [  0.191 s]
[INFO] Apache Directory Studio LDAP Browser Feature ....... SUCCESS [  0.694 s]
[INFO] Apache Directory Studio LDIF Editor Feature ........ SUCCESS [  0.135 s]
[INFO] Apache Directory Studio RCP Feature ................ SUCCESS [  0.239 s]
[INFO] Apache Directory Studio Schema Editor Feature ...... SUCCESS [  0.115 s]
[INFO] Apache Directory Studio OpenLDAP Feature ........... SUCCESS [  0.133 s]
[INFO] Apache Directory Studio National Language Support Feature SUCCESS [  0.643 s]
[INFO] Apache Directory Studio Test Plugins ............... SUCCESS [  0.017 s]
[INFO] Apache Directory Studio Core Integration Tests ..... SUCCESS [01:39 min]
[INFO] Apache Directory Studio UI Integration Tests ....... FAILURE [09:18 min]
[INFO] Apache Directory Studio P2 Repositories ............ SKIPPED
[INFO] Apache Directory Studio P2 Repository Dependencies . SKIPPED
[INFO] Apache Directory Studio P2 Repository Eclipse ...... SKIPPED
[INFO] Apache Directory Studio Product .................... SKIPPED
[INFO] Apache Directory Studio Installers ................. SKIPPED
[INFO] ------------------------------------------------------------------------
[INFO] BUILD FAILURE
[INFO] ------------------------------------------------------------------------
[INFO] Total time: 17:47 min
[INFO] Finished at: 2018-10-10T15:26:11+00:00
[INFO] Final Memory: 316M/3703M
[INFO] ------------------------------------------------------------------------
[ERROR] Failed to execute goal org.eclipse.tycho:tycho-surefire-plugin:1.2.0:test (default-test)
on project org.apache.directory.studio.test.integration.ui: There are test failures.
[ERROR] 
[ERROR] Please refer to /home/hnelson/studio/tests/test.integration.ui/target/surefire-reports
for the individual test results.
[ERROR] -> [Help 1]
[ERROR] 
[ERROR] To see the full stack trace of the errors, re-run Maven with the -e switch.
[ERROR] Re-run Maven using the -X switch to enable full debug logging.
[ERROR] 
[ERROR] For more information about the errors and possible solutions, please read the following
articles:
[ERROR] [Help 1] http://cwiki.apache.org/confluence/display/MAVEN/MojoFailureException
[ERROR] 
[ERROR] After correcting the problems, you can resume the build with the command
[ERROR]   mvn <goals> -rf :org.apache.directory.studio.test.integration.ui
Build step 'Execute shell' marked build as failure
Recording test results

Mime
View raw message