directory-notifications mailing list archives

Site index · List index
Message view « Date » · « Thread »
Top « Date » · « Thread »
From Apache Jenkins Server <jenk...@builds.apache.org>
Subject Build failed in Jenkins: dir-kerby #473
Date Tue, 13 Feb 2018 02:06:00 GMT
See <https://builds.apache.org/job/dir-kerby/473/display/redirect?page=changes>

Changes:

[plusplusjiajia] DIRKRB-696 Add REST API and client for remote initialization.

[plusplusjiajia] DIRKRB-691 Add tool for remote initialization.

------------------------------------------
Started by an SCM change
[EnvInject] - Loading node environment variables.
Building remotely on H34 (ubuntu xenial) in workspace <https://builds.apache.org/job/dir-kerby/ws/>
 > git rev-parse --is-inside-work-tree # timeout=10
Fetching changes from the remote Git repository
 > git config remote.origin.url https://git-wip-us.apache.org/repos/asf/directory-kerby.git
# timeout=10
Fetching upstream changes from https://git-wip-us.apache.org/repos/asf/directory-kerby.git
 > git --version # timeout=10
 > git fetch --tags --progress https://git-wip-us.apache.org/repos/asf/directory-kerby.git
+refs/heads/*:refs/remotes/origin/*
 > git rev-parse refs/remotes/origin/trunk^{commit} # timeout=10
 > git rev-parse refs/remotes/origin/origin/trunk^{commit} # timeout=10
Checking out Revision f81bbf54992bf05747e169906f665ba8fed3b25f (refs/remotes/origin/trunk)
 > git config core.sparsecheckout # timeout=10
 > git checkout -f f81bbf54992bf05747e169906f665ba8fed3b25f
Commit message: "Merge remote-tracking branch 'asf/trunk' into trunk"
 > git rev-list 26748ae4303d328666970d26914d12a9639f33ba # timeout=10
Parsing POMs
ERROR: Failed to parse POMs
java.io.IOException: remote file operation failed: <https://builds.apache.org/job/dir-kerby/ws/>
at hudson.remoting.Channel@76aa4f54:H34: hudson.remoting.ProxyException: hudson.maven.MavenModuleSetBuild$MavenExecutionException:
org.apache.maven.project.ProjectBuildingException: Some problems were encountered while processing
the POMs:
[FATAL] Non-resolvable parent POM: Could not find artifact org.apache.kerby:kerby-tool:pom:1.1.1-SNAPSHOT
and 'parent.relativePath' points at wrong local POM @ line 5, column 13

	at hudson.FilePath.act(FilePath.java:993)
	at hudson.FilePath.act(FilePath.java:975)
	at hudson.maven.MavenModuleSetBuild$MavenModuleSetBuildExecution.parsePoms(MavenModuleSetBuild.java:986)
	at hudson.maven.MavenModuleSetBuild$MavenModuleSetBuildExecution.doRun(MavenModuleSetBuild.java:691)
	at hudson.model.AbstractBuild$AbstractBuildExecution.run(AbstractBuild.java:504)
	at hudson.model.Run.execute(Run.java:1724)
	at hudson.maven.MavenModuleSetBuild.run(MavenModuleSetBuild.java:543)
	at hudson.model.ResourceController.execute(ResourceController.java:97)
	at hudson.model.Executor.run(Executor.java:421)
Caused by: hudson.remoting.ProxyException: hudson.maven.MavenModuleSetBuild$MavenExecutionException:
org.apache.maven.project.ProjectBuildingException: Some problems were encountered while processing
the POMs:
[FATAL] Non-resolvable parent POM: Could not find artifact org.apache.kerby:kerby-tool:pom:1.1.1-SNAPSHOT
and 'parent.relativePath' points at wrong local POM @ line 5, column 13

	at hudson.maven.MavenModuleSetBuild$PomParser.invoke(MavenModuleSetBuild.java:1391)
	at hudson.maven.MavenModuleSetBuild$PomParser.invoke(MavenModuleSetBuild.java:1125)
	at hudson.FilePath$FileCallableWrapper.call(FilePath.java:2760)
	at hudson.remoting.UserRequest.perform(UserRequest.java:207)
	at hudson.remoting.UserRequest.perform(UserRequest.java:53)
	at hudson.remoting.Request$2.run(Request.java:358)
	at hudson.remoting.InterceptingExecutorService$1.call(InterceptingExecutorService.java:72)
	at java.util.concurrent.FutureTask.run(FutureTask.java:266)
	at java.util.concurrent.ThreadPoolExecutor.runWorker(ThreadPoolExecutor.java:1142)
	at java.util.concurrent.ThreadPoolExecutor$Worker.run(ThreadPoolExecutor.java:617)
	at java.lang.Thread.run(Thread.java:748)
	Suppressed: hudson.remoting.Channel$CallSiteStackTrace: Remote call to H34
		at hudson.remoting.Channel.attachCallSiteStackTrace(Channel.java:1693)
		at hudson.remoting.UserResponse.retrieve(UserRequest.java:310)
		at hudson.remoting.Channel.call(Channel.java:908)
		at hudson.FilePath.act(FilePath.java:986)
		at hudson.FilePath.act(FilePath.java:975)
		at hudson.maven.MavenModuleSetBuild$MavenModuleSetBuildExecution.parsePoms(MavenModuleSetBuild.java:986)
		at hudson.maven.MavenModuleSetBuild$MavenModuleSetBuildExecution.doRun(MavenModuleSetBuild.java:691)
		at hudson.model.AbstractBuild$AbstractBuildExecution.run(AbstractBuild.java:504)
		at hudson.model.Run.execute(Run.java:1724)
		at hudson.maven.MavenModuleSetBuild.run(MavenModuleSetBuild.java:543)
		at hudson.model.ResourceController.execute(ResourceController.java:97)
		at hudson.model.Executor.run(Executor.java:421)
Caused by: hudson.remoting.ProxyException: org.apache.maven.project.ProjectBuildingException:
Some problems were encountered while processing the POMs:
[FATAL] Non-resolvable parent POM: Could not find artifact org.apache.kerby:kerby-tool:pom:1.1.1-SNAPSHOT
and 'parent.relativePath' points at wrong local POM @ line 5, column 13

	at org.apache.maven.project.DefaultProjectBuilder.build(DefaultProjectBuilder.java:364)
	at hudson.maven.MavenEmbedder.buildProjects(MavenEmbedder.java:361)
	at hudson.maven.MavenEmbedder.readProjects(MavenEmbedder.java:331)
	at hudson.maven.MavenModuleSetBuild$PomParser.invoke(MavenModuleSetBuild.java:1328)
	... 10 more

Mime
View raw message