directory-notifications mailing list archives

Site index · List index
Message view « Date » · « Thread »
Top « Date » · « Thread »
From Apache Jenkins Server <jenk...@builds.apache.org>
Subject Build failed in Jenkins: dir-studio-ui-tests-in-docker #84
Date Wed, 08 Nov 2017 14:13:41 GMT
See <https://builds.apache.org/job/dir-studio-ui-tests-in-docker/84/display/redirect>

------------------------------------------
[...truncated 2.28 MB...]
	at org.eclipse.swtbot.swt.finder.SWTBotFactory.waitUntil(SWTBotFactory.java:522)
	at org.eclipse.swtbot.swt.finder.SWTBotFactory.waitUntil(SWTBotFactory.java:496)
	at org.eclipse.swtbot.swt.finder.SWTBotFactory.waitUntil(SWTBotFactory.java:484)
	at org.eclipse.swtbot.swt.finder.SWTBotFactory.waitUntilWidgetAppears(SWTBotFactory.java:466)
	at org.eclipse.swtbot.swt.finder.SWTBotFactory.shells(SWTBotFactory.java:116)
	at org.eclipse.swtbot.swt.finder.SWTBotFactory.shell(SWTBotFactory.java:106)
	at org.eclipse.swtbot.swt.finder.SWTBotFactory.shell(SWTBotFactory.java:97)
	at org.apache.directory.studio.test.integration.ui.bots.NewConnectionWizardBot.clickCheckAuthenticationButtonExpectingCertificateTrustDialog(NewConnectionWizardBot.java:429)
	at org.apache.directory.studio.test.integration.ui.CertificateValidationTest.testLdapsCertificateTrustTemporary(CertificateValidationTest.java:330)

testLdapsCertificateDoNotTrust(org.apache.directory.studio.test.integration.ui.CertificateValidationTest)
 Time elapsed: 12.93 sec  <<< ERROR!
org.eclipse.swtbot.swt.finder.exceptions.WidgetNotFoundException: Could not find widget matching:
(of type 'Combo' and with label (with mnemonic 'Bind DN or user:'))
	at org.eclipse.swtbot.swt.finder.SWTBotFactory.waitUntil(SWTBotFactory.java:522)
	at org.eclipse.swtbot.swt.finder.SWTBotFactory.waitUntil(SWTBotFactory.java:496)
	at org.eclipse.swtbot.swt.finder.SWTBotFactory.waitUntil(SWTBotFactory.java:484)
	at org.eclipse.swtbot.swt.finder.SWTBotFactory.waitUntilWidgetAppears(SWTBotFactory.java:466)
	at org.eclipse.swtbot.swt.finder.SWTBotFactory.widget(SWTBotFactory.java:419)
	at org.eclipse.swtbot.swt.finder.SWTBot.comboBoxWithLabel(SWTBot.java:1715)
	at org.eclipse.swtbot.swt.finder.SWTBot.comboBoxWithLabel(SWTBot.java:1703)
	at org.apache.directory.studio.test.integration.ui.bots.NewConnectionWizardBot.typeUser(NewConnectionWizardBot.java:202)
	at org.apache.directory.studio.test.integration.ui.CertificateValidationTest.testLdapsCertificateDoNotTrust(CertificateValidationTest.java:264)

testStartTlsCertificateValidationExpired(org.apache.directory.studio.test.integration.ui.CertificateValidationTest)
 Time elapsed: 62.687 sec  <<< ERROR!
org.eclipse.swtbot.swt.finder.widgets.TimeoutException: Timeout after: 60000 ms.: Server CertificateValidationTest
not started in servers view.
	at org.eclipse.swtbot.swt.finder.SWTBotFactory.waitUntil(SWTBotFactory.java:522)
	at org.eclipse.swtbot.swt.finder.SWTBotFactory.waitUntil(SWTBotFactory.java:496)
	at org.apache.directory.studio.test.integration.ui.bots.ApacheDSServersViewBot.waitForServerStart(ApacheDSServersViewBot.java:209)
	at org.apache.directory.studio.test.integration.ui.CertificateValidationTest.testStartTlsCertificateValidationExpired(CertificateValidationTest.java:458)

testLdapsCertificateValidationNotOK(org.apache.directory.studio.test.integration.ui.CertificateValidationTest)
 Time elapsed: 12.528 sec  <<< ERROR!
org.eclipse.swtbot.swt.finder.exceptions.WidgetNotFoundException: Could not find widget matching:
(of type 'Combo' and with label (with mnemonic 'Bind DN or user:'))
	at org.eclipse.swtbot.swt.finder.SWTBotFactory.waitUntil(SWTBotFactory.java:522)
	at org.eclipse.swtbot.swt.finder.SWTBotFactory.waitUntil(SWTBotFactory.java:496)
	at org.eclipse.swtbot.swt.finder.SWTBotFactory.waitUntil(SWTBotFactory.java:484)
	at org.eclipse.swtbot.swt.finder.SWTBotFactory.waitUntilWidgetAppears(SWTBotFactory.java:466)
	at org.eclipse.swtbot.swt.finder.SWTBotFactory.widget(SWTBotFactory.java:419)
	at org.eclipse.swtbot.swt.finder.SWTBot.comboBoxWithLabel(SWTBot.java:1715)
	at org.eclipse.swtbot.swt.finder.SWTBot.comboBoxWithLabel(SWTBot.java:1703)
	at org.apache.directory.studio.test.integration.ui.bots.NewConnectionWizardBot.typeUser(NewConnectionWizardBot.java:202)
	at org.apache.directory.studio.test.integration.ui.CertificateValidationTest.testLdapsCertificateValidationNotOK(CertificateValidationTest.java:221)

testStartTlsCertificateTrustPermanent(org.apache.directory.studio.test.integration.ui.CertificateValidationTest)
 Time elapsed: 62.68 sec  <<< ERROR!
org.eclipse.swtbot.swt.finder.widgets.TimeoutException: Timeout after: 60000 ms.: Server CertificateValidationTest
not started in servers view.
	at org.eclipse.swtbot.swt.finder.SWTBotFactory.waitUntil(SWTBotFactory.java:522)
	at org.eclipse.swtbot.swt.finder.SWTBotFactory.waitUntil(SWTBotFactory.java:496)
	at org.apache.directory.studio.test.integration.ui.bots.ApacheDSServersViewBot.waitForServerStart(ApacheDSServersViewBot.java:209)
	at org.apache.directory.studio.test.integration.ui.CertificateValidationTest.testStartTlsCertificateTrustPermanent(CertificateValidationTest.java:725)

testStartTlsCertificateValidationOK(org.apache.directory.studio.test.integration.ui.CertificateValidationTest)
 Time elapsed: 13.537 sec  <<< ERROR!
org.eclipse.swtbot.swt.finder.widgets.TimeoutException: Timeout after: 5000 ms.: The widget
(of type 'Button' and with mnemonic 'Next >' and with style 'SWT.PUSH') was not enabled.
	at org.eclipse.swtbot.swt.finder.SWTBotFactory.waitUntil(SWTBotFactory.java:522)
	at org.eclipse.swtbot.swt.finder.SWTBotFactory.waitUntil(SWTBotFactory.java:496)
	at org.eclipse.swtbot.swt.finder.SWTBotFactory.waitUntil(SWTBotFactory.java:484)
	at org.eclipse.swtbot.swt.finder.widgets.AbstractSWTBot.waitForEnabled(AbstractSWTBot.java:650)
	at org.eclipse.swtbot.swt.finder.widgets.SWTBotButton.click(SWTBotButton.java:65)
	at org.apache.directory.studio.test.integration.ui.bots.DialogBot.clickButton(DialogBot.java:69)
	at org.apache.directory.studio.test.integration.ui.bots.WizardBot.clickNextButton(WizardBot.java:75)
	at org.apache.directory.studio.test.integration.ui.CertificateValidationTest.testStartTlsCertificateValidationOK(CertificateValidationTest.java:433)

testStartTlsCertificateValidationHostnameMismatch(org.apache.directory.studio.test.integration.ui.CertificateValidationTest)
 Time elapsed: 62.806 sec  <<< ERROR!
org.eclipse.swtbot.swt.finder.widgets.TimeoutException: Timeout after: 60000 ms.: Server CertificateValidationTest
not started in servers view.
	at org.eclipse.swtbot.swt.finder.SWTBotFactory.waitUntil(SWTBotFactory.java:522)
	at org.eclipse.swtbot.swt.finder.SWTBotFactory.waitUntil(SWTBotFactory.java:496)
	at org.apache.directory.studio.test.integration.ui.bots.ApacheDSServersViewBot.waitForServerStart(ApacheDSServersViewBot.java:209)
	at org.apache.directory.studio.test.integration.ui.CertificateValidationTest.testStartTlsCertificateValidationHostnameMismatch(CertificateValidationTest.java:550)

testLdapsCertificateValidationOK(org.apache.directory.studio.test.integration.ui.CertificateValidationTest)
 Time elapsed: 12.972 sec  <<< ERROR!
org.eclipse.swtbot.swt.finder.widgets.TimeoutException: Timeout after: 5000 ms.: The widget
(of type 'Button' and with mnemonic 'Next >' and with style 'SWT.PUSH') was not enabled.
	at org.eclipse.swtbot.swt.finder.SWTBotFactory.waitUntil(SWTBotFactory.java:522)
	at org.eclipse.swtbot.swt.finder.SWTBotFactory.waitUntil(SWTBotFactory.java:496)
	at org.eclipse.swtbot.swt.finder.SWTBotFactory.waitUntil(SWTBotFactory.java:484)
	at org.eclipse.swtbot.swt.finder.widgets.AbstractSWTBot.waitForEnabled(AbstractSWTBot.java:650)
	at org.eclipse.swtbot.swt.finder.widgets.SWTBotButton.click(SWTBotButton.java:65)
	at org.apache.directory.studio.test.integration.ui.bots.DialogBot.clickButton(DialogBot.java:69)
	at org.apache.directory.studio.test.integration.ui.bots.WizardBot.clickNextButton(WizardBot.java:75)
	at org.apache.directory.studio.test.integration.ui.CertificateValidationTest.testLdapsCertificateValidationOK(CertificateValidationTest.java:187)

testStartTlsCertificateDoNotTrust(org.apache.directory.studio.test.integration.ui.CertificateValidationTest)
 Time elapsed: 62.621 sec  <<< ERROR!
org.eclipse.swtbot.swt.finder.widgets.TimeoutException: Timeout after: 60000 ms.: Server CertificateValidationTest
not started in servers view.
	at org.eclipse.swtbot.swt.finder.SWTBotFactory.waitUntil(SWTBotFactory.java:522)
	at org.eclipse.swtbot.swt.finder.SWTBotFactory.waitUntil(SWTBotFactory.java:496)
	at org.apache.directory.studio.test.integration.ui.bots.ApacheDSServersViewBot.waitForServerStart(ApacheDSServersViewBot.java:209)
	at org.apache.directory.studio.test.integration.ui.CertificateValidationTest.testStartTlsCertificateDoNotTrust(CertificateValidationTest.java:596)

Running org.apache.directory.studio.test.integration.ui.PreferencesTest
Tests run: 2, Failures: 0, Errors: 0, Skipped: 0, Time elapsed: 10.249 sec - in org.apache.directory.studio.test.integration.ui.PreferencesTest
testCertificatValidationSettingsSaved(org.apache.directory.studio.test.integration.ui.PreferencesTest)
 Time elapsed: 0.559 sec
testCertificatValidationPage(org.apache.directory.studio.test.integration.ui.PreferencesTest)
 Time elapsed: 0.717 sec
Running org.apache.directory.studio.test.integration.ui.SchemaBrowserTest
Tests run: 1, Failures: 0, Errors: 0, Skipped: 0, Time elapsed: 11.454 sec - in org.apache.directory.studio.test.integration.ui.SchemaBrowserTest
testRawSchemaDefinitionIsFilled(org.apache.directory.studio.test.integration.ui.SchemaBrowserTest)
 Time elapsed: 3.23 sec
Running org.apache.directory.studio.test.integration.ui.RcpAppTest
Tests run: 12, Failures: 0, Errors: 0, Skipped: 0, Time elapsed: 12.038 sec - in org.apache.directory.studio.test.integration.ui.RcpAppTest
testLdapPerspectiveViews(org.apache.directory.studio.test.integration.ui.RcpAppTest)  Time
elapsed: 0.505 sec
testHiddenItemsInExportWizard(org.apache.directory.studio.test.integration.ui.RcpAppTest)
 Time elapsed: 0.311 sec
testHiddenPreferencePages(org.apache.directory.studio.test.integration.ui.RcpAppTest)  Time
elapsed: 0.291 sec
testHiddenItemsInNewWizard(org.apache.directory.studio.test.integration.ui.RcpAppTest)  Time
elapsed: 0.285 sec
testVisibleItemsInImportWizard(org.apache.directory.studio.test.integration.ui.RcpAppTest)
 Time elapsed: 0.3 sec
testVisibleItemsInExportWizard(org.apache.directory.studio.test.integration.ui.RcpAppTest)
 Time elapsed: 0.273 sec
testSchemaEditorPerspectiveViews(org.apache.directory.studio.test.integration.ui.RcpAppTest)
 Time elapsed: 0.259 sec
testVisibleItemsInOpenViewsDialog(org.apache.directory.studio.test.integration.ui.RcpAppTest)
 Time elapsed: 0.33 sec
testHiddenItemsInImportWizard(org.apache.directory.studio.test.integration.ui.RcpAppTest)
 Time elapsed: 0.232 sec
testHiddenItemsInOpenViewsDialog(org.apache.directory.studio.test.integration.ui.RcpAppTest)
 Time elapsed: 0.219 sec
testVisibleItemsInNewWizard(org.apache.directory.studio.test.integration.ui.RcpAppTest)  Time
elapsed: 0.283 sec
testVisiblePreferencePages(org.apache.directory.studio.test.integration.ui.RcpAppTest)  Time
elapsed: 0.291 sec
Running org.apache.directory.studio.test.integration.ui.EntryEditorTest
Tests run: 5, Failures: 0, Errors: 0, Skipped: 0, Time elapsed: 47.968 sec - in org.apache.directory.studio.test.integration.ui.EntryEditorTest
testCopyPaste(org.apache.directory.studio.test.integration.ui.EntryEditorTest)  Time elapsed:
5.375 sec
testPasswordValueEditor(org.apache.directory.studio.test.integration.ui.EntryEditorTest) 
Time elapsed: 7.598 sec
testAddEditDeleteAttribute(org.apache.directory.studio.test.integration.ui.EntryEditorTest)
 Time elapsed: 9.245 sec
testDnValueEditor(org.apache.directory.studio.test.integration.ui.EntryEditorTest)  Time elapsed:
6.799 sec
testTestValueEditor(org.apache.directory.studio.test.integration.ui.EntryEditorTest)  Time
elapsed: 6.365 sec
Running org.apache.directory.studio.test.integration.ui.SearchTest
Tests run: 3, Failures: 0, Errors: 0, Skipped: 0, Time elapsed: 30.187 sec - in org.apache.directory.studio.test.integration.ui.SearchTest
testOnlyOneUiUpdateOnQuickSearch(org.apache.directory.studio.test.integration.ui.SearchTest)
 Time elapsed: 6.415 sec
testRefresh(org.apache.directory.studio.test.integration.ui.SearchTest)  Time elapsed: 7.812
sec
testCopyPasteSearchBetweenConnections(org.apache.directory.studio.test.integration.ui.SearchTest)
 Time elapsed: 7.435 sec
Running org.apache.directory.studio.test.integration.ui.GssApiTest
Tests run: 2, Failures: 0, Errors: 2, Skipped: 0, Time elapsed: 72.917 sec <<< FAILURE!
- in org.apache.directory.studio.test.integration.ui.GssApiTest
testGssApiObtainTgtAndUseManualConfigurationAndObtainServiceTicket(org.apache.directory.studio.test.integration.ui.GssApiTest)
 Time elapsed: 31.471 sec  <<< ERROR!
org.eclipse.swtbot.swt.finder.widgets.TimeoutException: Timeout after: 5000 ms.: The widget
(of type 'Button' and with mnemonic 'Next >' and with style 'SWT.PUSH') was not enabled.
	at org.eclipse.swtbot.swt.finder.SWTBotFactory.waitUntil(SWTBotFactory.java:522)
	at org.eclipse.swtbot.swt.finder.SWTBotFactory.waitUntil(SWTBotFactory.java:496)
	at org.eclipse.swtbot.swt.finder.SWTBotFactory.waitUntil(SWTBotFactory.java:484)
	at org.eclipse.swtbot.swt.finder.widgets.AbstractSWTBot.waitForEnabled(AbstractSWTBot.java:650)
	at org.eclipse.swtbot.swt.finder.widgets.SWTBotButton.click(SWTBotButton.java:65)
	at org.apache.directory.studio.test.integration.ui.bots.DialogBot.clickButton(DialogBot.java:69)
	at org.apache.directory.studio.test.integration.ui.bots.WizardBot.clickNextButton(WizardBot.java:75)
	at org.apache.directory.studio.test.integration.ui.GssApiTest.testGssApiObtainTgtAndUseManualConfigurationAndObtainServiceTicket(GssApiTest.java:162)

testGssApiUseNativeTgtAndNativeConfigurationAndObtainServiceTicket(org.apache.directory.studio.test.integration.ui.GssApiTest)
 Time elapsed: 31.251 sec  <<< ERROR!
org.eclipse.swtbot.swt.finder.widgets.TimeoutException: Timeout after: 5000 ms.: The widget
(of type 'Button' and with mnemonic 'Next >' and with style 'SWT.PUSH') was not enabled.
	at org.eclipse.swtbot.swt.finder.SWTBotFactory.waitUntil(SWTBotFactory.java:522)
	at org.eclipse.swtbot.swt.finder.SWTBotFactory.waitUntil(SWTBotFactory.java:496)
	at org.eclipse.swtbot.swt.finder.SWTBotFactory.waitUntil(SWTBotFactory.java:484)
	at org.eclipse.swtbot.swt.finder.widgets.AbstractSWTBot.waitForEnabled(AbstractSWTBot.java:650)
	at org.eclipse.swtbot.swt.finder.widgets.SWTBotButton.click(SWTBotButton.java:65)
	at org.apache.directory.studio.test.integration.ui.bots.DialogBot.clickButton(DialogBot.java:69)
	at org.apache.directory.studio.test.integration.ui.bots.WizardBot.clickNextButton(WizardBot.java:75)
	at org.apache.directory.studio.test.integration.ui.GssApiTest.testGssApiUseNativeTgtAndNativeConfigurationAndObtainServiceTicket(GssApiTest.java:209)

Running org.apache.directory.studio.test.integration.ui.LdifEditorTest
Tests run: 1, Failures: 1, Errors: 0, Skipped: 0, Time elapsed: 11.269 sec <<< FAILURE!
- in org.apache.directory.studio.test.integration.ui.LdifEditorTest
testNewLdifEditor(org.apache.directory.studio.test.integration.ui.LdifEditorTest)  Time elapsed:
2.529 sec  <<< FAILURE!
java.lang.AssertionError: null
	at org.junit.Assert.fail(Assert.java:86)
	at org.junit.Assert.assertTrue(Assert.java:41)
	at org.junit.Assert.assertTrue(Assert.java:52)
	at org.apache.directory.studio.test.integration.ui.LdifEditorTest.testNewLdifEditor(LdifEditorTest.java:81)


Results :

Failed tests: 
  ApacheDSPluginTest.verifyServerNameCollisionInNewWizard:191 expected:<0> but was:<1>
  ApacheDSPluginTest.testSetEnabledProtocols:436->createServer:154 expected:<0> but
was:<1>
  ApacheDSPluginTest.serverCreationStartCreateConnectionStopAndDeletion:92->createServer:154
expected:<0> but was:<1>
  LdifEditorTest.testNewLdifEditor:81 null

Tests in error: 
  ApacheDSPluginTest.repairAndStartAndStop:415 » Timeout Timeout after: 60000 ms...
  CertificateValidationTest.testLdapsCertificateTrustPermanent:365 » Timeout Tim...
  CertificateValidationTest.testLdapsCertificateTrustTemporary:330 » WidgetNotFound
  CertificateValidationTest.testLdapsCertificateDoNotTrust:264 » WidgetNotFound ...
  CertificateValidationTest.testStartTlsCertificateValidationExpired:458 » Timeout
  CertificateValidationTest.testLdapsCertificateValidationNotOK:221 » WidgetNotFound
  CertificateValidationTest.testStartTlsCertificateTrustPermanent:725 » Timeout ...
  CertificateValidationTest.testStartTlsCertificateValidationOK:433 » Timeout Ti...
  CertificateValidationTest.testStartTlsCertificateValidationHostnameMismatch:550 » Timeout
  CertificateValidationTest.testLdapsCertificateValidationOK:187 » Timeout Timeo...
  CertificateValidationTest.testStartTlsCertificateDoNotTrust:596 » Timeout Time...
  GssApiTest.testGssApiObtainTgtAndUseManualConfigurationAndObtainServiceTicket:162 » Timeout
  GssApiTest.testGssApiUseNativeTgtAndNativeConfigurationAndObtainServiceTicket:209 » Timeout

Tests run: 228, Failures: 4, Errors: 13, Skipped: 0

[INFO] ------------------------------------------------------------------------
[INFO] Reactor Summary:
[INFO] 
[INFO] Apache Directory Studio Parent ..................... SUCCESS [  0.958 s]
[INFO] Apache Directory Studio Target Platform for Eclipse  SUCCESS [  0.137 s]
[INFO] Apache Directory Studio Plugins .................... SUCCESS [  0.761 s]
[INFO] Apache Directory Studio Common UI .................. SUCCESS [  2.998 s]
[INFO] Apache Directory Studio Common Core ................ SUCCESS [  0.209 s]
[INFO] Apache Directory Studio LDIF Parser ................ SUCCESS [  1.792 s]
[INFO] Apache Directory Studio Connection Core ............ SUCCESS [  1.015 s]
[INFO] Apache Directory Studio Connection UI .............. SUCCESS [  0.897 s]
[INFO] Apache Directory Studio LDAP Browser Core .......... SUCCESS [  2.899 s]
[INFO] Apache Directory Studio LDAP Browser Common ........ SUCCESS [  2.492 s]
[INFO] Apache Directory Studio Value Editors .............. SUCCESS [  1.637 s]
[INFO] Apache Directory Studio ACI Item Editor ............ SUCCESS [  0.856 s]
[INFO] Apache Directory Studio ApacheDS Configuration ..... SUCCESS [  0.843 s]
[INFO] Apache Directory Studio LDIF Editor ................ SUCCESS [  0.514 s]
[INFO] Apache Directory Studio LDAP Browser UI ............ SUCCESS [  1.288 s]
[INFO] Apache Directory Studio LDAP Servers ............... SUCCESS [  0.346 s]
[INFO] Apache Directory Studio ApacheDS LDAP Server Adapter SUCCESS [  4.325 s]
[INFO] Apache Directory Studio RCP ........................ SUCCESS [  0.327 s]
[INFO] Apache Directory Studio Schema Editor .............. SUCCESS [  2.967 s]
[INFO] Apache Directory Studio OpenLDAP Common UI ......... SUCCESS [  1.275 s]
[INFO] Apache Directory Studio OpenLDAP Syncrepl .......... SUCCESS [  1.251 s]
[INFO] Apache Directory Studio OpenLDAP Configuration Editor SUCCESS [  2.698 s]
[INFO] Apache Directory Studio OpenLDAP ACL Configuration Editor SUCCESS [  2.235 s]
[INFO] Apache Directory Studio Template Editor ............ SUCCESS [  1.847 s]
[INFO] Apache Directory Studio Combined Editor ............ SUCCESS [  0.390 s]
[INFO] Apache Directory Studio SLF4J to Eclipse Log Binding SUCCESS [  0.086 s]
[INFO] Apache Directory Studio Help Plugins ............... SUCCESS [  0.014 s]
[INFO] Apache Directory Studio Apache DS Help ............. SUCCESS [  4.546 s]
[INFO] Apache Directory Studio LDAP Browser Help .......... SUCCESS [  7.535 s]
[INFO] Apache Directory Studio LDIF Editor Help ........... SUCCESS [  1.561 s]
[INFO] Apache Directory Studio RCP Help ................... SUCCESS [  1.623 s]
[INFO] Apache Directory Studio Schema Editor Help ......... SUCCESS [  2.135 s]
[INFO] Apache Directory Studio Feature Plugins ............ SUCCESS [  0.014 s]
[INFO] Apache Directory Studio ApacheDS Feature ........... SUCCESS [  0.165 s]
[INFO] Apache Directory Studio LDAP Browser Feature ....... SUCCESS [  0.116 s]
[INFO] Apache Directory Studio LDIF Editor Feature ........ SUCCESS [  0.089 s]
[INFO] Apache Directory Studio RCP Feature ................ SUCCESS [  0.170 s]
[INFO] Apache Directory Studio Schema Editor Feature ...... SUCCESS [  0.089 s]
[INFO] Apache Directory Studio OpenLDAP Feature ........... SUCCESS [  0.086 s]
[INFO] Apache Directory Studio National Language Support Feature SUCCESS [  0.297 s]
[INFO] Apache Directory Studio Test Plugins ............... SUCCESS [  0.014 s]
[INFO] Apache Directory Studio Core Integration Tests ..... SUCCESS [05:31 min]
[INFO] Apache Directory Studio UI Integration Tests ....... FAILURE [20:06 min]
[INFO] Apache Directory Studio P2 Repositories ............ SKIPPED
[INFO] Apache Directory Studio P2 Repository Dependencies . SKIPPED
[INFO] Apache Directory Studio P2 Repository Eclipse ...... SKIPPED
[INFO] Apache Directory Studio Product .................... SKIPPED
[INFO] Apache Directory Studio Installers ................. SKIPPED
[INFO] ------------------------------------------------------------------------
[INFO] BUILD FAILURE
[INFO] ------------------------------------------------------------------------
[INFO] Total time: 30:51 min
[INFO] Finished at: 2017-11-08T14:13:35+00:00
[INFO] Final Memory: 294M/4400M
[INFO] ------------------------------------------------------------------------
[ERROR] Failed to execute goal org.eclipse.tycho:tycho-surefire-plugin:0.24.0:test (default-test)
on project org.apache.directory.studio.test.integration.ui: There are test failures.
[ERROR] 
[ERROR] Please refer to /home/hnelson/studio/tests/test.integration.ui/target/surefire-reports
for the individual test results.
[ERROR] -> [Help 1]
[ERROR] 
[ERROR] To see the full stack trace of the errors, re-run Maven with the -e switch.
[ERROR] Re-run Maven using the -X switch to enable full debug logging.
[ERROR] 
[ERROR] For more information about the errors and possible solutions, please read the following
articles:
[ERROR] [Help 1] http://cwiki.apache.org/confluence/display/MAVEN/MojoFailureException
[ERROR] 
[ERROR] After correcting the problems, you can resume the build with the command
[ERROR]   mvn <goals> -rf :org.apache.directory.studio.test.integration.ui
Build step 'Execute shell' marked build as failure
Recording test results

Mime
View raw message