directory-notifications mailing list archives

Site index · List index
Message view « Date » · « Thread »
Top « Date » · « Thread »
From Apache Jenkins Server <jenk...@builds.apache.org>
Subject Build failed in Jenkins: dir-studio-ui-tests-in-docker #83
Date Wed, 01 Nov 2017 14:19:49 GMT
See <https://builds.apache.org/job/dir-studio-ui-tests-in-docker/83/display/redirect>

------------------------------------------
[...truncated 1.82 MB...]
testGetStringOrBinaryValue[InPlaceOidValueEditor - numeric OID](org.apache.directory.studio.test.integration.ui.ValueEditorTest)
 Time elapsed: 0 sec
testHasValue[InPlaceOidValueEditor - numeric OID](org.apache.directory.studio.test.integration.ui.ValueEditorTest)
 Time elapsed: 0 sec
testGetRawValue[InPlaceOidValueEditor - numeric OID](org.apache.directory.studio.test.integration.ui.ValueEditorTest)
 Time elapsed: 0 sec
testGetDisplayValue[InPlaceOidValueEditor - descr OID](org.apache.directory.studio.test.integration.ui.ValueEditorTest)
 Time elapsed: 0 sec
testGetStringOrBinaryValue[InPlaceOidValueEditor - descr OID](org.apache.directory.studio.test.integration.ui.ValueEditorTest)
 Time elapsed: 0.001 sec
testHasValue[InPlaceOidValueEditor - descr OID](org.apache.directory.studio.test.integration.ui.ValueEditorTest)
 Time elapsed: 0 sec
testGetRawValue[InPlaceOidValueEditor - descr OID](org.apache.directory.studio.test.integration.ui.ValueEditorTest)
 Time elapsed: 0 sec
testGetDisplayValue[InPlaceOidValueEditor - INVALID](org.apache.directory.studio.test.integration.ui.ValueEditorTest)
 Time elapsed: 0 sec
testGetStringOrBinaryValue[InPlaceOidValueEditor - INVALID](org.apache.directory.studio.test.integration.ui.ValueEditorTest)
 Time elapsed: 0.001 sec
testHasValue[InPlaceOidValueEditor - INVALID](org.apache.directory.studio.test.integration.ui.ValueEditorTest)
 Time elapsed: 0 sec
testGetRawValue[InPlaceOidValueEditor - INVALID](org.apache.directory.studio.test.integration.ui.ValueEditorTest)
 Time elapsed: 0 sec
testGetDisplayValue[InPlaceOidValueEditor - bytearray numeric OID](org.apache.directory.studio.test.integration.ui.ValueEditorTest)
 Time elapsed: 0 sec
testGetStringOrBinaryValue[InPlaceOidValueEditor - bytearray numeric OID](org.apache.directory.studio.test.integration.ui.ValueEditorTest)
 Time elapsed: 0 sec
testHasValue[InPlaceOidValueEditor - bytearray numeric OID](org.apache.directory.studio.test.integration.ui.ValueEditorTest)
 Time elapsed: 0 sec
testGetRawValue[InPlaceOidValueEditor - bytearray numeric OID](org.apache.directory.studio.test.integration.ui.ValueEditorTest)
 Time elapsed: 0 sec
testGetDisplayValue[InPlaceOidValueEditor - bytearray INVALID](org.apache.directory.studio.test.integration.ui.ValueEditorTest)
 Time elapsed: 0 sec
testGetStringOrBinaryValue[InPlaceOidValueEditor - bytearray INVALID](org.apache.directory.studio.test.integration.ui.ValueEditorTest)
 Time elapsed: 0.001 sec
testHasValue[InPlaceOidValueEditor - bytearray INVALID](org.apache.directory.studio.test.integration.ui.ValueEditorTest)
 Time elapsed: 0 sec
testGetRawValue[InPlaceOidValueEditor - bytearray INVALID](org.apache.directory.studio.test.integration.ui.ValueEditorTest)
 Time elapsed: 0 sec
testGetDisplayValue[TextValueEditor - empty string value](org.apache.directory.studio.test.integration.ui.ValueEditorTest)
 Time elapsed: 0 sec
testGetStringOrBinaryValue[TextValueEditor - empty string value](org.apache.directory.studio.test.integration.ui.ValueEditorTest)
 Time elapsed: 0 sec
testHasValue[TextValueEditor - empty string value](org.apache.directory.studio.test.integration.ui.ValueEditorTest)
 Time elapsed: 0 sec
testGetRawValue[TextValueEditor - empty string value](org.apache.directory.studio.test.integration.ui.ValueEditorTest)
 Time elapsed: 0 sec
testGetDisplayValue[TextValueEditor - empty string](org.apache.directory.studio.test.integration.ui.ValueEditorTest)
 Time elapsed: 0.001 sec
testGetStringOrBinaryValue[TextValueEditor - empty string](org.apache.directory.studio.test.integration.ui.ValueEditorTest)
 Time elapsed: 0 sec
testHasValue[TextValueEditor - empty string](org.apache.directory.studio.test.integration.ui.ValueEditorTest)
 Time elapsed: 0 sec
testGetRawValue[TextValueEditor - empty string](org.apache.directory.studio.test.integration.ui.ValueEditorTest)
 Time elapsed: 0 sec
testGetDisplayValue[TextValueEditor - ascii](org.apache.directory.studio.test.integration.ui.ValueEditorTest)
 Time elapsed: 0 sec
testGetStringOrBinaryValue[TextValueEditor - ascii](org.apache.directory.studio.test.integration.ui.ValueEditorTest)
 Time elapsed: 0 sec
testHasValue[TextValueEditor - ascii](org.apache.directory.studio.test.integration.ui.ValueEditorTest)
 Time elapsed: 0 sec
testGetRawValue[TextValueEditor - ascii](org.apache.directory.studio.test.integration.ui.ValueEditorTest)
 Time elapsed: 0 sec
testGetDisplayValue[TextValueEditor - unicode](org.apache.directory.studio.test.integration.ui.ValueEditorTest)
 Time elapsed: 0 sec
testGetStringOrBinaryValue[TextValueEditor - unicode](org.apache.directory.studio.test.integration.ui.ValueEditorTest)
 Time elapsed: 0 sec
testHasValue[TextValueEditor - unicode](org.apache.directory.studio.test.integration.ui.ValueEditorTest)
 Time elapsed: 0 sec
testGetRawValue[TextValueEditor - unicode](org.apache.directory.studio.test.integration.ui.ValueEditorTest)
 Time elapsed: 0 sec
testGetDisplayValue[TextValueEditor - empty binary value](org.apache.directory.studio.test.integration.ui.ValueEditorTest)
 Time elapsed: 0 sec
testGetStringOrBinaryValue[TextValueEditor - empty binary value](org.apache.directory.studio.test.integration.ui.ValueEditorTest)
 Time elapsed: 0 sec
testHasValue[TextValueEditor - empty binary value](org.apache.directory.studio.test.integration.ui.ValueEditorTest)
 Time elapsed: 0 sec
testGetRawValue[TextValueEditor - empty binary value](org.apache.directory.studio.test.integration.ui.ValueEditorTest)
 Time elapsed: 0 sec
testGetDisplayValue[TextValueEditor - empty bytearray](org.apache.directory.studio.test.integration.ui.ValueEditorTest)
 Time elapsed: 0 sec
testGetStringOrBinaryValue[TextValueEditor - empty bytearray](org.apache.directory.studio.test.integration.ui.ValueEditorTest)
 Time elapsed: 0 sec
testHasValue[TextValueEditor - empty bytearray](org.apache.directory.studio.test.integration.ui.ValueEditorTest)
 Time elapsed: 0 sec
testGetRawValue[TextValueEditor - empty bytearray](org.apache.directory.studio.test.integration.ui.ValueEditorTest)
 Time elapsed: 0 sec
testGetDisplayValue[TextValueEditor - bytearray UTF8](org.apache.directory.studio.test.integration.ui.ValueEditorTest)
 Time elapsed: 0 sec
testGetStringOrBinaryValue[TextValueEditor - bytearray UTF8](org.apache.directory.studio.test.integration.ui.ValueEditorTest)
 Time elapsed: 0 sec
testHasValue[TextValueEditor - bytearray UTF8](org.apache.directory.studio.test.integration.ui.ValueEditorTest)
 Time elapsed: 0 sec
testGetRawValue[TextValueEditor - bytearray UTF8](org.apache.directory.studio.test.integration.ui.ValueEditorTest)
 Time elapsed: 0 sec
testGetDisplayValue[TextValueEditor - bytearray ISO-8859-1](org.apache.directory.studio.test.integration.ui.ValueEditorTest)
 Time elapsed: 0 sec
testGetStringOrBinaryValue[TextValueEditor - bytearray ISO-8859-1](org.apache.directory.studio.test.integration.ui.ValueEditorTest)
 Time elapsed: 0 sec
testHasValue[TextValueEditor - bytearray ISO-8859-1](org.apache.directory.studio.test.integration.ui.ValueEditorTest)
 Time elapsed: 0 sec
testGetRawValue[TextValueEditor - bytearray ISO-8859-1](org.apache.directory.studio.test.integration.ui.ValueEditorTest)
 Time elapsed: 0 sec
testGetDisplayValue[TextValueEditor - bytearray PNG](org.apache.directory.studio.test.integration.ui.ValueEditorTest)
 Time elapsed: 0 sec
testGetStringOrBinaryValue[TextValueEditor - bytearray PNG](org.apache.directory.studio.test.integration.ui.ValueEditorTest)
 Time elapsed: 0 sec
testHasValue[TextValueEditor - bytearray PNG](org.apache.directory.studio.test.integration.ui.ValueEditorTest)
 Time elapsed: 0 sec
testGetRawValue[TextValueEditor - bytearray PNG](org.apache.directory.studio.test.integration.ui.ValueEditorTest)
 Time elapsed: 0 sec
testGetDisplayValue[HexValueEditor - empty string value](org.apache.directory.studio.test.integration.ui.ValueEditorTest)
 Time elapsed: 0 sec
testGetStringOrBinaryValue[HexValueEditor - empty string value](org.apache.directory.studio.test.integration.ui.ValueEditorTest)
 Time elapsed: 0.002 sec
testHasValue[HexValueEditor - empty string value](org.apache.directory.studio.test.integration.ui.ValueEditorTest)
 Time elapsed: 0 sec
testGetRawValue[HexValueEditor - empty string value](org.apache.directory.studio.test.integration.ui.ValueEditorTest)
 Time elapsed: 0 sec
testGetDisplayValue[HexValueEditor - empty string](org.apache.directory.studio.test.integration.ui.ValueEditorTest)
 Time elapsed: 0 sec
testGetStringOrBinaryValue[HexValueEditor - empty string](org.apache.directory.studio.test.integration.ui.ValueEditorTest)
 Time elapsed: 0 sec
testHasValue[HexValueEditor - empty string](org.apache.directory.studio.test.integration.ui.ValueEditorTest)
 Time elapsed: 0 sec
testGetRawValue[HexValueEditor - empty string](org.apache.directory.studio.test.integration.ui.ValueEditorTest)
 Time elapsed: 0 sec
testGetDisplayValue[HexValueEditor - ascii](org.apache.directory.studio.test.integration.ui.ValueEditorTest)
 Time elapsed: 0 sec
testGetStringOrBinaryValue[HexValueEditor - ascii](org.apache.directory.studio.test.integration.ui.ValueEditorTest)
 Time elapsed: 0 sec
testHasValue[HexValueEditor - ascii](org.apache.directory.studio.test.integration.ui.ValueEditorTest)
 Time elapsed: 0 sec
testGetRawValue[HexValueEditor - ascii](org.apache.directory.studio.test.integration.ui.ValueEditorTest)
 Time elapsed: 0 sec
testGetDisplayValue[HexValueEditor - empty binary value](org.apache.directory.studio.test.integration.ui.ValueEditorTest)
 Time elapsed: 0 sec
testGetStringOrBinaryValue[HexValueEditor - empty binary value](org.apache.directory.studio.test.integration.ui.ValueEditorTest)
 Time elapsed: 0 sec
testHasValue[HexValueEditor - empty binary value](org.apache.directory.studio.test.integration.ui.ValueEditorTest)
 Time elapsed: 0 sec
testGetRawValue[HexValueEditor - empty binary value](org.apache.directory.studio.test.integration.ui.ValueEditorTest)
 Time elapsed: 0 sec
testGetDisplayValue[HexValueEditor - empty bytearray](org.apache.directory.studio.test.integration.ui.ValueEditorTest)
 Time elapsed: 0 sec
testGetStringOrBinaryValue[HexValueEditor - empty bytearray](org.apache.directory.studio.test.integration.ui.ValueEditorTest)
 Time elapsed: 0 sec
testHasValue[HexValueEditor - empty bytearray](org.apache.directory.studio.test.integration.ui.ValueEditorTest)
 Time elapsed: 0 sec
testGetRawValue[HexValueEditor - empty bytearray](org.apache.directory.studio.test.integration.ui.ValueEditorTest)
 Time elapsed: 0 sec
testGetDisplayValue[HexValueEditor - bytearray UTF8](org.apache.directory.studio.test.integration.ui.ValueEditorTest)
 Time elapsed: 0 sec
testGetStringOrBinaryValue[HexValueEditor - bytearray UTF8](org.apache.directory.studio.test.integration.ui.ValueEditorTest)
 Time elapsed: 0 sec
testHasValue[HexValueEditor - bytearray UTF8](org.apache.directory.studio.test.integration.ui.ValueEditorTest)
 Time elapsed: 0 sec
testGetRawValue[HexValueEditor - bytearray UTF8](org.apache.directory.studio.test.integration.ui.ValueEditorTest)
 Time elapsed: 0 sec
testGetDisplayValue[HexValueEditor - bytearray ISO-8859-1](org.apache.directory.studio.test.integration.ui.ValueEditorTest)
 Time elapsed: 0 sec
testGetStringOrBinaryValue[HexValueEditor - bytearray ISO-8859-1](org.apache.directory.studio.test.integration.ui.ValueEditorTest)
 Time elapsed: 0 sec
testHasValue[HexValueEditor - bytearray ISO-8859-1](org.apache.directory.studio.test.integration.ui.ValueEditorTest)
 Time elapsed: 0 sec
testGetRawValue[HexValueEditor - bytearray ISO-8859-1](org.apache.directory.studio.test.integration.ui.ValueEditorTest)
 Time elapsed: 0 sec
testGetDisplayValue[HexValueEditor - bytearray PNG](org.apache.directory.studio.test.integration.ui.ValueEditorTest)
 Time elapsed: 0.001 sec
testGetStringOrBinaryValue[HexValueEditor - bytearray PNG](org.apache.directory.studio.test.integration.ui.ValueEditorTest)
 Time elapsed: 0 sec
testHasValue[HexValueEditor - bytearray PNG](org.apache.directory.studio.test.integration.ui.ValueEditorTest)
 Time elapsed: 0 sec
testGetRawValue[HexValueEditor - bytearray PNG](org.apache.directory.studio.test.integration.ui.ValueEditorTest)
 Time elapsed: 0 sec
Running org.apache.directory.studio.test.integration.ui.SchemaEditorSearchTest
Tests run: 1, Failures: 0, Errors: 0, Skipped: 0, Time elapsed: 9.81 sec - in org.apache.directory.studio.test.integration.ui.SchemaEditorSearchTest
testSearchForAliases(org.apache.directory.studio.test.integration.ui.SchemaEditorSearchTest)
 Time elapsed: 0.73 sec
Running org.apache.directory.studio.test.integration.ui.NewConnectionWizardTest
The connection failed
 - qwertzuiop.asdfghjkl.yxcvbnm:34471
Tests run: 6, Failures: 0, Errors: 0, Skipped: 0, Time elapsed: 16.698 sec - in org.apache.directory.studio.test.integration.ui.NewConnectionWizardTest
testCheckAuthenticationButtonNotOK(org.apache.directory.studio.test.integration.ui.NewConnectionWizardTest)
 Time elapsed: 0.605 sec
testCreateConnection(org.apache.directory.studio.test.integration.ui.NewConnectionWizardTest)
 Time elapsed: 3.341 sec
testCheckNetworkParameterButtonNotOK(org.apache.directory.studio.test.integration.ui.NewConnectionWizardTest)
 Time elapsed: 1.049 sec
testCheckAuthenticationButtonOK(org.apache.directory.studio.test.integration.ui.NewConnectionWizardTest)
 Time elapsed: 0.496 sec
testCheckNetworkParameterButtonOK(org.apache.directory.studio.test.integration.ui.NewConnectionWizardTest)
 Time elapsed: 0.487 sec
testEnabledDisabledWidgets(org.apache.directory.studio.test.integration.ui.NewConnectionWizardTest)
 Time elapsed: 0.737 sec
Running org.apache.directory.studio.test.integration.ui.ApacheDSPluginTest
Tests run: 5, Failures: 0, Errors: 0, Skipped: 0, Time elapsed: 98.671 sec - in org.apache.directory.studio.test.integration.ui.ApacheDSPluginTest
editRemoteConfig(org.apache.directory.studio.test.integration.ui.ApacheDSPluginTest)  Time
elapsed: 21.775 sec
repairAndStartAndStop(org.apache.directory.studio.test.integration.ui.ApacheDSPluginTest)
 Time elapsed: 37.649 sec
verifyServerNameCollisionInNewWizard(org.apache.directory.studio.test.integration.ui.ApacheDSPluginTest)
 Time elapsed: 1.181 sec
testSetEnabledProtocols(org.apache.directory.studio.test.integration.ui.ApacheDSPluginTest)
 Time elapsed: 3.259 sec
serverCreationStartCreateConnectionStopAndDeletion(org.apache.directory.studio.test.integration.ui.ApacheDSPluginTest)
 Time elapsed: 24.98 sec
Running org.apache.directory.studio.test.integration.ui.BrowserTest
Tests run: 12, Failures: 0, Errors: 0, Skipped: 0, Time elapsed: 141.11 sec - in org.apache.directory.studio.test.integration.ui.BrowserTest
testBookmark(org.apache.directory.studio.test.integration.ui.BrowserTest)  Time elapsed: 3.773
sec
testRefreshRootDSE(org.apache.directory.studio.test.integration.ui.BrowserTest)  Time elapsed:
12.227 sec
testSetInputOnlyOnce(org.apache.directory.studio.test.integration.ui.BrowserTest)  Time elapsed:
10.078 sec
testBrowseDnWithIpHostNumber(org.apache.directory.studio.test.integration.ui.BrowserTest)
 Time elapsed: 4.942 sec
testRefreshParent(org.apache.directory.studio.test.integration.ui.BrowserTest)  Time elapsed:
8.045 sec
testCopyPasteValueToBookmark(org.apache.directory.studio.test.integration.ui.BrowserTest)
 Time elapsed: 6.427 sec
testRefreshSearchContinuation(org.apache.directory.studio.test.integration.ui.BrowserTest)
 Time elapsed: 11.747 sec
testDeleteDontUpdateUI(org.apache.directory.studio.test.integration.ui.BrowserTest)  Time
elapsed: 13.69 sec
testBrowseDnWithSharpAndHexSequence(org.apache.directory.studio.test.integration.ui.BrowserTest)
 Time elapsed: 4.111 sec
testNoModificationWhileBrowsingAndRefreshing(org.apache.directory.studio.test.integration.ui.BrowserTest)
 Time elapsed: 15.238 sec
testRefreshContextEntry(org.apache.directory.studio.test.integration.ui.BrowserTest)  Time
elapsed: 9.077 sec
testOnlyOneSearchRequestWhenExpandingEntry(org.apache.directory.studio.test.integration.ui.BrowserTest)
 Time elapsed: 4.134 sec
Running org.apache.directory.studio.test.integration.ui.SwtResourcesTest
### SWT resouces count: 458
Tests run: 2, Failures: 0, Errors: 0, Skipped: 0, Time elapsed: 172.878 sec - in org.apache.directory.studio.test.integration.ui.SwtResourcesTest
testSwtResourcesCount(org.apache.directory.studio.test.integration.ui.SwtResourcesTest)  Time
elapsed: 2.856 sec
testSwtResourcesDelta(org.apache.directory.studio.test.integration.ui.SwtResourcesTest)  Time
elapsed: 111.321 sec
Running org.apache.directory.studio.test.integration.ui.SchemaBrowserTest
Tests run: 1, Failures: 0, Errors: 0, Skipped: 0, Time elapsed: 18.346 sec - in org.apache.directory.studio.test.integration.ui.SchemaBrowserTest
testRawSchemaDefinitionIsFilled(org.apache.directory.studio.test.integration.ui.SchemaBrowserTest)
 Time elapsed: 3.746 sec
Running org.apache.directory.studio.test.integration.ui.ReferralDialogTest
Tests run: 5, Failures: 0, Errors: 0, Skipped: 0, Time elapsed: 43.263 sec - in org.apache.directory.studio.test.integration.ui.ReferralDialogTest
testBrowseAndFollowManuallyContinuationReference(org.apache.directory.studio.test.integration.ui.ReferralDialogTest)
 Time elapsed: 5.108 sec
testBrowseAndFollowContinuationReference(org.apache.directory.studio.test.integration.ui.ReferralDialogTest)
 Time elapsed: 5.209 sec
testBrowseAndCancelFollowingContinuationReference(org.apache.directory.studio.test.integration.ui.ReferralDialogTest)
 Time elapsed: 4.69 sec
testBrowseAndIgnoreReferral(org.apache.directory.studio.test.integration.ui.ReferralDialogTest)
 Time elapsed: 4.405 sec
testBrowseAndManageReferralEntry(org.apache.directory.studio.test.integration.ui.ReferralDialogTest)
 Time elapsed: 4.712 sec
Running org.apache.directory.studio.test.integration.ui.PreferencesTest
Tests run: 2, Failures: 0, Errors: 0, Skipped: 0, Time elapsed: 16.128 sec - in org.apache.directory.studio.test.integration.ui.PreferencesTest
testCertificatValidationSettingsSaved(org.apache.directory.studio.test.integration.ui.PreferencesTest)
 Time elapsed: 0.585 sec
testCertificatValidationPage(org.apache.directory.studio.test.integration.ui.PreferencesTest)
 Time elapsed: 0.674 sec
Running org.apache.directory.studio.test.integration.ui.SearchTest
Tests run: 3, Failures: 0, Errors: 0, Skipped: 0, Time elapsed: 35.895 sec - in org.apache.directory.studio.test.integration.ui.SearchTest
testOnlyOneUiUpdateOnQuickSearch(org.apache.directory.studio.test.integration.ui.SearchTest)
 Time elapsed: 5.938 sec
testRefresh(org.apache.directory.studio.test.integration.ui.SearchTest)  Time elapsed: 8.386
sec
testCopyPasteSearchBetweenConnections(org.apache.directory.studio.test.integration.ui.SearchTest)
 Time elapsed: 6.577 sec
Running org.apache.directory.studio.test.integration.ui.RenameEntryDialogTest
Tests run: 4, Failures: 0, Errors: 0, Skipped: 0, Time elapsed: 48.95 sec - in org.apache.directory.studio.test.integration.ui.RenameEntryDialogTest
testRenameMultiValuedRdn(org.apache.directory.studio.test.integration.ui.RenameEntryDialogTest)
 Time elapsed: 6.543 sec
testRenameRdnWithEscapedCharacters(org.apache.directory.studio.test.integration.ui.RenameEntryDialogTest)
 Time elapsed: 6.177 sec
testRenameRdnWithTrailingSpace(org.apache.directory.studio.test.integration.ui.RenameEntryDialogTest)
 Time elapsed: 8.552 sec
testRenameRdnWithSharp(org.apache.directory.studio.test.integration.ui.RenameEntryDialogTest)
 Time elapsed: 6.563 sec
Running org.apache.directory.studio.test.integration.ui.NewEntryWizardTest
Tests run: 8, Failures: 0, Errors: 0, Skipped: 0, Time elapsed: 89.157 sec - in org.apache.directory.studio.test.integration.ui.NewEntryWizardTest
testCreatePersonEntry(org.apache.directory.studio.test.integration.ui.NewEntryWizardTest)
 Time elapsed: 7.904 sec
testCreateEntryBelowReferralObjectCancel(org.apache.directory.studio.test.integration.ui.NewEntryWizardTest)
 Time elapsed: 7.38 sec
testCreateEntryBelowReferralObjectFollow(org.apache.directory.studio.test.integration.ui.NewEntryWizardTest)
 Time elapsed: 7.165 sec
testCreateOrganizationEntry(org.apache.directory.studio.test.integration.ui.NewEntryWizardTest)
 Time elapsed: 7.067 sec
testCreateEntryWithSharp(org.apache.directory.studio.test.integration.ui.NewEntryWizardTest)
 Time elapsed: 6.765 sec
testCreateEntryWithSlash(org.apache.directory.studio.test.integration.ui.NewEntryWizardTest)
 Time elapsed: 6.712 sec
testCreateUpperCaseOrganizationEntries(org.apache.directory.studio.test.integration.ui.NewEntryWizardTest)
 Time elapsed: 8.117 sec
testCreateMvRdnWithNumericOid(org.apache.directory.studio.test.integration.ui.NewEntryWizardTest)
 Time elapsed: 6.869 sec

Results :

Tests in error: 
  GssApiTest.testGssApiObtainTgtAndUseManualConfigurationAndObtainServiceTicket:155->importData:276
» Timeout
  GssApiTest.testGssApiUseNativeTgtAndNativeConfigurationAndObtainServiceTicket:195->importData:276
» Timeout
  CertificateValidationTest.testLdapsCertificateTrustPermanent:365 » Timeout Tim...
  CertificateValidationTest.testLdapsCertificateTrustTemporary:316 » Timeout Tim...
  CertificateValidationTest.testStartTlsCertificateValidationExpired:458 » Timeout
  CertificateValidationTest.testStartTlsCertificateTrustPermanent:725 » Timeout ...
  CertificateValidationTest.testStartTlsCertificateValidationHostnameMismatch:550 » Timeout
  CertificateValidationTest.testStartTlsCertificateDoNotTrust:596 » Timeout Time...

Tests run: 228, Failures: 0, Errors: 8, Skipped: 0

[INFO] ------------------------------------------------------------------------
[INFO] Reactor Summary:
[INFO] 
[INFO] Apache Directory Studio Parent ..................... SUCCESS [  0.916 s]
[INFO] Apache Directory Studio Target Platform for Eclipse  SUCCESS [  0.141 s]
[INFO] Apache Directory Studio Plugins .................... SUCCESS [  0.691 s]
[INFO] Apache Directory Studio Common UI .................. SUCCESS [  2.959 s]
[INFO] Apache Directory Studio Common Core ................ SUCCESS [  0.232 s]
[INFO] Apache Directory Studio LDIF Parser ................ SUCCESS [  1.846 s]
[INFO] Apache Directory Studio Connection Core ............ SUCCESS [  0.929 s]
[INFO] Apache Directory Studio Connection UI .............. SUCCESS [  0.902 s]
[INFO] Apache Directory Studio LDAP Browser Core .......... SUCCESS [  3.219 s]
[INFO] Apache Directory Studio LDAP Browser Common ........ SUCCESS [  2.998 s]
[INFO] Apache Directory Studio Value Editors .............. SUCCESS [  1.716 s]
[INFO] Apache Directory Studio ACI Item Editor ............ SUCCESS [  0.564 s]
[INFO] Apache Directory Studio ApacheDS Configuration ..... SUCCESS [  0.756 s]
[INFO] Apache Directory Studio LDIF Editor ................ SUCCESS [  0.529 s]
[INFO] Apache Directory Studio LDAP Browser UI ............ SUCCESS [  1.524 s]
[INFO] Apache Directory Studio LDAP Servers ............... SUCCESS [  0.425 s]
[INFO] Apache Directory Studio ApacheDS LDAP Server Adapter SUCCESS [  5.227 s]
[INFO] Apache Directory Studio RCP ........................ SUCCESS [  0.329 s]
[INFO] Apache Directory Studio Schema Editor .............. SUCCESS [  3.063 s]
[INFO] Apache Directory Studio OpenLDAP Common UI ......... SUCCESS [  1.793 s]
[INFO] Apache Directory Studio OpenLDAP Syncrepl .......... SUCCESS [  1.021 s]
[INFO] Apache Directory Studio OpenLDAP Configuration Editor SUCCESS [  2.525 s]
[INFO] Apache Directory Studio OpenLDAP ACL Configuration Editor SUCCESS [  2.338 s]
[INFO] Apache Directory Studio Template Editor ............ SUCCESS [  1.976 s]
[INFO] Apache Directory Studio Combined Editor ............ SUCCESS [  0.532 s]
[INFO] Apache Directory Studio SLF4J to Eclipse Log Binding SUCCESS [  0.079 s]
[INFO] Apache Directory Studio Help Plugins ............... SUCCESS [  0.013 s]
[INFO] Apache Directory Studio Apache DS Help ............. SUCCESS [  4.393 s]
[INFO] Apache Directory Studio LDAP Browser Help .......... SUCCESS [  7.653 s]
[INFO] Apache Directory Studio LDIF Editor Help ........... SUCCESS [  1.759 s]
[INFO] Apache Directory Studio RCP Help ................... SUCCESS [  1.508 s]
[INFO] Apache Directory Studio Schema Editor Help ......... SUCCESS [  2.139 s]
[INFO] Apache Directory Studio Feature Plugins ............ SUCCESS [  0.027 s]
[INFO] Apache Directory Studio ApacheDS Feature ........... SUCCESS [  0.186 s]
[INFO] Apache Directory Studio LDAP Browser Feature ....... SUCCESS [  0.129 s]
[INFO] Apache Directory Studio LDIF Editor Feature ........ SUCCESS [  0.119 s]
[INFO] Apache Directory Studio RCP Feature ................ SUCCESS [  0.208 s]
[INFO] Apache Directory Studio Schema Editor Feature ...... SUCCESS [  0.107 s]
[INFO] Apache Directory Studio OpenLDAP Feature ........... SUCCESS [  0.103 s]
[INFO] Apache Directory Studio National Language Support Feature SUCCESS [  0.339 s]
[INFO] Apache Directory Studio Test Plugins ............... SUCCESS [  0.012 s]
[INFO] Apache Directory Studio Core Integration Tests ..... SUCCESS [06:05 min]
[INFO] Apache Directory Studio UI Integration Tests ....... FAILURE [24:14 min]
[INFO] Apache Directory Studio P2 Repositories ............ SKIPPED
[INFO] Apache Directory Studio P2 Repository Dependencies . SKIPPED
[INFO] Apache Directory Studio P2 Repository Eclipse ...... SKIPPED
[INFO] Apache Directory Studio Product .................... SKIPPED
[INFO] Apache Directory Studio Installers ................. SKIPPED
[INFO] ------------------------------------------------------------------------
[INFO] BUILD FAILURE
[INFO] ------------------------------------------------------------------------
[INFO] Total time: 35:04 min
[INFO] Finished at: 2017-11-01T14:19:42+00:00
[INFO] Final Memory: 293M/3783M
[INFO] ------------------------------------------------------------------------
[ERROR] Failed to execute goal org.eclipse.tycho:tycho-surefire-plugin:0.24.0:test (default-test)
on project org.apache.directory.studio.test.integration.ui: There are test failures.
[ERROR] 
[ERROR] Please refer to /home/hnelson/studio/tests/test.integration.ui/target/surefire-reports
for the individual test results.
[ERROR] -> [Help 1]
[ERROR] 
[ERROR] To see the full stack trace of the errors, re-run Maven with the -e switch.
[ERROR] Re-run Maven using the -X switch to enable full debug logging.
[ERROR] 
[ERROR] For more information about the errors and possible solutions, please read the following
articles:
[ERROR] [Help 1] http://cwiki.apache.org/confluence/display/MAVEN/MojoFailureException
[ERROR] 
[ERROR] After correcting the problems, you can resume the build with the command
[ERROR]   mvn <goals> -rf :org.apache.directory.studio.test.integration.ui
Build step 'Execute shell' marked build as failure
Recording test results

Mime
View raw message