directory-notifications mailing list archives

Site index · List index
Message view « Date » · « Thread »
Top « Date » · « Thread »
From Apache Jenkins Server <jenk...@builds.apache.org>
Subject Build failed in Jenkins: dir-apacheds-ubuntu-deploy #2021
Date Mon, 16 Oct 2017 12:43:57 GMT
See <https://builds.apache.org/job/dir-apacheds-ubuntu-deploy/2021/display/redirect>

------------------------------------------
[...truncated 579.16 KB...]
[INFO] --- tools-maven-plugin:1.4:verify-legal-files (verify-legal-files) @ apacheds-kerberos-test
---
[INFO] Checking legal files in: apacheds-kerberos-test-2.0.0-M25-SNAPSHOT.jar
[INFO] Checking legal files in: apacheds-kerberos-test-2.0.0-M25-SNAPSHOT-tests.jar
[INFO] 
[INFO] >>> maven-source-plugin:3.0.1:jar (attach-sources) > generate-sources @
apacheds-kerberos-test >>>
[INFO] 
[INFO] --- maven-checkstyle-plugin:2.17:check (validate) @ apacheds-kerberos-test ---
[WARNING] Failed to getClass for org.apache.maven.plugins.source.SourceJarMojo
[INFO] 
[INFO] <<< maven-source-plugin:3.0.1:jar (attach-sources) < generate-sources @
apacheds-kerberos-test <<<
[INFO] 
[INFO] --- maven-source-plugin:3.0.1:jar (attach-sources) @ apacheds-kerberos-test ---
[INFO] Building jar: <https://builds.apache.org/job/dir-apacheds-ubuntu-deploy/ws/trunk/kerberos-test/target/apacheds-kerberos-test-2.0.0-M25-SNAPSHOT-sources.jar>
[INFO] 
[INFO] --- maven-install-plugin:2.5.2:install (default-install) @ apacheds-kerberos-test ---
[INFO] Installing <https://builds.apache.org/job/dir-apacheds-ubuntu-deploy/ws/trunk/kerberos-test/target/apacheds-kerberos-test-2.0.0-M25-SNAPSHOT.jar>
to /home/jenkins/jenkins-slave/maven-repositories/1/org/apache/directory/server/apacheds-kerberos-test/2.0.0-M25-SNAPSHOT/apacheds-kerberos-test-2.0.0-M25-SNAPSHOT.jar
[INFO] Installing <https://builds.apache.org/job/dir-apacheds-ubuntu-deploy/ws/trunk/kerberos-test/pom.xml>
to /home/jenkins/jenkins-slave/maven-repositories/1/org/apache/directory/server/apacheds-kerberos-test/2.0.0-M25-SNAPSHOT/apacheds-kerberos-test-2.0.0-M25-SNAPSHOT.pom
[INFO] Installing <https://builds.apache.org/job/dir-apacheds-ubuntu-deploy/ws/trunk/kerberos-test/target/apacheds-kerberos-test-2.0.0-M25-SNAPSHOT-tests.jar>
to /home/jenkins/jenkins-slave/maven-repositories/1/org/apache/directory/server/apacheds-kerberos-test/2.0.0-M25-SNAPSHOT/apacheds-kerberos-test-2.0.0-M25-SNAPSHOT-tests.jar
[INFO] Installing <https://builds.apache.org/job/dir-apacheds-ubuntu-deploy/ws/trunk/kerberos-test/target/apacheds-kerberos-test-2.0.0-M25-SNAPSHOT-sources.jar>
to /home/jenkins/jenkins-slave/maven-repositories/1/org/apache/directory/server/apacheds-kerberos-test/2.0.0-M25-SNAPSHOT/apacheds-kerberos-test-2.0.0-M25-SNAPSHOT-sources.jar
[INFO] 
[INFO] --- maven-deploy-plugin:2.8.2:deploy (default-deploy) @ apacheds-kerberos-test ---
[INFO] Downloading: https://repository.apache.org/content/repositories/snapshots/org/apache/directory/server/apacheds-kerberos-test/2.0.0-M25-SNAPSHOT/maven-metadata.xml
[INFO] Downloaded: https://repository.apache.org/content/repositories/snapshots/org/apache/directory/server/apacheds-kerberos-test/2.0.0-M25-SNAPSHOT/maven-metadata.xml
(2 KB at 2.1 KB/sec)
[INFO] Uploading: https://repository.apache.org/content/repositories/snapshots/org/apache/directory/server/apacheds-kerberos-test/2.0.0-M25-SNAPSHOT/apacheds-kerberos-test-2.0.0-M25-20171016.124248-19.jar
[INFO] Uploaded: https://repository.apache.org/content/repositories/snapshots/org/apache/directory/server/apacheds-kerberos-test/2.0.0-M25-SNAPSHOT/apacheds-kerberos-test-2.0.0-M25-20171016.124248-19.jar
(7 KB at 7.9 KB/sec)
[INFO] Uploading: https://repository.apache.org/content/repositories/snapshots/org/apache/directory/server/apacheds-kerberos-test/2.0.0-M25-SNAPSHOT/apacheds-kerberos-test-2.0.0-M25-20171016.124248-19.pom
[INFO] Uploaded: https://repository.apache.org/content/repositories/snapshots/org/apache/directory/server/apacheds-kerberos-test/2.0.0-M25-SNAPSHOT/apacheds-kerberos-test-2.0.0-M25-20171016.124248-19.pom
(5 KB at 5.1 KB/sec)
[INFO] Downloading: https://repository.apache.org/content/repositories/snapshots/org/apache/directory/server/apacheds-kerberos-test/maven-metadata.xml
[INFO] Downloaded: https://repository.apache.org/content/repositories/snapshots/org/apache/directory/server/apacheds-kerberos-test/maven-metadata.xml
(417 B at 0.7 KB/sec)
[INFO] Uploading: https://repository.apache.org/content/repositories/snapshots/org/apache/directory/server/apacheds-kerberos-test/2.0.0-M25-SNAPSHOT/maven-metadata.xml
[INFO] Uploaded: https://repository.apache.org/content/repositories/snapshots/org/apache/directory/server/apacheds-kerberos-test/2.0.0-M25-SNAPSHOT/maven-metadata.xml
(2 KB at 1.5 KB/sec)
[INFO] Uploading: https://repository.apache.org/content/repositories/snapshots/org/apache/directory/server/apacheds-kerberos-test/maven-metadata.xml
[INFO] Uploaded: https://repository.apache.org/content/repositories/snapshots/org/apache/directory/server/apacheds-kerberos-test/maven-metadata.xml
(417 B at 0.5 KB/sec)
[INFO] Uploading: https://repository.apache.org/content/repositories/snapshots/org/apache/directory/server/apacheds-kerberos-test/2.0.0-M25-SNAPSHOT/apacheds-kerberos-test-2.0.0-M25-20171016.124248-19-tests.jar
[INFO] Uploaded: https://repository.apache.org/content/repositories/snapshots/org/apache/directory/server/apacheds-kerberos-test/2.0.0-M25-SNAPSHOT/apacheds-kerberos-test-2.0.0-M25-20171016.124248-19-tests.jar
(31 KB at 32.0 KB/sec)
[INFO] Uploading: https://repository.apache.org/content/repositories/snapshots/org/apache/directory/server/apacheds-kerberos-test/2.0.0-M25-SNAPSHOT/maven-metadata.xml
[INFO] Uploaded: https://repository.apache.org/content/repositories/snapshots/org/apache/directory/server/apacheds-kerberos-test/2.0.0-M25-SNAPSHOT/maven-metadata.xml
(2 KB at 1.5 KB/sec)
[INFO] Uploading: https://repository.apache.org/content/repositories/snapshots/org/apache/directory/server/apacheds-kerberos-test/2.0.0-M25-SNAPSHOT/apacheds-kerberos-test-2.0.0-M25-20171016.124248-19-sources.jar
[INFO] Uploaded: https://repository.apache.org/content/repositories/snapshots/org/apache/directory/server/apacheds-kerberos-test/2.0.0-M25-SNAPSHOT/apacheds-kerberos-test-2.0.0-M25-20171016.124248-19-sources.jar
(9 KB at 10.6 KB/sec)
[INFO] Uploading: https://repository.apache.org/content/repositories/snapshots/org/apache/directory/server/apacheds-kerberos-test/2.0.0-M25-SNAPSHOT/maven-metadata.xml
[INFO] Uploaded: https://repository.apache.org/content/repositories/snapshots/org/apache/directory/server/apacheds-kerberos-test/2.0.0-M25-SNAPSHOT/maven-metadata.xml
(2 KB at 1.5 KB/sec)
[JENKINS] Archiving disabled
[INFO]                                                                         
[INFO] ------------------------------------------------------------------------
[INFO] Building ApacheDS Server Integration 2.0.0-M25-SNAPSHOT
[INFO] ------------------------------------------------------------------------
[INFO] Downloading: http://repository.apache.org/snapshots/org/apache/directory/server/apacheds-kerberos-test/2.0.0-M25-SNAPSHOT/maven-metadata.xml
[INFO] Downloaded: http://repository.apache.org/snapshots/org/apache/directory/server/apacheds-kerberos-test/2.0.0-M25-SNAPSHOT/maven-metadata.xml
(2 KB at 3.2 KB/sec)
[INFO] Downloading: http://repository.apache.org/snapshots/org/apache/directory/server/apacheds-kerberos-test/2.0.0-M25-SNAPSHOT/apacheds-kerberos-test-2.0.0-M25-20171016.124248-19-tests.jar
[INFO] Downloaded: http://repository.apache.org/snapshots/org/apache/directory/server/apacheds-kerberos-test/2.0.0-M25-SNAPSHOT/apacheds-kerberos-test-2.0.0-M25-20171016.124248-19-tests.jar
(31 KB at 68.1 KB/sec)
[INFO] 
[INFO] --- maven-clean-plugin:3.0.0:clean (default-clean) @ apacheds-server-integ ---
[INFO] Deleting <https://builds.apache.org/job/dir-apacheds-ubuntu-deploy/ws/trunk/server-integ/target>
[INFO] 
[INFO] --- maven-checkstyle-plugin:2.17:check (validate) @ apacheds-server-integ ---
[INFO] 
[INFO] --- maven-remote-resources-plugin:1.5:process (process-resource-bundles) @ apacheds-server-integ
---
[INFO] Downloading: http://repository.apache.org/snapshots/org/apache/directory/server/apacheds-kerberos-test/2.0.0-M25-SNAPSHOT/apacheds-kerberos-test-2.0.0-M25-20171016.124248-19.pom
[INFO] Downloaded: http://repository.apache.org/snapshots/org/apache/directory/server/apacheds-kerberos-test/2.0.0-M25-SNAPSHOT/apacheds-kerberos-test-2.0.0-M25-20171016.124248-19.pom
(5 KB at 12.0 KB/sec)
[INFO] 
[INFO] --- maven-resources-plugin:3.0.2:resources (default-resources) @ apacheds-server-integ
---
[INFO] Using 'UTF-8' encoding to copy filtered resources.
[INFO] Copying 0 resource
[INFO] Copying 3 resources
[INFO] 
[INFO] --- maven-compiler-plugin:3.6.1:compile (default-compile) @ apacheds-server-integ ---
[INFO] Changes detected - recompiling the module!
[INFO] Compiling 1 source file to <https://builds.apache.org/job/dir-apacheds-ubuntu-deploy/ws/trunk/server-integ/target/classes>
[INFO] <https://builds.apache.org/job/dir-apacheds-ubuntu-deploy/ws/trunk/server-integ/src/main/java/org/apache/directory/server/integ/ServerIntegrationUtils.java>:
<https://builds.apache.org/job/dir-apacheds-ubuntu-deploy/ws/trunk/server-integ/src/main/java/org/apache/directory/server/integ/ServerIntegrationUtils.java>
uses or overrides a deprecated API.
[INFO] <https://builds.apache.org/job/dir-apacheds-ubuntu-deploy/ws/trunk/server-integ/src/main/java/org/apache/directory/server/integ/ServerIntegrationUtils.java>:
Recompile with -Xlint:deprecation for details.
[INFO] 
[INFO] --- maven-dependency-plugin:3.0.1:copy (copy) @ apacheds-server-integ ---
[INFO] Configured Artifact: org.apache.directory.api:api-ldap-extras-codec:?:jar
[INFO] Copying api-ldap-extras-codec-1.0.0.jar to <https://builds.apache.org/job/dir-apacheds-ubuntu-deploy/ws/trunk/server-integ/target/pluginDirectory/api-ldap-extras-codec-1.0.0.jar>
[INFO] 
[INFO] --- maven-resources-plugin:3.0.2:testResources (default-testResources) @ apacheds-server-integ
---
[INFO] Using 'UTF-8' encoding to copy filtered resources.
[INFO] Copying 10 resources
[INFO] Copying 3 resources
[INFO] 
[INFO] --- maven-compiler-plugin:3.6.1:testCompile (default-testCompile) @ apacheds-server-integ
---
[INFO] Changes detected - recompiling the module!
[INFO] Compiling 79 source files to <https://builds.apache.org/job/dir-apacheds-ubuntu-deploy/ws/trunk/server-integ/target/test-classes>
[INFO] <https://builds.apache.org/job/dir-apacheds-ubuntu-deploy/ws/trunk/server-integ/src/test/java/org/apache/directory/server/operations/search/PagedSearchIT.java>:
Some input files use or override a deprecated API.
[INFO] <https://builds.apache.org/job/dir-apacheds-ubuntu-deploy/ws/trunk/server-integ/src/test/java/org/apache/directory/server/operations/search/PagedSearchIT.java>:
Recompile with -Xlint:deprecation for details.
[INFO] <https://builds.apache.org/job/dir-apacheds-ubuntu-deploy/ws/trunk/server-integ/src/test/java/org/apache/directory/server/operations/bind/SaslBindIT.java>:
<https://builds.apache.org/job/dir-apacheds-ubuntu-deploy/ws/trunk/server-integ/src/test/java/org/apache/directory/server/operations/bind/SaslBindIT.java>
uses unchecked or unsafe operations.
[INFO] <https://builds.apache.org/job/dir-apacheds-ubuntu-deploy/ws/trunk/server-integ/src/test/java/org/apache/directory/server/operations/bind/SaslBindIT.java>:
Recompile with -Xlint:unchecked for details.
[INFO] -------------------------------------------------------------
[ERROR] COMPILATION ERROR : 
[INFO] -------------------------------------------------------------
[ERROR] <https://builds.apache.org/job/dir-apacheds-ubuntu-deploy/ws/trunk/server-integ/src/test/java/org/apache/directory/server/operations/search/SearchIT.java>:[23,53]
cannot find symbol
  symbol:   class AutzIntegUtils
  location: package org.apache.directory.server.core.authz
[ERROR] <https://builds.apache.org/job/dir-apacheds-ubuntu-deploy/ws/trunk/server-integ/src/test/java/org/apache/directory/server/operations/search/SearchIT.java>:[23,1]
static import only from classes and interfaces
[ERROR] <https://builds.apache.org/job/dir-apacheds-ubuntu-deploy/ws/trunk/server-integ/src/test/java/org/apache/directory/server/operations/search/SearchIT.java>:[24,53]
cannot find symbol
  symbol:   class AutzIntegUtils
  location: package org.apache.directory.server.core.authz
[ERROR] <https://builds.apache.org/job/dir-apacheds-ubuntu-deploy/ws/trunk/server-integ/src/test/java/org/apache/directory/server/operations/search/SearchIT.java>:[24,1]
static import only from classes and interfaces
[ERROR] <https://builds.apache.org/job/dir-apacheds-ubuntu-deploy/ws/trunk/server-integ/src/test/java/org/apache/directory/server/operations/search/SearchIT.java>:[78,46]
cannot find symbol
  symbol:   class AutzIntegUtils
  location: package org.apache.directory.server.core.authz
[INFO] 5 errors 
[INFO] -------------------------------------------------------------
[JENKINS] Archiving disabled
[JENKINS] Archiving disabled
[JENKINS] Archiving disabled
[JENKINS] Archiving disabled
[JENKINS] Archiving disabled
[JENKINS] Archiving disabled
[JENKINS] Archiving disabled
[JENKINS] Archiving disabled
[JENKINS] Archiving disabled
[JENKINS] Archiving disabled
[JENKINS] Archiving disabled
[JENKINS] Archiving disabled
[JENKINS] Archiving disabled
[JENKINS] Archiving disabled
[JENKINS] Archiving disabled
[JENKINS] Archiving disabled
[JENKINS] Archiving disabled
[JENKINS] Archiving disabled
[JENKINS] Archiving disabled
[JENKINS] Archiving disabled
[JENKINS] Archiving disabled
[JENKINS] Archiving disabled
[JENKINS] Archiving disabled
[JENKINS] Archiving disabled
[JENKINS] Archiving disabled
[JENKINS] Archiving disabled
[JENKINS] Archiving disabled
[JENKINS] Archiving disabled
[JENKINS] Archiving disabled
[JENKINS] Archiving disabled
[JENKINS] Archiving disabled
[JENKINS] Archiving disabled
[JENKINS] Archiving disabled
[JENKINS] Archiving disabled
[JENKINS] Archiving disabled
[JENKINS] Archiving disabled
[JENKINS] Archiving disabled
[JENKINS] Archiving disabled
[JENKINS] Archiving disabled
[JENKINS] Archiving disabled
[JENKINS] Archiving disabled
[JENKINS] Archiving disabled
[JENKINS] Archiving disabled
[JENKINS] Archiving disabled
[JENKINS] Archiving disabled
[JENKINS] Archiving disabled
[JENKINS] Archiving disabled
[JENKINS] Archiving disabled
[JENKINS] Archiving disabled
[JENKINS] Archiving disabled
[JENKINS] Archiving disabled
[JENKINS] Archiving disabled
[JENKINS] Archiving disabled
[JENKINS] Archiving disabled
[JENKINS] Archiving disabled
[JENKINS] Archiving disabled
[JENKINS] Archiving disabled
[INFO] ------------------------------------------------------------------------
[INFO] Reactor Summary:
[INFO] 
[INFO] ApacheDS ........................................... SUCCESS [ 13.428 s]
[INFO] ApacheDS I18n ...................................... SUCCESS [ 12.593 s]
[INFO] ApacheDS Core Constants ............................ SUCCESS [  9.412 s]
[INFO] ApacheDS Core API .................................. SUCCESS [ 36.048 s]
[INFO] ApacheDS Core Shared ............................... SUCCESS [ 14.966 s]
[INFO] ApacheDS Interceptors .............................. SUCCESS [  5.405 s]
[INFO] ApacheDS AdministrativePoint Interceptor ........... SUCCESS [ 14.352 s]
[INFO] ApacheDS Authentication Interceptor ................ SUCCESS [ 14.548 s]
[INFO] ApacheDS Interceptor to increment numeric attributes SUCCESS [ 12.483 s]
[INFO] ApacheDS Authorization Interceptor ................. SUCCESS [ 15.650 s]
[INFO] ApacheDS ChangeLog Interceptor ..................... SUCCESS [ 14.143 s]
[INFO] ApacheDS Collective Attribute Interceptor .......... SUCCESS [ 12.072 s]
[INFO] ApacheDS Event Interceptor ......................... SUCCESS [ 11.979 s]
[INFO] ApacheDS Exception Interceptor ..................... SUCCESS [ 11.865 s]
[INFO] ApacheDS Journal Interceptor ....................... SUCCESS [ 11.923 s]
[INFO] ApacheDS Normalization Interceptor ................. SUCCESS [ 14.000 s]
[INFO] ApacheDS Operational Attribute Interceptor ......... SUCCESS [ 11.931 s]
[INFO] ApacheDS Referral Interceptor ...................... SUCCESS [ 11.893 s]
[INFO] ApacheDS Schema Interceptor ........................ SUCCESS [ 25.086 s]
[INFO] ApacheDS Subtree Interceptor ....................... SUCCESS [ 15.375 s]
[INFO] ApacheDS Triggers Interceptor ...................... SUCCESS [ 12.256 s]
[INFO] ApacheDS Core ...................................... SUCCESS [ 16.044 s]
[INFO] ApacheDS Core AVL .................................. SUCCESS [ 14.127 s]
[INFO] ApacheDS Generalized (X) DBM Partition ............. SUCCESS [ 20.390 s]
[INFO] ApacheDS LDIF Partition ............................ SUCCESS [ 15.540 s]
[INFO] ApacheDS JDBM Partition ............................ SUCCESS [ 22.998 s]
[INFO] ApacheDS Mavibot Partition ......................... SUCCESS [ 18.197 s]
[INFO] ApacheDS Core Annotations .......................... SUCCESS [ 20.964 s]
[INFO] ApacheDS Core JNDI ................................. SUCCESS [ 13.721 s]
[INFO] ApacheDS Protocol Kerberos Codec ................... SUCCESS [ 24.469 s]
[INFO] ApacheDS Interceptors for Kerberos ................. SUCCESS [ 12.742 s]
[INFO] ApacheDS Protocol Dhcp ............................. SUCCESS [ 10.924 s]
[INFO] ApacheDS Protocol Shared ........................... SUCCESS [ 11.894 s]
[INFO] ApacheDS Protocol Dns .............................. SUCCESS [ 15.197 s]
[INFO] ApacheDS Protocol Kerberos ......................... SUCCESS [ 16.100 s]
[INFO] ApacheDS Protocol Ldap ............................. SUCCESS [ 37.257 s]
[INFO] ApacheDS Protocol Ntp .............................. SUCCESS [ 13.287 s]
[INFO] Apacheds Server Annotations ........................ SUCCESS [ 22.216 s]
[INFO] ApacheDS Server Config ............................. SUCCESS [ 15.389 s]
[INFO] ApacheDS Server JNDI ............................... SUCCESS [ 14.117 s]
[INFO] ApacheDS Test Framework ............................ SUCCESS [ 32.709 s]
[INFO] ApacheDS All ....................................... SUCCESS [ 14.510 s]
[INFO] ApacheDS Logger Interceptor ........................ SUCCESS [ 12.185 s]
[INFO] ApacheDS Password Hashing Interceptor .............. SUCCESS [ 12.030 s]
[INFO] ApacheDS Core Integration .......................... SUCCESS [04:23 min]
[INFO] ApacheDS Protocol Kerberos Test .................... SUCCESS [ 24.552 s]
[INFO] ApacheDS Server Integration ........................ FAILURE [  5.435 s]
[INFO] ApacheDS DirectoryService-WebApp bridge ............ SKIPPED
[INFO] ApacheDS Jetty HTTP Server Integration ............. SKIPPED
[INFO] ApacheDS Service Builder ........................... SKIPPED
[INFO] Apache Directory LDAP Client API test .............. SKIPPED
[INFO] kerberos-client .................................... SKIPPED
[INFO] ApacheDS Service ................................... SKIPPED
[INFO] ApacheDS Wrapper ................................... SKIPPED
[INFO] ApacheDS Installers Maven Plugin ................... SKIPPED
[INFO] ApacheDS Installers ................................ SKIPPED
[INFO] ------------------------------------------------------------------------
[INFO] BUILD FAILURE
[INFO] ------------------------------------------------------------------------
[INFO] Total time: 18:30 min
[INFO] Finished at: 2017-10-16T12:43:46+00:00
[INFO] Final Memory: 92M/475M
[INFO] ------------------------------------------------------------------------
[ERROR] Failed to execute goal org.apache.maven.plugins:maven-compiler-plugin:3.6.1:testCompile
(default-testCompile) on project apacheds-server-integ: Compilation failure: Compilation failure:
[ERROR] <https://builds.apache.org/job/dir-apacheds-ubuntu-deploy/ws/trunk/server-integ/src/test/java/org/apache/directory/server/operations/search/SearchIT.java>:[23,53]
cannot find symbol
[ERROR] symbol:   class AutzIntegUtils
[ERROR] location: package org.apache.directory.server.core.authz
[ERROR] <https://builds.apache.org/job/dir-apacheds-ubuntu-deploy/ws/trunk/server-integ/src/test/java/org/apache/directory/server/operations/search/SearchIT.java>:[23,1]
static import only from classes and interfaces
[ERROR] <https://builds.apache.org/job/dir-apacheds-ubuntu-deploy/ws/trunk/server-integ/src/test/java/org/apache/directory/server/operations/search/SearchIT.java>:[24,53]
cannot find symbol
[ERROR] symbol:   class AutzIntegUtils
[ERROR] location: package org.apache.directory.server.core.authz
[ERROR] <https://builds.apache.org/job/dir-apacheds-ubuntu-deploy/ws/trunk/server-integ/src/test/java/org/apache/directory/server/operations/search/SearchIT.java>:[24,1]
static import only from classes and interfaces
[ERROR] <https://builds.apache.org/job/dir-apacheds-ubuntu-deploy/ws/trunk/server-integ/src/test/java/org/apache/directory/server/operations/search/SearchIT.java>:[78,46]
cannot find symbol
[ERROR] symbol:   class AutzIntegUtils
[ERROR] location: package org.apache.directory.server.core.authz
[ERROR] -> [Help 1]
[ERROR] 
[ERROR] To see the full stack trace of the errors, re-run Maven with the -e switch.
[ERROR] Re-run Maven using the -X switch to enable full debug logging.
[ERROR] 
[ERROR] For more information about the errors and possible solutions, please read the following
articles:
[ERROR] [Help 1] http://cwiki.apache.org/confluence/display/MAVEN/MojoFailureException
[ERROR] 
[ERROR] After correcting the problems, you can resume the build with the command
[ERROR]   mvn <goals> -rf :apacheds-server-integ
channel stopped

Mime
View raw message