directory-notifications mailing list archives

Site index · List index
Message view « Date » · « Thread »
Top « Date » · « Thread »
From Apache Jenkins Server <jenk...@builds.apache.org>
Subject Build failed in Jenkins: dir-studio-ui-tests-in-docker #79
Date Wed, 11 Oct 2017 14:47:22 GMT
See <https://builds.apache.org/job/dir-studio-ui-tests-in-docker/79/display/redirect>

------------------------------------------
[...truncated 1.88 MB...]
testHasValue[TextValueEditor - bytearray ISO-8859-1](org.apache.directory.studio.test.integration.ui.ValueEditorTest)
 Time elapsed: 0 sec
testGetRawValue[TextValueEditor - bytearray ISO-8859-1](org.apache.directory.studio.test.integration.ui.ValueEditorTest)
 Time elapsed: 0.001 sec
testGetDisplayValue[TextValueEditor - bytearray PNG](org.apache.directory.studio.test.integration.ui.ValueEditorTest)
 Time elapsed: 0 sec
testGetStringOrBinaryValue[TextValueEditor - bytearray PNG](org.apache.directory.studio.test.integration.ui.ValueEditorTest)
 Time elapsed: 0 sec
testHasValue[TextValueEditor - bytearray PNG](org.apache.directory.studio.test.integration.ui.ValueEditorTest)
 Time elapsed: 0 sec
testGetRawValue[TextValueEditor - bytearray PNG](org.apache.directory.studio.test.integration.ui.ValueEditorTest)
 Time elapsed: 0 sec
testGetDisplayValue[HexValueEditor - empty string value](org.apache.directory.studio.test.integration.ui.ValueEditorTest)
 Time elapsed: 0 sec
testGetStringOrBinaryValue[HexValueEditor - empty string value](org.apache.directory.studio.test.integration.ui.ValueEditorTest)
 Time elapsed: 0.002 sec
testHasValue[HexValueEditor - empty string value](org.apache.directory.studio.test.integration.ui.ValueEditorTest)
 Time elapsed: 0 sec
testGetRawValue[HexValueEditor - empty string value](org.apache.directory.studio.test.integration.ui.ValueEditorTest)
 Time elapsed: 0 sec
testGetDisplayValue[HexValueEditor - empty string](org.apache.directory.studio.test.integration.ui.ValueEditorTest)
 Time elapsed: 0 sec
testGetStringOrBinaryValue[HexValueEditor - empty string](org.apache.directory.studio.test.integration.ui.ValueEditorTest)
 Time elapsed: 0.001 sec
testHasValue[HexValueEditor - empty string](org.apache.directory.studio.test.integration.ui.ValueEditorTest)
 Time elapsed: 0 sec
testGetRawValue[HexValueEditor - empty string](org.apache.directory.studio.test.integration.ui.ValueEditorTest)
 Time elapsed: 0 sec
testGetDisplayValue[HexValueEditor - ascii](org.apache.directory.studio.test.integration.ui.ValueEditorTest)
 Time elapsed: 0 sec
testGetStringOrBinaryValue[HexValueEditor - ascii](org.apache.directory.studio.test.integration.ui.ValueEditorTest)
 Time elapsed: 0 sec
testHasValue[HexValueEditor - ascii](org.apache.directory.studio.test.integration.ui.ValueEditorTest)
 Time elapsed: 0 sec
testGetRawValue[HexValueEditor - ascii](org.apache.directory.studio.test.integration.ui.ValueEditorTest)
 Time elapsed: 0 sec
testGetDisplayValue[HexValueEditor - empty binary value](org.apache.directory.studio.test.integration.ui.ValueEditorTest)
 Time elapsed: 0 sec
testGetStringOrBinaryValue[HexValueEditor - empty binary value](org.apache.directory.studio.test.integration.ui.ValueEditorTest)
 Time elapsed: 0.001 sec
testHasValue[HexValueEditor - empty binary value](org.apache.directory.studio.test.integration.ui.ValueEditorTest)
 Time elapsed: 0 sec
testGetRawValue[HexValueEditor - empty binary value](org.apache.directory.studio.test.integration.ui.ValueEditorTest)
 Time elapsed: 0 sec
testGetDisplayValue[HexValueEditor - empty bytearray](org.apache.directory.studio.test.integration.ui.ValueEditorTest)
 Time elapsed: 0 sec
testGetStringOrBinaryValue[HexValueEditor - empty bytearray](org.apache.directory.studio.test.integration.ui.ValueEditorTest)
 Time elapsed: 0 sec
testHasValue[HexValueEditor - empty bytearray](org.apache.directory.studio.test.integration.ui.ValueEditorTest)
 Time elapsed: 0.001 sec
testGetRawValue[HexValueEditor - empty bytearray](org.apache.directory.studio.test.integration.ui.ValueEditorTest)
 Time elapsed: 0 sec
testGetDisplayValue[HexValueEditor - bytearray UTF8](org.apache.directory.studio.test.integration.ui.ValueEditorTest)
 Time elapsed: 0 sec
testGetStringOrBinaryValue[HexValueEditor - bytearray UTF8](org.apache.directory.studio.test.integration.ui.ValueEditorTest)
 Time elapsed: 0 sec
testHasValue[HexValueEditor - bytearray UTF8](org.apache.directory.studio.test.integration.ui.ValueEditorTest)
 Time elapsed: 0 sec
testGetRawValue[HexValueEditor - bytearray UTF8](org.apache.directory.studio.test.integration.ui.ValueEditorTest)
 Time elapsed: 0 sec
testGetDisplayValue[HexValueEditor - bytearray ISO-8859-1](org.apache.directory.studio.test.integration.ui.ValueEditorTest)
 Time elapsed: 0 sec
testGetStringOrBinaryValue[HexValueEditor - bytearray ISO-8859-1](org.apache.directory.studio.test.integration.ui.ValueEditorTest)
 Time elapsed: 0 sec
testHasValue[HexValueEditor - bytearray ISO-8859-1](org.apache.directory.studio.test.integration.ui.ValueEditorTest)
 Time elapsed: 0 sec
testGetRawValue[HexValueEditor - bytearray ISO-8859-1](org.apache.directory.studio.test.integration.ui.ValueEditorTest)
 Time elapsed: 0 sec
testGetDisplayValue[HexValueEditor - bytearray PNG](org.apache.directory.studio.test.integration.ui.ValueEditorTest)
 Time elapsed: 0 sec
testGetStringOrBinaryValue[HexValueEditor - bytearray PNG](org.apache.directory.studio.test.integration.ui.ValueEditorTest)
 Time elapsed: 0 sec
testHasValue[HexValueEditor - bytearray PNG](org.apache.directory.studio.test.integration.ui.ValueEditorTest)
 Time elapsed: 0 sec
testGetRawValue[HexValueEditor - bytearray PNG](org.apache.directory.studio.test.integration.ui.ValueEditorTest)
 Time elapsed: 0 sec
Running org.apache.directory.studio.test.integration.ui.SchemaEditorSearchTest
Tests run: 1, Failures: 1, Errors: 0, Skipped: 0, Time elapsed: 10.104 sec <<< FAILURE!
- in org.apache.directory.studio.test.integration.ui.SchemaEditorSearchTest
testSearchForAliases(org.apache.directory.studio.test.integration.ui.SchemaEditorSearchTest)
 Time elapsed: 0.692 sec  <<< FAILURE!
java.lang.AssertionError: 
Expected: <1>
     but: was <0>
	at org.hamcrest.MatcherAssert.assertThat(MatcherAssert.java:20)
	at org.hamcrest.MatcherAssert.assertThat(MatcherAssert.java:8)
	at org.apache.directory.studio.test.integration.ui.SchemaEditorSearchTest.testSearchForAliases(SchemaEditorSearchTest.java:80)

Running org.apache.directory.studio.test.integration.ui.NewConnectionWizardTest
The connection failed
 - Cannot connect to the server: Hostname 'qwertzuiop.asdfghjkl.yxcvbnm' could not be resolved.
Tests run: 6, Failures: 0, Errors: 2, Skipped: 0, Time elapsed: 33.854 sec <<< FAILURE!
- in org.apache.directory.studio.test.integration.ui.NewConnectionWizardTest
testCheckAuthenticationButtonNotOK(org.apache.directory.studio.test.integration.ui.NewConnectionWizardTest)
 Time elapsed: 5.516 sec  <<< ERROR!
org.eclipse.swtbot.swt.finder.widgets.TimeoutException: Timeout after: 5000 ms.: The widget
(of type 'Button' and with mnemonic 'Next >' and with style 'SWT.PUSH') was not enabled.
	at org.eclipse.swtbot.swt.finder.SWTBotFactory.waitUntil(SWTBotFactory.java:522)
	at org.eclipse.swtbot.swt.finder.SWTBotFactory.waitUntil(SWTBotFactory.java:496)
	at org.eclipse.swtbot.swt.finder.SWTBotFactory.waitUntil(SWTBotFactory.java:484)
	at org.eclipse.swtbot.swt.finder.widgets.AbstractSWTBot.waitForEnabled(AbstractSWTBot.java:650)
	at org.eclipse.swtbot.swt.finder.widgets.SWTBotButton.click(SWTBotButton.java:65)
	at org.apache.directory.studio.test.integration.ui.bots.DialogBot.clickButton(DialogBot.java:69)
	at org.apache.directory.studio.test.integration.ui.bots.WizardBot.clickNextButton(WizardBot.java:75)
	at org.apache.directory.studio.test.integration.ui.NewConnectionWizardTest.testCheckAuthenticationButtonNotOK(NewConnectionWizardTest.java:491)

testCreateConnection(org.apache.directory.studio.test.integration.ui.NewConnectionWizardTest)
 Time elapsed: 5.416 sec  <<< ERROR!
org.eclipse.swtbot.swt.finder.widgets.TimeoutException: Timeout after: 5000 ms.: The widget
(of type 'Button' and with mnemonic 'Next >' and with style 'SWT.PUSH') was not enabled.
	at org.eclipse.swtbot.swt.finder.SWTBotFactory.waitUntil(SWTBotFactory.java:522)
	at org.eclipse.swtbot.swt.finder.SWTBotFactory.waitUntil(SWTBotFactory.java:496)
	at org.eclipse.swtbot.swt.finder.SWTBotFactory.waitUntil(SWTBotFactory.java:484)
	at org.eclipse.swtbot.swt.finder.widgets.AbstractSWTBot.waitForEnabled(AbstractSWTBot.java:650)
	at org.eclipse.swtbot.swt.finder.widgets.SWTBotButton.click(SWTBotButton.java:65)
	at org.apache.directory.studio.test.integration.ui.bots.DialogBot.clickButton(DialogBot.java:69)
	at org.apache.directory.studio.test.integration.ui.bots.WizardBot.clickNextButton(WizardBot.java:75)
	at org.apache.directory.studio.test.integration.ui.NewConnectionWizardTest.testCreateConnection(NewConnectionWizardTest.java:335)

testCheckNetworkParameterButtonNotOK(org.apache.directory.studio.test.integration.ui.NewConnectionWizardTest)
 Time elapsed: 11.743 sec
testCheckAuthenticationButtonOK(org.apache.directory.studio.test.integration.ui.NewConnectionWizardTest)
 Time elapsed: 1.111 sec
testCheckNetworkParameterButtonOK(org.apache.directory.studio.test.integration.ui.NewConnectionWizardTest)
 Time elapsed: 0.652 sec
testEnabledDisabledWidgets(org.apache.directory.studio.test.integration.ui.NewConnectionWizardTest)
 Time elapsed: 1.008 sec
Running org.apache.directory.studio.test.integration.ui.ApacheDSPluginTest
Tests run: 5, Failures: 0, Errors: 0, Skipped: 0, Time elapsed: 89.005 sec - in org.apache.directory.studio.test.integration.ui.ApacheDSPluginTest
editRemoteConfig(org.apache.directory.studio.test.integration.ui.ApacheDSPluginTest)  Time
elapsed: 22.254 sec
repairAndStartAndStop(org.apache.directory.studio.test.integration.ui.ApacheDSPluginTest)
 Time elapsed: 33.895 sec
verifyServerNameCollisionInNewWizard(org.apache.directory.studio.test.integration.ui.ApacheDSPluginTest)
 Time elapsed: 1.346 sec
testSetEnabledProtocols(org.apache.directory.studio.test.integration.ui.ApacheDSPluginTest)
 Time elapsed: 3.333 sec
serverCreationStartCreateConnectionStopAndDeletion(org.apache.directory.studio.test.integration.ui.ApacheDSPluginTest)
 Time elapsed: 19.276 sec
Running org.apache.directory.studio.test.integration.ui.BrowserTest
Tests run: 12, Failures: 1, Errors: 0, Skipped: 0, Time elapsed: 119.712 sec <<<
FAILURE! - in org.apache.directory.studio.test.integration.ui.BrowserTest
testBookmark(org.apache.directory.studio.test.integration.ui.BrowserTest)  Time elapsed: 3.708
sec
testRefreshRootDSE(org.apache.directory.studio.test.integration.ui.BrowserTest)  Time elapsed:
12.145 sec
testSetInputOnlyOnce(org.apache.directory.studio.test.integration.ui.BrowserTest)  Time elapsed:
8.281 sec  <<< FAILURE!
org.junit.ComparisonFailure: expected:<uid=user.[2]> but was:<uid=user.[3]>
	at org.junit.Assert.assertEquals(Assert.java:115)
	at org.junit.Assert.assertEquals(Assert.java:144)
	at org.apache.directory.studio.test.integration.ui.BrowserTest.testSetInputOnlyOnce(BrowserTest.java:614)

testBrowseDnWithIpHostNumber(org.apache.directory.studio.test.integration.ui.BrowserTest)
 Time elapsed: 5.022 sec
testRefreshParent(org.apache.directory.studio.test.integration.ui.BrowserTest)  Time elapsed:
7.917 sec
testCopyPasteValueToBookmark(org.apache.directory.studio.test.integration.ui.BrowserTest)
 Time elapsed: 5.94 sec
testRefreshSearchContinuation(org.apache.directory.studio.test.integration.ui.BrowserTest)
 Time elapsed: 10.966 sec
testDeleteDontUpdateUI(org.apache.directory.studio.test.integration.ui.BrowserTest)  Time
elapsed: 9.697 sec
testBrowseDnWithSharpAndHexSequence(org.apache.directory.studio.test.integration.ui.BrowserTest)
 Time elapsed: 4.674 sec
testNoModificationWhileBrowsingAndRefreshing(org.apache.directory.studio.test.integration.ui.BrowserTest)
 Time elapsed: 15.939 sec
testRefreshContextEntry(org.apache.directory.studio.test.integration.ui.BrowserTest)  Time
elapsed: 8.738 sec
testOnlyOneSearchRequestWhenExpandingEntry(org.apache.directory.studio.test.integration.ui.BrowserTest)
 Time elapsed: 4.081 sec
Running org.apache.directory.studio.test.integration.ui.SwtResourcesTest
### SWT resouces count: 599
Tests run: 2, Failures: 1, Errors: 0, Skipped: 0, Time elapsed: 134.439 sec <<< FAILURE!
- in org.apache.directory.studio.test.integration.ui.SwtResourcesTest
testSwtResourcesCount(org.apache.directory.studio.test.integration.ui.SwtResourcesTest)  Time
elapsed: 2.91 sec
testSwtResourcesDelta(org.apache.directory.studio.test.integration.ui.SwtResourcesTest)  Time
elapsed: 96.219 sec  <<< FAILURE!
java.lang.AssertionError: Too many SWT resources were allocated in testSwtResourcesDelta:
before=628, after=676
	at org.junit.Assert.fail(Assert.java:88)
	at org.junit.Assert.assertTrue(Assert.java:41)
	at org.apache.directory.studio.test.integration.ui.SwtResourcesTest.testSwtResourcesDelta(SwtResourcesTest.java:108)

Running org.apache.directory.studio.test.integration.ui.SchemaBrowserTest
Tests run: 1, Failures: 0, Errors: 0, Skipped: 0, Time elapsed: 12.236 sec - in org.apache.directory.studio.test.integration.ui.SchemaBrowserTest
testRawSchemaDefinitionIsFilled(org.apache.directory.studio.test.integration.ui.SchemaBrowserTest)
 Time elapsed: 3.658 sec
Running org.apache.directory.studio.test.integration.ui.ReferralDialogTest
Tests run: 5, Failures: 0, Errors: 0, Skipped: 0, Time elapsed: 35.361 sec - in org.apache.directory.studio.test.integration.ui.ReferralDialogTest
testBrowseAndFollowManuallyContinuationReference(org.apache.directory.studio.test.integration.ui.ReferralDialogTest)
 Time elapsed: 5.414 sec
testBrowseAndFollowContinuationReference(org.apache.directory.studio.test.integration.ui.ReferralDialogTest)
 Time elapsed: 5.455 sec
testBrowseAndCancelFollowingContinuationReference(org.apache.directory.studio.test.integration.ui.ReferralDialogTest)
 Time elapsed: 4.737 sec
testBrowseAndIgnoreReferral(org.apache.directory.studio.test.integration.ui.ReferralDialogTest)
 Time elapsed: 4.131 sec
testBrowseAndManageReferralEntry(org.apache.directory.studio.test.integration.ui.ReferralDialogTest)
 Time elapsed: 4.746 sec
Running org.apache.directory.studio.test.integration.ui.PreferencesTest
Tests run: 2, Failures: 0, Errors: 0, Skipped: 0, Time elapsed: 10.226 sec - in org.apache.directory.studio.test.integration.ui.PreferencesTest
testCertificatValidationSettingsSaved(org.apache.directory.studio.test.integration.ui.PreferencesTest)
 Time elapsed: 0.683 sec
testCertificatValidationPage(org.apache.directory.studio.test.integration.ui.PreferencesTest)
 Time elapsed: 0.724 sec
Running org.apache.directory.studio.test.integration.ui.SearchTest
Tests run: 3, Failures: 0, Errors: 0, Skipped: 0, Time elapsed: 31.219 sec - in org.apache.directory.studio.test.integration.ui.SearchTest
testOnlyOneUiUpdateOnQuickSearch(org.apache.directory.studio.test.integration.ui.SearchTest)
 Time elapsed: 6.636 sec
testRefresh(org.apache.directory.studio.test.integration.ui.SearchTest)  Time elapsed: 8.311
sec
testCopyPasteSearchBetweenConnections(org.apache.directory.studio.test.integration.ui.SearchTest)
 Time elapsed: 7.411 sec
Running org.apache.directory.studio.test.integration.ui.RenameEntryDialogTest
Tests run: 4, Failures: 0, Errors: 0, Skipped: 0, Time elapsed: 38.129 sec - in org.apache.directory.studio.test.integration.ui.RenameEntryDialogTest
testRenameMultiValuedRdn(org.apache.directory.studio.test.integration.ui.RenameEntryDialogTest)
 Time elapsed: 6.351 sec
testRenameRdnWithEscapedCharacters(org.apache.directory.studio.test.integration.ui.RenameEntryDialogTest)
 Time elapsed: 6.079 sec
testRenameRdnWithTrailingSpace(org.apache.directory.studio.test.integration.ui.RenameEntryDialogTest)
 Time elapsed: 7.906 sec
testRenameRdnWithSharp(org.apache.directory.studio.test.integration.ui.RenameEntryDialogTest)
 Time elapsed: 6.252 sec
Running org.apache.directory.studio.test.integration.ui.NewEntryWizardTest
Tests run: 8, Failures: 0, Errors: 0, Skipped: 0, Time elapsed: 74.48 sec - in org.apache.directory.studio.test.integration.ui.NewEntryWizardTest
testCreatePersonEntry(org.apache.directory.studio.test.integration.ui.NewEntryWizardTest)
 Time elapsed: 6.639 sec
testCreateEntryBelowReferralObjectCancel(org.apache.directory.studio.test.integration.ui.NewEntryWizardTest)
 Time elapsed: 10.575 sec
testCreateEntryBelowReferralObjectFollow(org.apache.directory.studio.test.integration.ui.NewEntryWizardTest)
 Time elapsed: 6.743 sec
testCreateOrganizationEntry(org.apache.directory.studio.test.integration.ui.NewEntryWizardTest)
 Time elapsed: 6.42 sec
testCreateEntryWithSharp(org.apache.directory.studio.test.integration.ui.NewEntryWizardTest)
 Time elapsed: 6.552 sec
testCreateEntryWithSlash(org.apache.directory.studio.test.integration.ui.NewEntryWizardTest)
 Time elapsed: 6.654 sec
testCreateUpperCaseOrganizationEntries(org.apache.directory.studio.test.integration.ui.NewEntryWizardTest)
 Time elapsed: 7.972 sec
testCreateMvRdnWithNumericOid(org.apache.directory.studio.test.integration.ui.NewEntryWizardTest)
 Time elapsed: 6.297 sec

Results :

Failed tests: 
  SchemaEditorSearchTest.testSearchForAliases:80 
Expected: <1>
     but: was <0>
  BrowserTest.testSetInputOnlyOnce:614 expected:<uid=user.[2]> but was:<uid=user.[3]>
  SwtResourcesTest.testSwtResourcesDelta:108 Too many SWT resources were allocated in testSwtResourcesDelta:
before=628, after=676

Tests in error: 
  CertificateValidationTest.testLdapsCertificateTrustPermanent:379 » WidgetNotFound
  CertificateValidationTest.testStartTlsCertificateValidationNotYetValid:512 » WidgetNotFound
  CertificateValidationTest.testLdapsCertificateTrustTemporary:316 » Timeout Tim...
  CertificateValidationTest.testLdapsCertificateDoNotTrust:264 » WidgetNotFound ...
  CertificateValidationTest.testStartTlsCertificateValidationExpired:466 » Timeout
  CertificateValidationTest.testLdapsCertificateValidationNotOK:220 » Timeout Ti...
  CertificateValidationTest.testStartTlsCertificateTrustPermanent:733 » Timeout ...
  CertificateValidationTest.testStartTlsCertificateValidationOK:433 » Timeout Ti...
  CertificateValidationTest.testStartTlsCertificateValidationHostnameMismatch:558 » Timeout
  CertificateValidationTest.testLdapsCertificateValidationOK:187 » Timeout Timeo...
  CertificateValidationTest.testStartTlsCertificateDoNotTrust:596 » Timeout Time...
  NewConnectionWizardTest.testCheckAuthenticationButtonNotOK:491 » Timeout Timeo...
  NewConnectionWizardTest.testCreateConnection:335 » Timeout Timeout after: 5000...

Tests run: 228, Failures: 3, Errors: 13, Skipped: 0

[INFO] ------------------------------------------------------------------------
[INFO] Reactor Summary:
[INFO] 
[INFO] Apache Directory Studio Parent ..................... SUCCESS [  0.947 s]
[INFO] Apache Directory Studio Target Platform for Eclipse  SUCCESS [  0.140 s]
[INFO] Apache Directory Studio Plugins .................... SUCCESS [  0.746 s]
[INFO] Apache Directory Studio Common UI .................. SUCCESS [  2.597 s]
[INFO] Apache Directory Studio Common Core ................ SUCCESS [  0.210 s]
[INFO] Apache Directory Studio LDIF Parser ................ SUCCESS [  1.896 s]
[INFO] Apache Directory Studio Connection Core ............ SUCCESS [  0.990 s]
[INFO] Apache Directory Studio Connection UI .............. SUCCESS [  0.972 s]
[INFO] Apache Directory Studio LDAP Browser Core .......... SUCCESS [  2.816 s]
[INFO] Apache Directory Studio LDAP Browser Common ........ SUCCESS [  3.356 s]
[INFO] Apache Directory Studio Value Editors .............. SUCCESS [  1.718 s]
[INFO] Apache Directory Studio ACI Item Editor ............ SUCCESS [  0.787 s]
[INFO] Apache Directory Studio ApacheDS Configuration ..... SUCCESS [  0.768 s]
[INFO] Apache Directory Studio LDIF Editor ................ SUCCESS [  0.537 s]
[INFO] Apache Directory Studio LDAP Browser UI ............ SUCCESS [  1.325 s]
[INFO] Apache Directory Studio LDAP Servers ............... SUCCESS [  0.436 s]
[INFO] Apache Directory Studio ApacheDS LDAP Server Adapter SUCCESS [  3.065 s]
[INFO] Apache Directory Studio RCP ........................ SUCCESS [  0.464 s]
[INFO] Apache Directory Studio Schema Editor .............. SUCCESS [  2.752 s]
[INFO] Apache Directory Studio OpenLDAP Common UI ......... SUCCESS [  1.403 s]
[INFO] Apache Directory Studio OpenLDAP Syncrepl .......... SUCCESS [  1.053 s]
[INFO] Apache Directory Studio OpenLDAP Configuration Editor SUCCESS [  2.543 s]
[INFO] Apache Directory Studio OpenLDAP ACL Configuration Editor SUCCESS [  2.855 s]
[INFO] Apache Directory Studio Template Editor ............ SUCCESS [  2.232 s]
[INFO] Apache Directory Studio Combined Editor ............ SUCCESS [  0.370 s]
[INFO] Apache Directory Studio SLF4J to Eclipse Log Binding SUCCESS [  0.100 s]
[INFO] Apache Directory Studio Help Plugins ............... SUCCESS [  0.015 s]
[INFO] Apache Directory Studio Apache DS Help ............. SUCCESS [  4.225 s]
[INFO] Apache Directory Studio LDAP Browser Help .......... SUCCESS [  8.060 s]
[INFO] Apache Directory Studio LDIF Editor Help ........... SUCCESS [  1.787 s]
[INFO] Apache Directory Studio RCP Help ................... SUCCESS [  1.846 s]
[INFO] Apache Directory Studio Schema Editor Help ......... SUCCESS [  2.383 s]
[INFO] Apache Directory Studio Feature Plugins ............ SUCCESS [  0.026 s]
[INFO] Apache Directory Studio ApacheDS Feature ........... SUCCESS [  0.148 s]
[INFO] Apache Directory Studio LDAP Browser Feature ....... SUCCESS [  0.118 s]
[INFO] Apache Directory Studio LDIF Editor Feature ........ SUCCESS [  0.092 s]
[INFO] Apache Directory Studio RCP Feature ................ SUCCESS [  0.160 s]
[INFO] Apache Directory Studio Schema Editor Feature ...... SUCCESS [  0.091 s]
[INFO] Apache Directory Studio OpenLDAP Feature ........... SUCCESS [  0.092 s]
[INFO] Apache Directory Studio National Language Support Feature SUCCESS [  0.328 s]
[INFO] Apache Directory Studio Test Plugins ............... SUCCESS [  0.015 s]
[INFO] Apache Directory Studio Core Integration Tests ..... SUCCESS [05:40 min]
[INFO] Apache Directory Studio UI Integration Tests ....... FAILURE [18:10 min]
[INFO] Apache Directory Studio P2 Repositories ............ SKIPPED
[INFO] Apache Directory Studio P2 Repository Dependencies . SKIPPED
[INFO] Apache Directory Studio P2 Repository Eclipse ...... SKIPPED
[INFO] Apache Directory Studio Product .................... SKIPPED
[INFO] Apache Directory Studio Installers ................. SKIPPED
[INFO] ------------------------------------------------------------------------
[INFO] BUILD FAILURE
[INFO] ------------------------------------------------------------------------
[INFO] Total time: 29:19 min
[INFO] Finished at: 2017-10-11T14:47:16+00:00
[INFO] Final Memory: 286M/3783M
[INFO] ------------------------------------------------------------------------
[ERROR] Failed to execute goal org.eclipse.tycho:tycho-surefire-plugin:0.24.0:test (default-test)
on project org.apache.directory.studio.test.integration.ui: There are test failures.
[ERROR] 
[ERROR] Please refer to /home/hnelson/studio/tests/test.integration.ui/target/surefire-reports
for the individual test results.
[ERROR] -> [Help 1]
[ERROR] 
[ERROR] To see the full stack trace of the errors, re-run Maven with the -e switch.
[ERROR] Re-run Maven using the -X switch to enable full debug logging.
[ERROR] 
[ERROR] For more information about the errors and possible solutions, please read the following
articles:
[ERROR] [Help 1] http://cwiki.apache.org/confluence/display/MAVEN/MojoFailureException
[ERROR] 
[ERROR] After correcting the problems, you can resume the build with the command
[ERROR]   mvn <goals> -rf :org.apache.directory.studio.test.integration.ui
Build step 'Execute shell' marked build as failure
Recording test results

Mime
View raw message