directory-notifications mailing list archives

Site index · List index
Message view « Date » · « Thread »
Top « Date » · « Thread »
From Apache Jenkins Server <jenk...@builds.apache.org>
Subject Build failed in Jenkins: dir-studio-ui-tests-in-docker #78
Date Wed, 11 Oct 2017 14:16:26 GMT
See <https://builds.apache.org/job/dir-studio-ui-tests-in-docker/78/display/redirect?page=changes>

Changes:

[seelmann] Fix DIRSTUDIO-1157 (Values cannot be modified by text editor)

------------------------------------------
[...truncated 2.28 MB...]
	at org.apache.directory.studio.test.integration.ui.bots.ApacheDSServersViewBot.waitForServerStart(ApacheDSServersViewBot.java:209)
	at org.apache.directory.studio.test.integration.ui.CertificateValidationTest.testStartTlsCertificateDoNotTrust(CertificateValidationTest.java:596)

Running org.apache.directory.studio.test.integration.ui.NewEntryWizardTest
Tests run: 8, Failures: 0, Errors: 0, Skipped: 0, Time elapsed: 68.158 sec - in org.apache.directory.studio.test.integration.ui.NewEntryWizardTest
testCreatePersonEntry(org.apache.directory.studio.test.integration.ui.NewEntryWizardTest)
 Time elapsed: 6.252 sec
testCreateEntryBelowReferralObjectCancel(org.apache.directory.studio.test.integration.ui.NewEntryWizardTest)
 Time elapsed: 10.329 sec
testCreateEntryBelowReferralObjectFollow(org.apache.directory.studio.test.integration.ui.NewEntryWizardTest)
 Time elapsed: 6.13 sec
testCreateOrganizationEntry(org.apache.directory.studio.test.integration.ui.NewEntryWizardTest)
 Time elapsed: 6.007 sec
testCreateEntryWithSharp(org.apache.directory.studio.test.integration.ui.NewEntryWizardTest)
 Time elapsed: 5.906 sec
testCreateEntryWithSlash(org.apache.directory.studio.test.integration.ui.NewEntryWizardTest)
 Time elapsed: 6.229 sec
testCreateUpperCaseOrganizationEntries(org.apache.directory.studio.test.integration.ui.NewEntryWizardTest)
 Time elapsed: 7.643 sec
testCreateMvRdnWithNumericOid(org.apache.directory.studio.test.integration.ui.NewEntryWizardTest)
 Time elapsed: 6.09 sec
Running org.apache.directory.studio.test.integration.ui.RcpAppTest
Tests run: 12, Failures: 0, Errors: 0, Skipped: 0, Time elapsed: 11.739 sec - in org.apache.directory.studio.test.integration.ui.RcpAppTest
testLdapPerspectiveViews(org.apache.directory.studio.test.integration.ui.RcpAppTest)  Time
elapsed: 0.449 sec
testHiddenItemsInExportWizard(org.apache.directory.studio.test.integration.ui.RcpAppTest)
 Time elapsed: 0.409 sec
testHiddenPreferencePages(org.apache.directory.studio.test.integration.ui.RcpAppTest)  Time
elapsed: 0.34 sec
testHiddenItemsInNewWizard(org.apache.directory.studio.test.integration.ui.RcpAppTest)  Time
elapsed: 0.331 sec
testVisibleItemsInImportWizard(org.apache.directory.studio.test.integration.ui.RcpAppTest)
 Time elapsed: 0.317 sec
testVisibleItemsInExportWizard(org.apache.directory.studio.test.integration.ui.RcpAppTest)
 Time elapsed: 0.299 sec
testSchemaEditorPerspectiveViews(org.apache.directory.studio.test.integration.ui.RcpAppTest)
 Time elapsed: 0.527 sec
testVisibleItemsInOpenViewsDialog(org.apache.directory.studio.test.integration.ui.RcpAppTest)
 Time elapsed: 0.427 sec
testHiddenItemsInImportWizard(org.apache.directory.studio.test.integration.ui.RcpAppTest)
 Time elapsed: 0.278 sec
testHiddenItemsInOpenViewsDialog(org.apache.directory.studio.test.integration.ui.RcpAppTest)
 Time elapsed: 0.251 sec
testVisibleItemsInNewWizard(org.apache.directory.studio.test.integration.ui.RcpAppTest)  Time
elapsed: 0.308 sec
testVisiblePreferencePages(org.apache.directory.studio.test.integration.ui.RcpAppTest)  Time
elapsed: 0.425 sec
Running org.apache.directory.studio.test.integration.ui.BrowserTest
Tests run: 12, Failures: 1, Errors: 0, Skipped: 0, Time elapsed: 112.654 sec <<<
FAILURE! - in org.apache.directory.studio.test.integration.ui.BrowserTest
testBookmark(org.apache.directory.studio.test.integration.ui.BrowserTest)  Time elapsed: 3.79
sec
testRefreshRootDSE(org.apache.directory.studio.test.integration.ui.BrowserTest)  Time elapsed:
11.667 sec
testSetInputOnlyOnce(org.apache.directory.studio.test.integration.ui.BrowserTest)  Time elapsed:
8.183 sec  <<< FAILURE!
org.junit.ComparisonFailure: expected:<uid=user.[2]> but was:<uid=user.[3]>
	at org.junit.Assert.assertEquals(Assert.java:115)
	at org.junit.Assert.assertEquals(Assert.java:144)
	at org.apache.directory.studio.test.integration.ui.BrowserTest.testSetInputOnlyOnce(BrowserTest.java:614)

testBrowseDnWithIpHostNumber(org.apache.directory.studio.test.integration.ui.BrowserTest)
 Time elapsed: 4.913 sec
testRefreshParent(org.apache.directory.studio.test.integration.ui.BrowserTest)  Time elapsed:
7.867 sec
testCopyPasteValueToBookmark(org.apache.directory.studio.test.integration.ui.BrowserTest)
 Time elapsed: 6.225 sec
testRefreshSearchContinuation(org.apache.directory.studio.test.integration.ui.BrowserTest)
 Time elapsed: 9.959 sec
testDeleteDontUpdateUI(org.apache.directory.studio.test.integration.ui.BrowserTest)  Time
elapsed: 8.623 sec
testBrowseDnWithSharpAndHexSequence(org.apache.directory.studio.test.integration.ui.BrowserTest)
 Time elapsed: 4.626 sec
testNoModificationWhileBrowsingAndRefreshing(org.apache.directory.studio.test.integration.ui.BrowserTest)
 Time elapsed: 15.657 sec
testRefreshContextEntry(org.apache.directory.studio.test.integration.ui.BrowserTest)  Time
elapsed: 8.73 sec
testOnlyOneSearchRequestWhenExpandingEntry(org.apache.directory.studio.test.integration.ui.BrowserTest)
 Time elapsed: 4.072 sec
Running org.apache.directory.studio.test.integration.ui.SchemaEditorSearchTest
Tests run: 1, Failures: 1, Errors: 0, Skipped: 0, Time elapsed: 8.023 sec <<< FAILURE!
- in org.apache.directory.studio.test.integration.ui.SchemaEditorSearchTest
testSearchForAliases(org.apache.directory.studio.test.integration.ui.SchemaEditorSearchTest)
 Time elapsed: 0.703 sec  <<< FAILURE!
java.lang.AssertionError: 
Expected: <1>
     but: was <0>
	at org.hamcrest.MatcherAssert.assertThat(MatcherAssert.java:20)
	at org.hamcrest.MatcherAssert.assertThat(MatcherAssert.java:8)
	at org.apache.directory.studio.test.integration.ui.SchemaEditorSearchTest.testSearchForAliases(SchemaEditorSearchTest.java:80)

Running org.apache.directory.studio.test.integration.ui.ProgressViewTest
Tests run: 2, Failures: 0, Errors: 0, Skipped: 0, Time elapsed: 15.806 sec - in org.apache.directory.studio.test.integration.ui.ProgressViewTest
testNoRemainingOpenConnectionJobs(org.apache.directory.studio.test.integration.ui.ProgressViewTest)
 Time elapsed: 8.731 sec
testRemoveAllFinishedOperations(org.apache.directory.studio.test.integration.ui.ProgressViewTest)
 Time elapsed: 0.284 sec
Running org.apache.directory.studio.test.integration.ui.SchemaBrowserTest
Tests run: 1, Failures: 0, Errors: 0, Skipped: 0, Time elapsed: 10.7 sec - in org.apache.directory.studio.test.integration.ui.SchemaBrowserTest
testRawSchemaDefinitionIsFilled(org.apache.directory.studio.test.integration.ui.SchemaBrowserTest)
 Time elapsed: 3.77 sec
Running org.apache.directory.studio.test.integration.ui.RenameEntryDialogTest
Tests run: 4, Failures: 2, Errors: 0, Skipped: 0, Time elapsed: 30.216 sec <<< FAILURE!
- in org.apache.directory.studio.test.integration.ui.RenameEntryDialogTest
testRenameMultiValuedRdn(org.apache.directory.studio.test.integration.ui.RenameEntryDialogTest)
 Time elapsed: 6.354 sec
testRenameRdnWithEscapedCharacters(org.apache.directory.studio.test.integration.ui.RenameEntryDialogTest)
 Time elapsed: 5.98 sec
testRenameRdnWithTrailingSpace(org.apache.directory.studio.test.integration.ui.RenameEntryDialogTest)
 Time elapsed: 4.534 sec  <<< FAILURE!
java.lang.AssertionError: null
	at org.junit.Assert.fail(Assert.java:86)
	at org.junit.Assert.assertTrue(Assert.java:41)
	at org.junit.Assert.assertTrue(Assert.java:52)
	at org.apache.directory.studio.test.integration.ui.RenameEntryDialogTest.testRenameRdnWithTrailingSpace(RenameEntryDialogTest.java:159)

testRenameRdnWithSharp(org.apache.directory.studio.test.integration.ui.RenameEntryDialogTest)
 Time elapsed: 4.56 sec  <<< FAILURE!
java.lang.AssertionError: null
	at org.junit.Assert.fail(Assert.java:86)
	at org.junit.Assert.assertTrue(Assert.java:41)
	at org.junit.Assert.assertTrue(Assert.java:52)
	at org.apache.directory.studio.test.integration.ui.RenameEntryDialogTest.testRenameRdnWithSharp(RenameEntryDialogTest.java:139)

Running org.apache.directory.studio.test.integration.ui.GssApiTest
Tests run: 2, Failures: 0, Errors: 0, Skipped: 0, Time elapsed: 57.129 sec - in org.apache.directory.studio.test.integration.ui.GssApiTest
testGssApiObtainTgtAndUseManualConfigurationAndObtainServiceTicket(org.apache.directory.studio.test.integration.ui.GssApiTest)
 Time elapsed: 24.517 sec
testGssApiUseNativeTgtAndNativeConfigurationAndObtainServiceTicket(org.apache.directory.studio.test.integration.ui.GssApiTest)
 Time elapsed: 24.632 sec
Running org.apache.directory.studio.test.integration.ui.LdifEditorTest
Tests run: 1, Failures: 1, Errors: 0, Skipped: 0, Time elapsed: 9.609 sec <<< FAILURE!
- in org.apache.directory.studio.test.integration.ui.LdifEditorTest
testNewLdifEditor(org.apache.directory.studio.test.integration.ui.LdifEditorTest)  Time elapsed:
2.501 sec  <<< FAILURE!
java.lang.AssertionError: null
	at org.junit.Assert.fail(Assert.java:86)
	at org.junit.Assert.assertTrue(Assert.java:41)
	at org.junit.Assert.assertTrue(Assert.java:52)
	at org.apache.directory.studio.test.integration.ui.LdifEditorTest.testNewLdifEditor(LdifEditorTest.java:81)


Results :

Failed tests: 
  ApacheDSPluginTest.verifyServerNameCollisionInNewWizard:191 expected:<0> but was:<1>
  ApacheDSPluginTest.testSetEnabledProtocols:436->createServer:154 expected:<0> but
was:<1>
  ApacheDSPluginTest.serverCreationStartCreateConnectionStopAndDeletion:92->createServer:154
expected:<0> but was:<1>
  BrowserTest.testSetInputOnlyOnce:614 expected:<uid=user.[2]> but was:<uid=user.[3]>
  SchemaEditorSearchTest.testSearchForAliases:80 
Expected: <1>
     but: was <0>
  RenameEntryDialogTest.testRenameRdnWithTrailingSpace:159 null
  RenameEntryDialogTest.testRenameRdnWithSharp:139 null
  LdifEditorTest.testNewLdifEditor:81 null

Tests in error: 
  ApacheDSPluginTest.repairAndStartAndStop:415 » Timeout Timeout after: 60000 ms...
  CertificateValidationTest.testLdapsCertificateTrustPermanent:365 » Timeout Tim...
  CertificateValidationTest.testStartTlsCertificateValidationNotYetValid:503 » Timeout
  CertificateValidationTest.testLdapsCertificateTrustTemporary:316 » Timeout Tim...
  CertificateValidationTest.testLdapsCertificateDoNotTrust:255 » Timeout Timeout...
  CertificateValidationTest.testStartTlsCertificateValidationExpired:458 » Timeout
  CertificateValidationTest.testLdapsCertificateValidationNotOK:212 » Timeout Ti...
  CertificateValidationTest.testStartTlsCertificateTrustPermanent:725 » Timeout ...
  CertificateValidationTest.testStartTlsCertificateValidationOK:414 » Timeout Ti...
  CertificateValidationTest.testStartTlsCertificateValidationHostnameMismatch:550 » Timeout
  CertificateValidationTest.testLdapsCertificateValidationOK:174 » Timeout Timeo...
  CertificateValidationTest.testStartTlsCertificateDoNotTrust:596 » Timeout Time...

Tests run: 228, Failures: 8, Errors: 12, Skipped: 0

Caught unexpected exception during test framework shutdown
org.eclipse.swt.SWTException: Failed to execute runnable (org.eclipse.swt.SWTException: Widget
is disposed)
	at org.eclipse.swt.SWT.error(SWT.java:4533)
	at org.eclipse.swt.SWT.error(SWT.java:4448)
	at org.eclipse.swt.widgets.Synchronizer.runAsyncMessages(Synchronizer.java:185)
	at org.eclipse.swt.widgets.Display.runAsyncMessages(Display.java:4536)
	at org.eclipse.swt.widgets.Display.readAndDispatch(Display.java:4154)
	at org.eclipse.swt.widgets.Display.release(Display.java:4206)
	at org.eclipse.swt.graphics.Device.dispose(Device.java:266)
	at org.apache.directory.studio.Application.start(Application.java:63)
	at org.eclipse.tycho.surefire.osgibooter.UITestApplication.runApplication(UITestApplication.java:31)
	at org.eclipse.tycho.surefire.osgibooter.AbstractUITestApplication.run(AbstractUITestApplication.java:120)
	at org.eclipse.tycho.surefire.osgibooter.UITestApplication.start(UITestApplication.java:37)
	at org.eclipse.equinox.internal.app.EclipseAppHandle.run(EclipseAppHandle.java:196)
	at org.eclipse.core.runtime.internal.adaptor.EclipseAppLauncher.runApplication(EclipseAppLauncher.java:134)
	at org.eclipse.core.runtime.internal.adaptor.EclipseAppLauncher.start(EclipseAppLauncher.java:104)
	at org.eclipse.core.runtime.adaptor.EclipseStarter.run(EclipseStarter.java:388)
	at org.eclipse.core.runtime.adaptor.EclipseStarter.run(EclipseStarter.java:243)
	at sun.reflect.NativeMethodAccessorImpl.invoke0(Native Method)
	at sun.reflect.NativeMethodAccessorImpl.invoke(NativeMethodAccessorImpl.java:62)
	at sun.reflect.DelegatingMethodAccessorImpl.invoke(DelegatingMethodAccessorImpl.java:43)
	at java.lang.reflect.Method.invoke(Method.java:498)
	at org.eclipse.equinox.launcher.Main.invokeFramework(Main.java:673)
	at org.eclipse.equinox.launcher.Main.basicRun(Main.java:610)
	at org.eclipse.equinox.launcher.Main.run(Main.java:1519)
	at org.eclipse.equinox.launcher.Main.main(Main.java:1492)
Caused by: org.eclipse.swt.SWTException: Widget is disposed
	at org.eclipse.swt.SWT.error(SWT.java:4533)
	at org.eclipse.swt.SWT.error(SWT.java:4448)
	at org.eclipse.swt.SWT.error(SWT.java:4419)
	at org.eclipse.swt.widgets.Widget.error(Widget.java:483)
	at org.eclipse.swt.widgets.Widget.checkWidget(Widget.java:420)
	at org.eclipse.swt.widgets.Tree.getSelection(Tree.java:1775)
	at org.eclipse.jface.viewers.TreeViewer.getSelection(TreeViewer.java:228)
	at org.eclipse.jface.viewers.TreeViewer.setSelection(TreeViewer.java:299)
	at org.eclipse.jface.viewers.AbstractTreeViewer.setSelectionToWidget(AbstractTreeViewer.java:2533)
	at org.eclipse.jface.viewers.AbstractTreeViewer.setSelectionToWidget(AbstractTreeViewer.java:2989)
	at org.eclipse.jface.viewers.StructuredViewer.preservingSelection(StructuredViewer.java:1465)
	at org.eclipse.jface.viewers.TreeViewer.preservingSelection(TreeViewer.java:354)
	at org.eclipse.jface.viewers.StructuredViewer.preservingSelection(StructuredViewer.java:1419)
	at org.eclipse.jface.viewers.StructuredViewer.refresh(StructuredViewer.java:1519)
	at org.eclipse.jface.viewers.ColumnViewer.refresh(ColumnViewer.java:523)
	at org.apache.directory.studio.ldapservers.views.ServersTableViewer$4.run(ServersTableViewer.java:251)
	at org.eclipse.swt.widgets.RunnableLock.run(RunnableLock.java:35)
	at org.eclipse.swt.widgets.Synchronizer.runAsyncMessages(Synchronizer.java:182)
	... 21 more
Job found still running after platform shutdown.  Jobs should be canceled by the plugin that
scheduled them during shutdown: org.apache.directory.studio.ldapservers.jobs.StudioLdapServerJob
Job found still running after platform shutdown.  Jobs should be canceled by the plugin that
scheduled them during shutdown: org.eclipse.ui.internal.console.IOConsolePartitioner$QueueProcessingJob
Job found still running after platform shutdown.  Jobs should be canceled by the plugin that
scheduled them during shutdown: org.eclipse.ui.internal.progress.AnimationManager$1
Job found still running after platform shutdown.  Jobs should be canceled by the plugin that
scheduled them during shutdown: org.eclipse.ui.internal.console.ConsoleManager$1
Job found still running after platform shutdown.  Jobs should be canceled by the plugin that
scheduled them during shutdown: org.eclipse.debug.internal.ui.launchConfigurations.PerspectiveManager$2
[INFO] ------------------------------------------------------------------------
[INFO] Reactor Summary:
[INFO] 
[INFO] Apache Directory Studio Parent ..................... SUCCESS [  0.911 s]
[INFO] Apache Directory Studio Target Platform for Eclipse  SUCCESS [  0.121 s]
[INFO] Apache Directory Studio Plugins .................... SUCCESS [  0.648 s]
[INFO] Apache Directory Studio Common UI .................. SUCCESS [  2.692 s]
[INFO] Apache Directory Studio Common Core ................ SUCCESS [  0.204 s]
[INFO] Apache Directory Studio LDIF Parser ................ SUCCESS [  1.737 s]
[INFO] Apache Directory Studio Connection Core ............ SUCCESS [  0.965 s]
[INFO] Apache Directory Studio Connection UI .............. SUCCESS [  0.740 s]
[INFO] Apache Directory Studio LDAP Browser Core .......... SUCCESS [  2.892 s]
[INFO] Apache Directory Studio LDAP Browser Common ........ SUCCESS [  2.580 s]
[INFO] Apache Directory Studio Value Editors .............. SUCCESS [  1.767 s]
[INFO] Apache Directory Studio ACI Item Editor ............ SUCCESS [  0.573 s]
[INFO] Apache Directory Studio ApacheDS Configuration ..... SUCCESS [  0.736 s]
[INFO] Apache Directory Studio LDIF Editor ................ SUCCESS [  0.470 s]
[INFO] Apache Directory Studio LDAP Browser UI ............ SUCCESS [  1.232 s]
[INFO] Apache Directory Studio LDAP Servers ............... SUCCESS [  0.422 s]
[INFO] Apache Directory Studio ApacheDS LDAP Server Adapter SUCCESS [  2.761 s]
[INFO] Apache Directory Studio RCP ........................ SUCCESS [  0.333 s]
[INFO] Apache Directory Studio Schema Editor .............. SUCCESS [  2.781 s]
[INFO] Apache Directory Studio OpenLDAP Common UI ......... SUCCESS [  1.449 s]
[INFO] Apache Directory Studio OpenLDAP Syncrepl .......... SUCCESS [  1.100 s]
[INFO] Apache Directory Studio OpenLDAP Configuration Editor SUCCESS [  2.376 s]
[INFO] Apache Directory Studio OpenLDAP ACL Configuration Editor SUCCESS [  2.604 s]
[INFO] Apache Directory Studio Template Editor ............ SUCCESS [  2.385 s]
[INFO] Apache Directory Studio Combined Editor ............ SUCCESS [  0.354 s]
[INFO] Apache Directory Studio SLF4J to Eclipse Log Binding SUCCESS [  0.107 s]
[INFO] Apache Directory Studio Help Plugins ............... SUCCESS [  0.014 s]
[INFO] Apache Directory Studio Apache DS Help ............. SUCCESS [  4.175 s]
[INFO] Apache Directory Studio LDAP Browser Help .......... SUCCESS [  7.489 s]
[INFO] Apache Directory Studio LDIF Editor Help ........... SUCCESS [  1.476 s]
[INFO] Apache Directory Studio RCP Help ................... SUCCESS [  1.524 s]
[INFO] Apache Directory Studio Schema Editor Help ......... SUCCESS [  1.948 s]
[INFO] Apache Directory Studio Feature Plugins ............ SUCCESS [  0.011 s]
[INFO] Apache Directory Studio ApacheDS Feature ........... SUCCESS [  0.154 s]
[INFO] Apache Directory Studio LDAP Browser Feature ....... SUCCESS [  0.118 s]
[INFO] Apache Directory Studio LDIF Editor Feature ........ SUCCESS [  0.093 s]
[INFO] Apache Directory Studio RCP Feature ................ SUCCESS [  0.165 s]
[INFO] Apache Directory Studio Schema Editor Feature ...... SUCCESS [  0.090 s]
[INFO] Apache Directory Studio OpenLDAP Feature ........... SUCCESS [  0.085 s]
[INFO] Apache Directory Studio National Language Support Feature SUCCESS [  0.332 s]
[INFO] Apache Directory Studio Test Plugins ............... SUCCESS [  0.013 s]
[INFO] Apache Directory Studio Core Integration Tests ..... SUCCESS [04:29 min]
[INFO] Apache Directory Studio UI Integration Tests ....... FAILURE [24:14 min]
[INFO] Apache Directory Studio P2 Repositories ............ SKIPPED
[INFO] Apache Directory Studio P2 Repository Dependencies . SKIPPED
[INFO] Apache Directory Studio P2 Repository Eclipse ...... SKIPPED
[INFO] Apache Directory Studio Product .................... SKIPPED
[INFO] Apache Directory Studio Installers ................. SKIPPED
[INFO] ------------------------------------------------------------------------
[INFO] BUILD FAILURE
[INFO] ------------------------------------------------------------------------
[INFO] Total time: 33:27 min
[INFO] Finished at: 2017-10-11T14:16:20+00:00
[INFO] Final Memory: 272M/4129M
[INFO] ------------------------------------------------------------------------
[ERROR] Failed to execute goal org.eclipse.tycho:tycho-surefire-plugin:0.24.0:test (default-test)
on project org.apache.directory.studio.test.integration.ui: There are test failures.
[ERROR] 
[ERROR] Please refer to /home/hnelson/studio/tests/test.integration.ui/target/surefire-reports
for the individual test results.
[ERROR] -> [Help 1]
[ERROR] 
[ERROR] To see the full stack trace of the errors, re-run Maven with the -e switch.
[ERROR] Re-run Maven using the -X switch to enable full debug logging.
[ERROR] 
[ERROR] For more information about the errors and possible solutions, please read the following
articles:
[ERROR] [Help 1] http://cwiki.apache.org/confluence/display/MAVEN/MojoFailureException
[ERROR] 
[ERROR] After correcting the problems, you can resume the build with the command
[ERROR]   mvn <goals> -rf :org.apache.directory.studio.test.integration.ui
Build step 'Execute shell' marked build as failure
Recording test results

Mime
View raw message