directory-notifications mailing list archives

Site index · List index
Message view « Date » · « Thread »
Top « Date » · « Thread »
From Apache Jenkins Server <jenk...@builds.apache.org>
Subject Build failed in Jenkins: dir-studio-ui-tests-in-docker #76
Date Wed, 20 Sep 2017 14:12:37 GMT
See <https://builds.apache.org/job/dir-studio-ui-tests-in-docker/76/display/redirect>

------------------------------------------
[...truncated 1.85 MB...]
	at org.eclipse.swtbot.swt.finder.SWTBotFactory.waitUntil(SWTBotFactory.java:522)
	at org.eclipse.swtbot.swt.finder.SWTBotFactory.waitUntil(SWTBotFactory.java:496)
	at org.eclipse.swtbot.swt.finder.SWTBotFactory.waitUntil(SWTBotFactory.java:484)
	at org.eclipse.swtbot.swt.finder.widgets.AbstractSWTBot.waitForEnabled(AbstractSWTBot.java:650)
	at org.eclipse.swtbot.swt.finder.widgets.SWTBotButton.click(SWTBotButton.java:65)
	at org.apache.directory.studio.test.integration.ui.bots.DialogBot.clickButton(DialogBot.java:69)
	at org.apache.directory.studio.test.integration.ui.bots.WizardBot.clickNextButton(WizardBot.java:75)
	at org.apache.directory.studio.test.integration.ui.NewConnectionWizardTest.testCreateConnection(NewConnectionWizardTest.java:335)

testCheckNetworkParameterButtonNotOK(org.apache.directory.studio.test.integration.ui.NewConnectionWizardTest)
 Time elapsed: 11.591 sec
testCheckAuthenticationButtonOK(org.apache.directory.studio.test.integration.ui.NewConnectionWizardTest)
 Time elapsed: 0.545 sec  <<< FAILURE!
java.lang.AssertionError: Expected OK expected null, but was:<The authentication failed
 - localhost:1025
 - No connection>
	at org.junit.Assert.fail(Assert.java:88)
	at org.junit.Assert.failNotNull(Assert.java:755)
	at org.junit.Assert.assertNull(Assert.java:737)
	at org.apache.directory.studio.test.integration.ui.NewConnectionWizardTest.testCheckAuthenticationButtonOK(NewConnectionWizardTest.java:475)

testCheckNetworkParameterButtonOK(org.apache.directory.studio.test.integration.ui.NewConnectionWizardTest)
 Time elapsed: 0.594 sec
testEnabledDisabledWidgets(org.apache.directory.studio.test.integration.ui.NewConnectionWizardTest)
 Time elapsed: 0.719 sec
Running org.apache.directory.studio.test.integration.ui.ApacheDSPluginTest
Tests run: 5, Failures: 3, Errors: 1, Skipped: 0, Time elapsed: 99.042 sec <<< FAILURE!
- in org.apache.directory.studio.test.integration.ui.ApacheDSPluginTest
editRemoteConfig(org.apache.directory.studio.test.integration.ui.ApacheDSPluginTest)  Time
elapsed: 20.8 sec
repairAndStartAndStop(org.apache.directory.studio.test.integration.ui.ApacheDSPluginTest)
 Time elapsed: 68.112 sec  <<< ERROR!
org.eclipse.swtbot.swt.finder.widgets.TimeoutException: Timeout after: 60000 ms.: Server Repair
not started in servers view.
	at org.eclipse.swtbot.swt.finder.SWTBotFactory.waitUntil(SWTBotFactory.java:522)
	at org.eclipse.swtbot.swt.finder.SWTBotFactory.waitUntil(SWTBotFactory.java:496)
	at org.apache.directory.studio.test.integration.ui.bots.ApacheDSServersViewBot.waitForServerStart(ApacheDSServersViewBot.java:209)
	at org.apache.directory.studio.test.integration.ui.ApacheDSPluginTest.repairAndStartAndStop(ApacheDSPluginTest.java:415)

verifyServerNameCollisionInNewWizard(org.apache.directory.studio.test.integration.ui.ApacheDSPluginTest)
 Time elapsed: 0.479 sec  <<< FAILURE!
java.lang.AssertionError: expected:<0> but was:<1>
	at org.junit.Assert.fail(Assert.java:88)
	at org.junit.Assert.failNotEquals(Assert.java:834)
	at org.junit.Assert.assertEquals(Assert.java:645)
	at org.junit.Assert.assertEquals(Assert.java:631)
	at org.apache.directory.studio.test.integration.ui.ApacheDSPluginTest.verifyServerNameCollisionInNewWizard(ApacheDSPluginTest.java:191)

testSetEnabledProtocols(org.apache.directory.studio.test.integration.ui.ApacheDSPluginTest)
 Time elapsed: 0.458 sec  <<< FAILURE!
java.lang.AssertionError: expected:<0> but was:<1>
	at org.junit.Assert.fail(Assert.java:88)
	at org.junit.Assert.failNotEquals(Assert.java:834)
	at org.junit.Assert.assertEquals(Assert.java:645)
	at org.junit.Assert.assertEquals(Assert.java:631)
	at org.apache.directory.studio.test.integration.ui.ApacheDSPluginTest.createServer(ApacheDSPluginTest.java:154)
	at org.apache.directory.studio.test.integration.ui.ApacheDSPluginTest.testSetEnabledProtocols(ApacheDSPluginTest.java:436)

serverCreationStartCreateConnectionStopAndDeletion(org.apache.directory.studio.test.integration.ui.ApacheDSPluginTest)
 Time elapsed: 0.468 sec  <<< FAILURE!
java.lang.AssertionError: expected:<0> but was:<1>
	at org.junit.Assert.fail(Assert.java:88)
	at org.junit.Assert.failNotEquals(Assert.java:834)
	at org.junit.Assert.assertEquals(Assert.java:645)
	at org.junit.Assert.assertEquals(Assert.java:631)
	at org.apache.directory.studio.test.integration.ui.ApacheDSPluginTest.createServer(ApacheDSPluginTest.java:154)
	at org.apache.directory.studio.test.integration.ui.ApacheDSPluginTest.serverCreationStartCreateConnectionStopAndDeletion(ApacheDSPluginTest.java:92)

Running org.apache.directory.studio.test.integration.ui.BrowserTest
Tests run: 12, Failures: 1, Errors: 0, Skipped: 0, Time elapsed: 114.988 sec <<<
FAILURE! - in org.apache.directory.studio.test.integration.ui.BrowserTest
testBookmark(org.apache.directory.studio.test.integration.ui.BrowserTest)  Time elapsed: 3.67
sec
testRefreshRootDSE(org.apache.directory.studio.test.integration.ui.BrowserTest)  Time elapsed:
11.874 sec
testSetInputOnlyOnce(org.apache.directory.studio.test.integration.ui.BrowserTest)  Time elapsed:
7.21 sec  <<< FAILURE!
org.junit.ComparisonFailure: expected:<uid=user.[2]> but was:<uid=user.[3]>
	at org.junit.Assert.assertEquals(Assert.java:115)
	at org.junit.Assert.assertEquals(Assert.java:144)
	at org.apache.directory.studio.test.integration.ui.BrowserTest.testSetInputOnlyOnce(BrowserTest.java:614)

testBrowseDnWithIpHostNumber(org.apache.directory.studio.test.integration.ui.BrowserTest)
 Time elapsed: 4.666 sec
testRefreshParent(org.apache.directory.studio.test.integration.ui.BrowserTest)  Time elapsed:
7.995 sec
testCopyPasteValueToBookmark(org.apache.directory.studio.test.integration.ui.BrowserTest)
 Time elapsed: 5.442 sec
testRefreshSearchContinuation(org.apache.directory.studio.test.integration.ui.BrowserTest)
 Time elapsed: 9.973 sec
testDeleteDontUpdateUI(org.apache.directory.studio.test.integration.ui.BrowserTest)  Time
elapsed: 9.028 sec
testBrowseDnWithSharpAndHexSequence(org.apache.directory.studio.test.integration.ui.BrowserTest)
 Time elapsed: 4.295 sec
testNoModificationWhileBrowsingAndRefreshing(org.apache.directory.studio.test.integration.ui.BrowserTest)
 Time elapsed: 15.317 sec
testRefreshContextEntry(org.apache.directory.studio.test.integration.ui.BrowserTest)  Time
elapsed: 8.568 sec
testOnlyOneSearchRequestWhenExpandingEntry(org.apache.directory.studio.test.integration.ui.BrowserTest)
 Time elapsed: 3.797 sec
Running org.apache.directory.studio.test.integration.ui.SwtResourcesTest
### SWT resouces count: 587
Tests run: 2, Failures: 1, Errors: 0, Skipped: 0, Time elapsed: 125.086 sec <<< FAILURE!
- in org.apache.directory.studio.test.integration.ui.SwtResourcesTest
testSwtResourcesCount(org.apache.directory.studio.test.integration.ui.SwtResourcesTest)  Time
elapsed: 2.638 sec
testSwtResourcesDelta(org.apache.directory.studio.test.integration.ui.SwtResourcesTest)  Time
elapsed: 87.379 sec  <<< FAILURE!
java.lang.AssertionError: Too many SWT resources were allocated in testSwtResourcesDelta:
before=619, after=667
	at org.junit.Assert.fail(Assert.java:88)
	at org.junit.Assert.assertTrue(Assert.java:41)
	at org.apache.directory.studio.test.integration.ui.SwtResourcesTest.testSwtResourcesDelta(SwtResourcesTest.java:108)

Running org.apache.directory.studio.test.integration.ui.SchemaBrowserTest
Tests run: 1, Failures: 0, Errors: 0, Skipped: 0, Time elapsed: 16.758 sec - in org.apache.directory.studio.test.integration.ui.SchemaBrowserTest
testRawSchemaDefinitionIsFilled(org.apache.directory.studio.test.integration.ui.SchemaBrowserTest)
 Time elapsed: 3.816 sec
Running org.apache.directory.studio.test.integration.ui.ReferralDialogTest
Tests run: 5, Failures: 0, Errors: 0, Skipped: 0, Time elapsed: 39.512 sec - in org.apache.directory.studio.test.integration.ui.ReferralDialogTest
testBrowseAndFollowManuallyContinuationReference(org.apache.directory.studio.test.integration.ui.ReferralDialogTest)
 Time elapsed: 5.168 sec
testBrowseAndFollowContinuationReference(org.apache.directory.studio.test.integration.ui.ReferralDialogTest)
 Time elapsed: 6.178 sec
testBrowseAndCancelFollowingContinuationReference(org.apache.directory.studio.test.integration.ui.ReferralDialogTest)
 Time elapsed: 4.57 sec
testBrowseAndIgnoreReferral(org.apache.directory.studio.test.integration.ui.ReferralDialogTest)
 Time elapsed: 4.187 sec
testBrowseAndManageReferralEntry(org.apache.directory.studio.test.integration.ui.ReferralDialogTest)
 Time elapsed: 5.445 sec
Running org.apache.directory.studio.test.integration.ui.PreferencesTest
Tests run: 2, Failures: 0, Errors: 0, Skipped: 0, Time elapsed: 11.963 sec - in org.apache.directory.studio.test.integration.ui.PreferencesTest
testCertificatValidationSettingsSaved(org.apache.directory.studio.test.integration.ui.PreferencesTest)
 Time elapsed: 0.664 sec
testCertificatValidationPage(org.apache.directory.studio.test.integration.ui.PreferencesTest)
 Time elapsed: 1.031 sec
Running org.apache.directory.studio.test.integration.ui.SearchTest
Tests run: 3, Failures: 0, Errors: 0, Skipped: 0, Time elapsed: 31.666 sec - in org.apache.directory.studio.test.integration.ui.SearchTest
testOnlyOneUiUpdateOnQuickSearch(org.apache.directory.studio.test.integration.ui.SearchTest)
 Time elapsed: 5.998 sec
testRefresh(org.apache.directory.studio.test.integration.ui.SearchTest)  Time elapsed: 7.533
sec
testCopyPasteSearchBetweenConnections(org.apache.directory.studio.test.integration.ui.SearchTest)
 Time elapsed: 7.518 sec
Running org.apache.directory.studio.test.integration.ui.RenameEntryDialogTest
Tests run: 4, Failures: 3, Errors: 0, Skipped: 0, Time elapsed: 33.216 sec <<< FAILURE!
- in org.apache.directory.studio.test.integration.ui.RenameEntryDialogTest
testRenameMultiValuedRdn(org.apache.directory.studio.test.integration.ui.RenameEntryDialogTest)
 Time elapsed: 6.214 sec
testRenameRdnWithEscapedCharacters(org.apache.directory.studio.test.integration.ui.RenameEntryDialogTest)
 Time elapsed: 4.633 sec  <<< FAILURE!
java.lang.AssertionError: null
	at org.junit.Assert.fail(Assert.java:86)
	at org.junit.Assert.assertTrue(Assert.java:41)
	at org.junit.Assert.assertTrue(Assert.java:52)
	at org.apache.directory.studio.test.integration.ui.RenameEntryDialogTest.testRenameRdnWithEscapedCharacters(RenameEntryDialogTest.java:117)

testRenameRdnWithTrailingSpace(org.apache.directory.studio.test.integration.ui.RenameEntryDialogTest)
 Time elapsed: 5.841 sec  <<< FAILURE!
java.lang.AssertionError: null
	at org.junit.Assert.fail(Assert.java:86)
	at org.junit.Assert.assertTrue(Assert.java:41)
	at org.junit.Assert.assertTrue(Assert.java:52)
	at org.apache.directory.studio.test.integration.ui.RenameEntryDialogTest.testRenameRdnWithTrailingSpace(RenameEntryDialogTest.java:167)

testRenameRdnWithSharp(org.apache.directory.studio.test.integration.ui.RenameEntryDialogTest)
 Time elapsed: 4.682 sec  <<< FAILURE!
java.lang.AssertionError: null
	at org.junit.Assert.fail(Assert.java:86)
	at org.junit.Assert.assertTrue(Assert.java:41)
	at org.junit.Assert.assertTrue(Assert.java:52)
	at org.apache.directory.studio.test.integration.ui.RenameEntryDialogTest.testRenameRdnWithSharp(RenameEntryDialogTest.java:139)

Running org.apache.directory.studio.test.integration.ui.NewEntryWizardTest
Tests run: 8, Failures: 0, Errors: 0, Skipped: 0, Time elapsed: 78.129 sec - in org.apache.directory.studio.test.integration.ui.NewEntryWizardTest
testCreatePersonEntry(org.apache.directory.studio.test.integration.ui.NewEntryWizardTest)
 Time elapsed: 5.889 sec
testCreateEntryBelowReferralObjectCancel(org.apache.directory.studio.test.integration.ui.NewEntryWizardTest)
 Time elapsed: 6.668 sec
testCreateEntryBelowReferralObjectFollow(org.apache.directory.studio.test.integration.ui.NewEntryWizardTest)
 Time elapsed: 6.201 sec
testCreateOrganizationEntry(org.apache.directory.studio.test.integration.ui.NewEntryWizardTest)
 Time elapsed: 6.963 sec
testCreateEntryWithSharp(org.apache.directory.studio.test.integration.ui.NewEntryWizardTest)
 Time elapsed: 6.706 sec
testCreateEntryWithSlash(org.apache.directory.studio.test.integration.ui.NewEntryWizardTest)
 Time elapsed: 7.193 sec
testCreateUpperCaseOrganizationEntries(org.apache.directory.studio.test.integration.ui.NewEntryWizardTest)
 Time elapsed: 8.861 sec
testCreateMvRdnWithNumericOid(org.apache.directory.studio.test.integration.ui.NewEntryWizardTest)
 Time elapsed: 6.494 sec

Results :

Failed tests: 
  SchemaEditorSearchTest.testSearchForAliases:80 
Expected: <1>
     but: was <0>
  NewConnectionWizardTest.testCheckAuthenticationButtonOK:475 Expected OK expected null, but
was:<The authentication failed
 - localhost:1025
 - No connection>
  ApacheDSPluginTest.verifyServerNameCollisionInNewWizard:191 expected:<0> but was:<1>
  ApacheDSPluginTest.testSetEnabledProtocols:436->createServer:154 expected:<0> but
was:<1>
  ApacheDSPluginTest.serverCreationStartCreateConnectionStopAndDeletion:92->createServer:154
expected:<0> but was:<1>
  BrowserTest.testSetInputOnlyOnce:614 expected:<uid=user.[2]> but was:<uid=user.[3]>
  SwtResourcesTest.testSwtResourcesDelta:108 Too many SWT resources were allocated in testSwtResourcesDelta:
before=619, after=667
  RenameEntryDialogTest.testRenameRdnWithEscapedCharacters:117 null
  RenameEntryDialogTest.testRenameRdnWithTrailingSpace:167 null
  RenameEntryDialogTest.testRenameRdnWithSharp:139 null

Tests in error: 
  CertificateValidationTest.testLdapsCertificateTrustPermanent:379 » WidgetNotFound
  CertificateValidationTest.testStartTlsCertificateValidationNotYetValid:512 » WidgetNotFound
  CertificateValidationTest.testLdapsCertificateTrustTemporary:316 » Timeout Tim...
  CertificateValidationTest.testLdapsCertificateDoNotTrust:264 » WidgetNotFound ...
  CertificateValidationTest.testStartTlsCertificateValidationExpired:466 » Timeout
  CertificateValidationTest.testLdapsCertificateValidationNotOK:220 » Timeout Ti...
  CertificateValidationTest.testStartTlsCertificateTrustPermanent:725 » Timeout ...
  CertificateValidationTest.testStartTlsCertificateValidationOK:433 » Timeout Ti...
  CertificateValidationTest.testStartTlsCertificateValidationHostnameMismatch:550 » Timeout
  CertificateValidationTest.testLdapsCertificateValidationOK:187 » Timeout Timeo...
  CertificateValidationTest.testStartTlsCertificateDoNotTrust:596 » Timeout Time...
  NewConnectionWizardTest.testCheckAuthenticationButtonNotOK:491 » Timeout Timeo...
  NewConnectionWizardTest.testCreateConnection:335 » Timeout Timeout after: 5000...
  ApacheDSPluginTest.repairAndStartAndStop:415 » Timeout Timeout after: 60000 ms...

Tests run: 227, Failures: 10, Errors: 14, Skipped: 0

[INFO] ------------------------------------------------------------------------
[INFO] Reactor Summary:
[INFO] 
[INFO] Apache Directory Studio Parent ..................... SUCCESS [  0.961 s]
[INFO] Apache Directory Studio Target Platform for Eclipse  SUCCESS [  0.140 s]
[INFO] Apache Directory Studio Plugins .................... SUCCESS [  0.714 s]
[INFO] Apache Directory Studio Common UI .................. SUCCESS [  3.010 s]
[INFO] Apache Directory Studio Common Core ................ SUCCESS [  0.200 s]
[INFO] Apache Directory Studio LDIF Parser ................ SUCCESS [  2.232 s]
[INFO] Apache Directory Studio Connection Core ............ SUCCESS [  1.001 s]
[INFO] Apache Directory Studio Connection UI .............. SUCCESS [  0.705 s]
[INFO] Apache Directory Studio LDAP Browser Core .......... SUCCESS [  3.434 s]
[INFO] Apache Directory Studio LDAP Browser Common ........ SUCCESS [  2.831 s]
[INFO] Apache Directory Studio Value Editors .............. SUCCESS [  1.707 s]
[INFO] Apache Directory Studio ACI Item Editor ............ SUCCESS [  0.606 s]
[INFO] Apache Directory Studio ApacheDS Configuration ..... SUCCESS [  0.789 s]
[INFO] Apache Directory Studio LDIF Editor ................ SUCCESS [  0.551 s]
[INFO] Apache Directory Studio LDAP Browser UI ............ SUCCESS [  1.310 s]
[INFO] Apache Directory Studio LDAP Servers ............... SUCCESS [  0.407 s]
[INFO] Apache Directory Studio ApacheDS LDAP Server Adapter SUCCESS [  3.625 s]
[INFO] Apache Directory Studio RCP ........................ SUCCESS [  0.418 s]
[INFO] Apache Directory Studio Schema Editor .............. SUCCESS [  2.773 s]
[INFO] Apache Directory Studio OpenLDAP Common UI ......... SUCCESS [  1.361 s]
[INFO] Apache Directory Studio OpenLDAP Syncrepl .......... SUCCESS [  1.103 s]
[INFO] Apache Directory Studio OpenLDAP Configuration Editor SUCCESS [  2.571 s]
[INFO] Apache Directory Studio OpenLDAP ACL Configuration Editor SUCCESS [  2.696 s]
[INFO] Apache Directory Studio Template Editor ............ SUCCESS [  2.094 s]
[INFO] Apache Directory Studio Combined Editor ............ SUCCESS [  0.379 s]
[INFO] Apache Directory Studio SLF4J to Eclipse Log Binding SUCCESS [  0.112 s]
[INFO] Apache Directory Studio Help Plugins ............... SUCCESS [  0.017 s]
[INFO] Apache Directory Studio Apache DS Help ............. SUCCESS [  4.266 s]
[INFO] Apache Directory Studio LDAP Browser Help .......... SUCCESS [  7.780 s]
[INFO] Apache Directory Studio LDIF Editor Help ........... SUCCESS [  1.861 s]
[INFO] Apache Directory Studio RCP Help ................... SUCCESS [  1.716 s]
[INFO] Apache Directory Studio Schema Editor Help ......... SUCCESS [  2.146 s]
[INFO] Apache Directory Studio Feature Plugins ............ SUCCESS [  0.036 s]
[INFO] Apache Directory Studio ApacheDS Feature ........... SUCCESS [  0.171 s]
[INFO] Apache Directory Studio LDAP Browser Feature ....... SUCCESS [  0.133 s]
[INFO] Apache Directory Studio LDIF Editor Feature ........ SUCCESS [  0.083 s]
[INFO] Apache Directory Studio RCP Feature ................ SUCCESS [  0.180 s]
[INFO] Apache Directory Studio Schema Editor Feature ...... SUCCESS [  0.089 s]
[INFO] Apache Directory Studio OpenLDAP Feature ........... SUCCESS [  0.081 s]
[INFO] Apache Directory Studio National Language Support Feature SUCCESS [  0.288 s]
[INFO] Apache Directory Studio Test Plugins ............... SUCCESS [  0.016 s]
[INFO] Apache Directory Studio Core Integration Tests ..... SUCCESS [05:16 min]
[INFO] Apache Directory Studio UI Integration Tests ....... FAILURE [19:40 min]
[INFO] Apache Directory Studio P2 Repositories ............ SKIPPED
[INFO] Apache Directory Studio P2 Repository Dependencies . SKIPPED
[INFO] Apache Directory Studio P2 Repository Eclipse ...... SKIPPED
[INFO] Apache Directory Studio Product .................... SKIPPED
[INFO] Apache Directory Studio Installers ................. SKIPPED
[INFO] ------------------------------------------------------------------------
[INFO] BUILD FAILURE
[INFO] ------------------------------------------------------------------------
[INFO] Total time: 30:23 min
[INFO] Finished at: 2017-09-20T14:12:31+00:00
[INFO] Final Memory: 283M/3812M
[INFO] ------------------------------------------------------------------------
[ERROR] Failed to execute goal org.eclipse.tycho:tycho-surefire-plugin:0.24.0:test (default-test)
on project org.apache.directory.studio.test.integration.ui: There are test failures.
[ERROR] 
[ERROR] Please refer to /home/hnelson/studio/tests/test.integration.ui/target/surefire-reports
for the individual test results.
[ERROR] -> [Help 1]
[ERROR] 
[ERROR] To see the full stack trace of the errors, re-run Maven with the -e switch.
[ERROR] Re-run Maven using the -X switch to enable full debug logging.
[ERROR] 
[ERROR] For more information about the errors and possible solutions, please read the following
articles:
[ERROR] [Help 1] http://cwiki.apache.org/confluence/display/MAVEN/MojoFailureException
[ERROR] 
[ERROR] After correcting the problems, you can resume the build with the command
[ERROR]   mvn <goals> -rf :org.apache.directory.studio.test.integration.ui
Build step 'Execute shell' marked build as failure
Recording test results

Mime
View raw message