directory-notifications mailing list archives

Site index · List index
Message view « Date » · « Thread »
Top « Date » · « Thread »
From Apache Jenkins Server <jenk...@builds.apache.org>
Subject Build failed in Jenkins: dir-apacheds-docker-installers #87
Date Wed, 23 Aug 2017 02:54:57 GMT
See <https://builds.apache.org/job/dir-apacheds-docker-installers/87/display/redirect?page=changes>

Changes:

[kayyagari] added test for DIRSERVER-2206

------------------------------------------
[...truncated 672.24 KB...]
[INFO] --- maven-resources-plugin:3.0.2:testResources (default-testResources) @ apacheds-core-integ
---
[INFO] Using 'UTF-8' encoding to copy filtered resources.
[INFO] Copying 10 resources
[INFO] Copying 3 resources
[INFO] 
[INFO] --- maven-dependency-plugin:3.0.1:copy (copy) @ apacheds-core-integ ---
[INFO] Configured Artifact: org.apache.directory.api:api-ldap-extras-codec:1.0.0:jar
[INFO] Copying api-ldap-extras-codec-1.0.0.jar to <https://builds.apache.org/job/dir-apacheds-docker-installers/ws/core-integ/target/pluginDirectory/api-ldap-extras-codec-1.0.0.jar>
[INFO] 
[INFO] --- maven-compiler-plugin:3.6.1:testCompile (default-testCompile) @ apacheds-core-integ
---
[INFO] Changes detected - recompiling the module!
[INFO] Compiling 112 source files to <https://builds.apache.org/job/dir-apacheds-docker-installers/ws/core-integ/target/test-classes>
[INFO] <https://builds.apache.org/job/dir-apacheds-docker-installers/ws/core-integ/src/test/java/org/apache/directory/server/core/subtree/SubentryServiceIT.java>:
<https://builds.apache.org/job/dir-apacheds-docker-installers/ws/core-integ/src/test/java/org/apache/directory/server/core/subtree/SubentryServiceIT.java>
uses or overrides a deprecated API.
[INFO] <https://builds.apache.org/job/dir-apacheds-docker-installers/ws/core-integ/src/test/java/org/apache/directory/server/core/subtree/SubentryServiceIT.java>:
Recompile with -Xlint:deprecation for details.
[INFO] <https://builds.apache.org/job/dir-apacheds-docker-installers/ws/core-integ/src/test/java/org/apache/directory/server/core/operations/search/SearchIT.java>:
<https://builds.apache.org/job/dir-apacheds-docker-installers/ws/core-integ/src/test/java/org/apache/directory/server/core/operations/search/SearchIT.java>
uses unchecked or unsafe operations.
[INFO] <https://builds.apache.org/job/dir-apacheds-docker-installers/ws/core-integ/src/test/java/org/apache/directory/server/core/operations/search/SearchIT.java>:
Recompile with -Xlint:unchecked for details.
[INFO] 
[INFO] --- maven-surefire-plugin:2.19.1:test (default-test) @ apacheds-core-integ ---
[INFO] Tests are skipped.
[INFO] 
[INFO] --- maven-bundle-plugin:3.3.0:bundle (default-bundle) @ apacheds-core-integ ---
[WARNING] Bundle org.apache.directory.server:apacheds-core-integ:bundle:2.0.0-M25-SNAPSHOT
: Split package, multiple jars provide the same package:org/apache/directory/server/core/integ
Use Import/Export Package directive -split-package:=(merge-first|merge-last|error|first) to
get rid of this warning
Package found in   [Jar:., Jar:apacheds-test-framework]
Class path         [Jar:., Jar:mina-core, Jar:apacheds-core, Jar:apacheds-interceptors-admin,
Jar:apacheds-interceptors-number, Jar:apacheds-interceptors-authz, Jar:apacheds-interceptors-changelog,
Jar:apacheds-interceptors-collective, Jar:apacheds-interceptors-event, Jar:apacheds-interceptors-exception,
Jar:apacheds-interceptors-journal, Jar:apacheds-interceptors-normalization, Jar:apacheds-interceptors-operational,
Jar:apacheds-interceptors-referral, Jar:apacheds-interceptors-schema, Jar:apacheds-interceptors-subtree,
Jar:apacheds-interceptors-trigger, Jar:api-ldap-extras-util, Jar:bcprov-jdk15on, Jar:apacheds-core-annotations,
Jar:apacheds-ldif-partition, Jar:apacheds-jdbm-partition, Jar:apacheds-core-avl, Jar:apacheds-xdbm-partition,
Jar:mavibot, Jar:apacheds-mavibot-partition, Jar:apacheds-core-api, Jar:apacheds-core-constants,
Jar:api-i18n, Jar:api-ldap-extras-aci, Jar:ehcache, Jar:apacheds-core-jndi, Jar:apacheds-core-shared,
Jar:api-ldap-extras-codec-api, Jar:apacheds-jdbm1, Jar:apacheds-interceptors-authn, Jar:commons-collections,
Jar:apacheds-interceptors-hash, Jar:apacheds-server-config, Jar:api-ldap-extras-trigger, Jar:apacheds-i18n,
Jar:apacheds-protocol-ldap, Jar:apacheds-protocol-shared, Jar:apacheds-kerberos-codec, Jar:api-asn1-ber,
Jar:apacheds-server-annotations, Jar:apacheds-protocol-kerberos, Jar:apacheds-test-framework,
Jar:commons-lang, Jar:api-ldap-client-api, Jar:commons-pool, Jar:api-ldap-extras-codec, Jar:api-asn1-api,
Jar:api-ldap-extras-sp, Jar:api-ldap-codec-core, Jar:api-ldap-model, Jar:org.apache.servicemix.bundles.antlr,
Jar:commons-codec, Jar:api-ldap-schema-data, Jar:api-util, Jar:annotations, Jar:slf4j-api]
[INFO] 
[INFO] --- maven-site-plugin:3.6:attach-descriptor (attach-descriptor) @ apacheds-core-integ
---
[INFO] Skipping because packaging 'bundle' is not pom.
[INFO] 
[INFO] --- maven-jar-plugin:3.0.2:test-jar (default) @ apacheds-core-integ ---
[INFO] Building jar: <https://builds.apache.org/job/dir-apacheds-docker-installers/ws/core-integ/target/apacheds-core-integ-2.0.0-M25-SNAPSHOT-tests.jar>
[INFO] 
[INFO] --- tools-maven-plugin:1.4:verify-legal-files (verify-legal-files) @ apacheds-core-integ
---
[INFO] Checking legal files in: apacheds-core-integ-2.0.0-M25-SNAPSHOT.jar
[INFO] Checking legal files in: apacheds-core-integ-2.0.0-M25-SNAPSHOT-tests.jar
[INFO] 
[INFO] --- maven-install-plugin:2.5.2:install (default-install) @ apacheds-core-integ ---
[INFO] Installing <https://builds.apache.org/job/dir-apacheds-docker-installers/ws/core-integ/target/apacheds-core-integ-2.0.0-M25-SNAPSHOT.jar>
to /home/jenkins/.m2/repository/org/apache/directory/server/apacheds-core-integ/2.0.0-M25-SNAPSHOT/apacheds-core-integ-2.0.0-M25-SNAPSHOT.jar
[INFO] Installing <https://builds.apache.org/job/dir-apacheds-docker-installers/ws/core-integ/pom.xml>
to /home/jenkins/.m2/repository/org/apache/directory/server/apacheds-core-integ/2.0.0-M25-SNAPSHOT/apacheds-core-integ-2.0.0-M25-SNAPSHOT.pom
[INFO] Installing <https://builds.apache.org/job/dir-apacheds-docker-installers/ws/core-integ/target/apacheds-core-integ-2.0.0-M25-SNAPSHOT-tests.jar>
to /home/jenkins/.m2/repository/org/apache/directory/server/apacheds-core-integ/2.0.0-M25-SNAPSHOT/apacheds-core-integ-2.0.0-M25-SNAPSHOT-tests.jar
[INFO] 
[INFO] --- maven-bundle-plugin:3.3.0:install (default-install) @ apacheds-core-integ ---
[INFO] Installing org/apache/directory/server/apacheds-core-integ/2.0.0-M25-SNAPSHOT/apacheds-core-integ-2.0.0-M25-SNAPSHOT.jar
[INFO] Writing OBR metadata
[INFO] 
[INFO] ------------------------------------------------------------------------
[INFO] Building ApacheDS Protocol Kerberos Test 2.0.0-M25-SNAPSHOT
[INFO] ------------------------------------------------------------------------
[INFO] 
[INFO] --- maven-clean-plugin:3.0.0:clean (default-clean) @ apacheds-kerberos-test ---
[INFO] 
[INFO] --- maven-checkstyle-plugin:2.17:check (validate) @ apacheds-kerberos-test ---
[INFO] 
[INFO] --- maven-remote-resources-plugin:1.5:process (process-resource-bundles) @ apacheds-kerberos-test
---
[INFO] 
[INFO] --- maven-resources-plugin:3.0.2:resources (default-resources) @ apacheds-kerberos-test
---
[INFO] Using 'UTF-8' encoding to copy filtered resources.
[INFO] skip non existing resourceDirectory <https://builds.apache.org/job/dir-apacheds-docker-installers/ws/kerberos-test/src/main/resources>
[INFO] Copying 3 resources
[INFO] 
[INFO] --- maven-compiler-plugin:3.6.1:compile (default-compile) @ apacheds-kerberos-test
---
[INFO] No sources to compile
[INFO] 
[INFO] --- maven-resources-plugin:3.0.2:testResources (default-testResources) @ apacheds-kerberos-test
---
[INFO] Using 'UTF-8' encoding to copy filtered resources.
[INFO] Copying 3 resources
[INFO] Copying 3 resources
[INFO] 
[INFO] --- maven-compiler-plugin:3.6.1:testCompile (default-testCompile) @ apacheds-kerberos-test
---
[INFO] Changes detected - recompiling the module!
[INFO] Compiling 6 source files to <https://builds.apache.org/job/dir-apacheds-docker-installers/ws/kerberos-test/target/test-classes>
[INFO] <https://builds.apache.org/job/dir-apacheds-docker-installers/ws/kerberos-test/src/test/java/org/apache/directory/server/kerberos/kdc/AbstractKerberosITest.java>:
<https://builds.apache.org/job/dir-apacheds-docker-installers/ws/kerberos-test/src/test/java/org/apache/directory/server/kerberos/kdc/AbstractKerberosITest.java>
uses or overrides a deprecated API.
[INFO] <https://builds.apache.org/job/dir-apacheds-docker-installers/ws/kerberos-test/src/test/java/org/apache/directory/server/kerberos/kdc/AbstractKerberosITest.java>:
Recompile with -Xlint:deprecation for details.
[INFO] 
[INFO] --- maven-surefire-plugin:2.19.1:test (default-test) @ apacheds-kerberos-test ---
[INFO] Tests are skipped.
[INFO] 
[INFO] --- maven-jar-plugin:3.0.2:jar (default-jar) @ apacheds-kerberos-test ---
[INFO] Building jar: <https://builds.apache.org/job/dir-apacheds-docker-installers/ws/kerberos-test/target/apacheds-kerberos-test-2.0.0-M25-SNAPSHOT.jar>
[INFO] 
[INFO] --- maven-site-plugin:3.6:attach-descriptor (attach-descriptor) @ apacheds-kerberos-test
---
[INFO] Skipping because packaging 'jar' is not pom.
[INFO] 
[INFO] --- maven-jar-plugin:3.0.2:test-jar (attach-tests) @ apacheds-kerberos-test ---
[INFO] Building jar: <https://builds.apache.org/job/dir-apacheds-docker-installers/ws/kerberos-test/target/apacheds-kerberos-test-2.0.0-M25-SNAPSHOT-tests.jar>
[INFO] 
[INFO] --- tools-maven-plugin:1.4:verify-legal-files (verify-legal-files) @ apacheds-kerberos-test
---
[INFO] Checking legal files in: apacheds-kerberos-test-2.0.0-M25-SNAPSHOT.jar
[INFO] Checking legal files in: apacheds-kerberos-test-2.0.0-M25-SNAPSHOT-tests.jar
[INFO] 
[INFO] >>> maven-source-plugin:3.0.1:jar (attach-sources) > generate-sources @
apacheds-kerberos-test >>>
[INFO] 
[INFO] --- maven-checkstyle-plugin:2.17:check (validate) @ apacheds-kerberos-test ---
[INFO] 
[INFO] <<< maven-source-plugin:3.0.1:jar (attach-sources) < generate-sources @
apacheds-kerberos-test <<<
[INFO] 
[INFO] 
[INFO] --- maven-source-plugin:3.0.1:jar (attach-sources) @ apacheds-kerberos-test ---
[INFO] Building jar: <https://builds.apache.org/job/dir-apacheds-docker-installers/ws/kerberos-test/target/apacheds-kerberos-test-2.0.0-M25-SNAPSHOT-sources.jar>
[INFO] 
[INFO] --- maven-install-plugin:2.5.2:install (default-install) @ apacheds-kerberos-test ---
[INFO] Installing <https://builds.apache.org/job/dir-apacheds-docker-installers/ws/kerberos-test/target/apacheds-kerberos-test-2.0.0-M25-SNAPSHOT.jar>
to /home/jenkins/.m2/repository/org/apache/directory/server/apacheds-kerberos-test/2.0.0-M25-SNAPSHOT/apacheds-kerberos-test-2.0.0-M25-SNAPSHOT.jar
[INFO] Installing <https://builds.apache.org/job/dir-apacheds-docker-installers/ws/kerberos-test/pom.xml>
to /home/jenkins/.m2/repository/org/apache/directory/server/apacheds-kerberos-test/2.0.0-M25-SNAPSHOT/apacheds-kerberos-test-2.0.0-M25-SNAPSHOT.pom
[INFO] Installing <https://builds.apache.org/job/dir-apacheds-docker-installers/ws/kerberos-test/target/apacheds-kerberos-test-2.0.0-M25-SNAPSHOT-tests.jar>
to /home/jenkins/.m2/repository/org/apache/directory/server/apacheds-kerberos-test/2.0.0-M25-SNAPSHOT/apacheds-kerberos-test-2.0.0-M25-SNAPSHOT-tests.jar
[INFO] Installing <https://builds.apache.org/job/dir-apacheds-docker-installers/ws/kerberos-test/target/apacheds-kerberos-test-2.0.0-M25-SNAPSHOT-sources.jar>
to /home/jenkins/.m2/repository/org/apache/directory/server/apacheds-kerberos-test/2.0.0-M25-SNAPSHOT/apacheds-kerberos-test-2.0.0-M25-SNAPSHOT-sources.jar
[INFO] 
[INFO] ------------------------------------------------------------------------
[INFO] Building ApacheDS Server Integration 2.0.0-M25-SNAPSHOT
[INFO] ------------------------------------------------------------------------
[INFO] 
[INFO] --- maven-clean-plugin:3.0.0:clean (default-clean) @ apacheds-server-integ ---
[INFO] 
[INFO] --- maven-checkstyle-plugin:2.17:check (validate) @ apacheds-server-integ ---
[INFO] 
[INFO] --- maven-remote-resources-plugin:1.5:process (process-resource-bundles) @ apacheds-server-integ
---
[INFO] 
[INFO] --- maven-resources-plugin:3.0.2:resources (default-resources) @ apacheds-server-integ
---
[INFO] Using 'UTF-8' encoding to copy filtered resources.
[INFO] Copying 0 resource
[INFO] Copying 3 resources
[INFO] 
[INFO] --- maven-compiler-plugin:3.6.1:compile (default-compile) @ apacheds-server-integ ---
[INFO] Changes detected - recompiling the module!
[INFO] Compiling 1 source file to <https://builds.apache.org/job/dir-apacheds-docker-installers/ws/server-integ/target/classes>
[INFO] <https://builds.apache.org/job/dir-apacheds-docker-installers/ws/server-integ/src/main/java/org/apache/directory/server/integ/ServerIntegrationUtils.java>:
<https://builds.apache.org/job/dir-apacheds-docker-installers/ws/server-integ/src/main/java/org/apache/directory/server/integ/ServerIntegrationUtils.java>
uses or overrides a deprecated API.
[INFO] <https://builds.apache.org/job/dir-apacheds-docker-installers/ws/server-integ/src/main/java/org/apache/directory/server/integ/ServerIntegrationUtils.java>:
Recompile with -Xlint:deprecation for details.
[INFO] 
[INFO] --- maven-dependency-plugin:3.0.1:copy (copy) @ apacheds-server-integ ---
[INFO] Configured Artifact: org.apache.directory.api:api-ldap-extras-codec:?:jar
[INFO] Copying api-ldap-extras-codec-1.0.0.jar to <https://builds.apache.org/job/dir-apacheds-docker-installers/ws/server-integ/target/pluginDirectory/api-ldap-extras-codec-1.0.0.jar>
[INFO] 
[INFO] --- maven-resources-plugin:3.0.2:testResources (default-testResources) @ apacheds-server-integ
---
[INFO] Using 'UTF-8' encoding to copy filtered resources.
[INFO] Copying 10 resources
[INFO] Copying 3 resources
[INFO] 
[INFO] --- maven-compiler-plugin:3.6.1:testCompile (default-testCompile) @ apacheds-server-integ
---
[INFO] Changes detected - recompiling the module!
[INFO] Compiling 79 source files to <https://builds.apache.org/job/dir-apacheds-docker-installers/ws/server-integ/target/test-classes>
[INFO] <https://builds.apache.org/job/dir-apacheds-docker-installers/ws/server-integ/src/test/java/org/apache/directory/server/operations/lookup/LookupPerfIT.java>:
Some input files use or override a deprecated API.
[INFO] <https://builds.apache.org/job/dir-apacheds-docker-installers/ws/server-integ/src/test/java/org/apache/directory/server/operations/lookup/LookupPerfIT.java>:
Recompile with -Xlint:deprecation for details.
[INFO] <https://builds.apache.org/job/dir-apacheds-docker-installers/ws/server-integ/src/test/java/org/apache/directory/server/operations/bind/SaslBindIT.java>:
<https://builds.apache.org/job/dir-apacheds-docker-installers/ws/server-integ/src/test/java/org/apache/directory/server/operations/bind/SaslBindIT.java>
uses unchecked or unsafe operations.
[INFO] <https://builds.apache.org/job/dir-apacheds-docker-installers/ws/server-integ/src/test/java/org/apache/directory/server/operations/bind/SaslBindIT.java>:
Recompile with -Xlint:unchecked for details.
[INFO] -------------------------------------------------------------
[ERROR] COMPILATION ERROR : 
[INFO] -------------------------------------------------------------
[ERROR] <https://builds.apache.org/job/dir-apacheds-docker-installers/ws/server-integ/src/test/java/org/apache/directory/server/operations/search/SearchIT.java>:[23,53]
cannot find symbol
  symbol:   class AutzIntegUtils
  location: package org.apache.directory.server.core.authz
[ERROR] <https://builds.apache.org/job/dir-apacheds-docker-installers/ws/server-integ/src/test/java/org/apache/directory/server/operations/search/SearchIT.java>:[23,1]
static import only from classes and interfaces
[ERROR] <https://builds.apache.org/job/dir-apacheds-docker-installers/ws/server-integ/src/test/java/org/apache/directory/server/operations/search/SearchIT.java>:[24,53]
cannot find symbol
  symbol:   class AutzIntegUtils
  location: package org.apache.directory.server.core.authz
[ERROR] <https://builds.apache.org/job/dir-apacheds-docker-installers/ws/server-integ/src/test/java/org/apache/directory/server/operations/search/SearchIT.java>:[24,1]
static import only from classes and interfaces
[ERROR] <https://builds.apache.org/job/dir-apacheds-docker-installers/ws/server-integ/src/test/java/org/apache/directory/server/operations/search/SearchIT.java>:[78,46]
cannot find symbol
  symbol:   class AutzIntegUtils
  location: package org.apache.directory.server.core.authz
[INFO] 5 errors 
[INFO] -------------------------------------------------------------
[INFO] ------------------------------------------------------------------------
[INFO] Reactor Summary:
[INFO] 
[INFO] ApacheDS ........................................... SUCCESS [  4.819 s]
[INFO] ApacheDS I18n ...................................... SUCCESS [  3.854 s]
[INFO] ApacheDS Core Constants ............................ SUCCESS [  0.836 s]
[INFO] ApacheDS Core API .................................. SUCCESS [  8.888 s]
[INFO] ApacheDS Core Shared ............................... SUCCESS [  1.983 s]
[INFO] ApacheDS Interceptors .............................. SUCCESS [  0.173 s]
[INFO] ApacheDS AdministrativePoint Interceptor ........... SUCCESS [  1.660 s]
[INFO] ApacheDS Authentication Interceptor ................ SUCCESS [  1.656 s]
[INFO] ApacheDS Interceptor to increment numeric attributes SUCCESS [  1.192 s]
[INFO] ApacheDS Authorization Interceptor ................. SUCCESS [  1.938 s]
[INFO] ApacheDS ChangeLog Interceptor ..................... SUCCESS [  1.378 s]
[INFO] ApacheDS Collective Attribute Interceptor .......... SUCCESS [  1.049 s]
[INFO] ApacheDS Event Interceptor ......................... SUCCESS [  1.102 s]
[INFO] ApacheDS Exception Interceptor ..................... SUCCESS [  1.125 s]
[INFO] ApacheDS Journal Interceptor ....................... SUCCESS [  1.069 s]
[INFO] ApacheDS Normalization Interceptor ................. SUCCESS [  1.154 s]
[INFO] ApacheDS Operational Attribute Interceptor ......... SUCCESS [  1.076 s]
[INFO] ApacheDS Referral Interceptor ...................... SUCCESS [  1.186 s]
[INFO] ApacheDS Schema Interceptor ........................ SUCCESS [  1.418 s]
[INFO] ApacheDS Subtree Interceptor ....................... SUCCESS [  1.275 s]
[INFO] ApacheDS Triggers Interceptor ...................... SUCCESS [  1.293 s]
[INFO] ApacheDS Core ...................................... SUCCESS [  2.703 s]
[INFO] ApacheDS Core AVL .................................. SUCCESS [  1.543 s]
[INFO] ApacheDS Generalized (X) DBM Partition ............. SUCCESS [  2.698 s]
[INFO] ApacheDS LDIF Partition ............................ SUCCESS [  1.350 s]
[INFO] ApacheDS JDBM Partition ............................ SUCCESS [  2.203 s]
[INFO] ApacheDS Mavibot Partition ......................... SUCCESS [  1.663 s]
[INFO] ApacheDS Core Annotations .......................... SUCCESS [  2.613 s]
[INFO] ApacheDS Core JNDI ................................. SUCCESS [  1.760 s]
[INFO] ApacheDS Protocol Kerberos Codec ................... SUCCESS [  6.584 s]
[INFO] ApacheDS Interceptors for Kerberos ................. SUCCESS [  1.579 s]
[INFO] ApacheDS Protocol Dhcp ............................. SUCCESS [  1.140 s]
[INFO] ApacheDS Protocol Shared ........................... SUCCESS [  1.198 s]
[INFO] ApacheDS Protocol Dns .............................. SUCCESS [  2.695 s]
[INFO] ApacheDS Protocol Kerberos ......................... SUCCESS [  1.883 s]
[INFO] ApacheDS Protocol Ldap ............................. SUCCESS [  3.582 s]
[INFO] ApacheDS Protocol Ntp .............................. SUCCESS [  1.301 s]
[INFO] Apacheds Server Annotations ........................ SUCCESS [  1.868 s]
[INFO] ApacheDS Server Config ............................. SUCCESS [  1.818 s]
[INFO] ApacheDS Server JNDI ............................... SUCCESS [  1.721 s]
[INFO] ApacheDS Test Framework ............................ SUCCESS [  1.938 s]
[INFO] ApacheDS All ....................................... SUCCESS [  5.627 s]
[INFO] ApacheDS Logger Interceptor ........................ SUCCESS [  1.154 s]
[INFO] ApacheDS Password Hashing Interceptor .............. SUCCESS [  1.152 s]
[INFO] ApacheDS Core Integration .......................... SUCCESS [  3.535 s]
[INFO] ApacheDS Protocol Kerberos Test .................... SUCCESS [  1.329 s]
[INFO] ApacheDS Server Integration ........................ FAILURE [  2.445 s]
[INFO] ApacheDS DirectoryService-WebApp bridge ............ SKIPPED
[INFO] ApacheDS Jetty HTTP Server Integration ............. SKIPPED
[INFO] ApacheDS Service Builder ........................... SKIPPED
[INFO] Apache Directory LDAP Client API test .............. SKIPPED
[INFO] kerberos-client .................................... SKIPPED
[INFO] ApacheDS Service ................................... SKIPPED
[INFO] ApacheDS Wrapper ................................... SKIPPED
[INFO] ApacheDS Installers Maven Plugin ................... SKIPPED
[INFO] ApacheDS Installers ................................ SKIPPED
[INFO] ------------------------------------------------------------------------
[INFO] BUILD FAILURE
[INFO] ------------------------------------------------------------------------
[INFO] Total time: 01:41 min
[INFO] Finished at: 2017-08-23T02:54:55Z
[INFO] Final Memory: 116M/451M
[INFO] ------------------------------------------------------------------------
[ERROR] Failed to execute goal org.apache.maven.plugins:maven-compiler-plugin:3.6.1:testCompile
(default-testCompile) on project apacheds-server-integ: Compilation failure: Compilation failure:

[ERROR] <https://builds.apache.org/job/dir-apacheds-docker-installers/ws/server-integ/src/test/java/org/apache/directory/server/operations/search/SearchIT.java>:[23,53]
cannot find symbol
[ERROR]   symbol:   class AutzIntegUtils
[ERROR]   location: package org.apache.directory.server.core.authz
[ERROR] <https://builds.apache.org/job/dir-apacheds-docker-installers/ws/server-integ/src/test/java/org/apache/directory/server/operations/search/SearchIT.java>:[23,1]
static import only from classes and interfaces
[ERROR] <https://builds.apache.org/job/dir-apacheds-docker-installers/ws/server-integ/src/test/java/org/apache/directory/server/operations/search/SearchIT.java>:[24,53]
cannot find symbol
[ERROR]   symbol:   class AutzIntegUtils
[ERROR]   location: package org.apache.directory.server.core.authz
[ERROR] <https://builds.apache.org/job/dir-apacheds-docker-installers/ws/server-integ/src/test/java/org/apache/directory/server/operations/search/SearchIT.java>:[24,1]
static import only from classes and interfaces
[ERROR] <https://builds.apache.org/job/dir-apacheds-docker-installers/ws/server-integ/src/test/java/org/apache/directory/server/operations/search/SearchIT.java>:[78,46]
cannot find symbol
[ERROR]   symbol:   class AutzIntegUtils
[ERROR]   location: package org.apache.directory.server.core.authz
[ERROR] -> [Help 1]
[ERROR] 
[ERROR] To see the full stack trace of the errors, re-run Maven with the -e switch.
[ERROR] Re-run Maven using the -X switch to enable full debug logging.
[ERROR] 
[ERROR] For more information about the errors and possible solutions, please read the following
articles:
[ERROR] [Help 1] http://cwiki.apache.org/confluence/display/MAVEN/MojoFailureException
[ERROR] 
[ERROR] After correcting the problems, you can resume the build with the command
[ERROR]   mvn <goals> -rf :apacheds-server-integ
Build step 'Invoke top-level Maven targets' marked build as failure
Archiving artifacts

Mime
View raw message