directory-notifications mailing list archives

Site index · List index
Message view « Date » · « Thread »
Top « Date » · « Thread »
From Apache Jenkins Server <jenk...@builds.apache.org>
Subject Build failed in Jenkins: dir-shared-ubuntu-deploy #2044
Date Wed, 23 Aug 2017 01:26:38 GMT
See <https://builds.apache.org/job/dir-shared-ubuntu-deploy/2044/display/redirect>

------------------------------------------
[...truncated 49.06 KB...]
Running org.apache.directory.api.util.GeneralizedTimeTest
Tests run: 48, Failures: 0, Errors: 0, Skipped: 0, Time elapsed: 0.405 sec - in org.apache.directory.api.util.GeneralizedTimeTest
Running org.apache.directory.api.util.FileUtilsTest
Tests run: 4, Failures: 0, Errors: 0, Skipped: 0, Time elapsed: 0.012 sec - in org.apache.directory.api.util.FileUtilsTest
Running org.apache.directory.api.util.StringsTest
Tests run: 19, Failures: 0, Errors: 0, Skipped: 0, Time elapsed: 0.015 sec - in org.apache.directory.api.util.StringsTest
Running org.apache.directory.api.util.OsgiUtilsTest
Tests run: 4, Failures: 0, Errors: 0, Skipped: 0, Time elapsed: 0.007 sec - in org.apache.directory.api.util.OsgiUtilsTest
Running org.apache.directory.api.util.exception.RuntimeMultiExceptionTest
Tests run: 2, Failures: 0, Errors: 0, Skipped: 0, Time elapsed: 0.012 sec - in org.apache.directory.api.util.exception.RuntimeMultiExceptionTest
Running org.apache.directory.api.util.exception.MultiExceptionTest
Tests run: 2, Failures: 0, Errors: 0, Skipped: 0, Time elapsed: 0.005 sec - in org.apache.directory.api.util.exception.MultiExceptionTest
Running org.apache.directory.api.util.HexTest
Tests run: 1, Failures: 0, Errors: 0, Skipped: 0, Time elapsed: 0 sec - in org.apache.directory.api.util.HexTest
Running org.apache.directory.api.util.UnicodeTest
Tests run: 11, Failures: 0, Errors: 0, Skipped: 0, Time elapsed: 0.124 sec - in org.apache.directory.api.util.UnicodeTest
Running org.apache.directory.api.util.ByteBufferTest
Tests run: 3, Failures: 0, Errors: 0, Skipped: 0, Time elapsed: 0.005 sec - in org.apache.directory.api.util.ByteBufferTest
Running org.apache.directory.api.util.MethodUtilsTest
Tests run: 2, Failures: 0, Errors: 0, Skipped: 0, Time elapsed: 0.002 sec - in org.apache.directory.api.util.MethodUtilsTest
Running org.apache.directory.api.util.DateUtilTest
Tests run: 1, Failures: 0, Errors: 0, Skipped: 0, Time elapsed: 0.001 sec - in org.apache.directory.api.util.DateUtilTest

Results :

Tests run: 97, Failures: 0, Errors: 0, Skipped: 0

[JENKINS] Recording test results
[INFO] 
[INFO] --- maven-bundle-plugin:3.3.0:bundle (default-bundle) @ api-util ---
[INFO] 
[INFO] --- maven-site-plugin:3.6:attach-descriptor (attach-descriptor) @ api-util ---
[INFO] Skipping because packaging 'bundle' is not pom.
[INFO] 
[INFO] --- maven-source-plugin:3.0.1:jar-no-fork (attach-sources) @ api-util ---
[INFO] Building jar: <https://builds.apache.org/job/dir-shared-ubuntu-deploy/ws/trunk/util/target/api-util-1.0.1-SNAPSHOT-sources.jar>
[INFO] 
[INFO] --- tools-maven-plugin:1.4:verify-legal-files (verify-legal-files) @ api-util ---
[INFO] Checking legal files in: api-util-1.0.1-SNAPSHOT.jar
[INFO] Checking legal files in: api-util-1.0.1-SNAPSHOT-sources.jar
[INFO] 
[INFO] --- forbiddenapis:2.2:check (default) @ api-util ---
[INFO] Scanning for classes to check...
[INFO] Reading bundled API signatures: jdk-unsafe-1.7
[INFO] Reading bundled API signatures: jdk-deprecated-1.7
[INFO] Loading classes to check...
[INFO] Scanning classes for violations...
[INFO] Scanned 46 (and 308 related) class file(s) for forbidden API invocations (in 0.10s),
0 error(s).
[PMD] No report found for mojo check
[INFO] 
[INFO] --- forbiddenapis:2.2:testCheck (default) @ api-util ---
[INFO] Scanning for classes to check...
[INFO] Reading bundled API signatures: jdk-unsafe-1.7
[INFO] Reading bundled API signatures: jdk-deprecated-1.7
[INFO] Loading classes to check...
[INFO] Scanning classes for violations...
[INFO] Scanned 14 (and 264 related) class file(s) for forbidden API invocations (in 0.04s),
0 error(s).
[INFO] 
[INFO] --- maven-install-plugin:2.5.2:install (default-install) @ api-util ---
[INFO] Installing <https://builds.apache.org/job/dir-shared-ubuntu-deploy/ws/trunk/util/target/api-util-1.0.1-SNAPSHOT.jar>
to <https://builds.apache.org/job/dir-shared-ubuntu-deploy/ws/.repository/org/apache/directory/api/api-util/1.0.1-SNAPSHOT/api-util-1.0.1-SNAPSHOT.jar>
[INFO] Installing <https://builds.apache.org/job/dir-shared-ubuntu-deploy/ws/trunk/util/pom.xml>
to <https://builds.apache.org/job/dir-shared-ubuntu-deploy/ws/.repository/org/apache/directory/api/api-util/1.0.1-SNAPSHOT/api-util-1.0.1-SNAPSHOT.pom>
[INFO] Installing <https://builds.apache.org/job/dir-shared-ubuntu-deploy/ws/trunk/util/target/api-util-1.0.1-SNAPSHOT-sources.jar>
to <https://builds.apache.org/job/dir-shared-ubuntu-deploy/ws/.repository/org/apache/directory/api/api-util/1.0.1-SNAPSHOT/api-util-1.0.1-SNAPSHOT-sources.jar>
[INFO] 
[INFO] --- maven-bundle-plugin:3.3.0:install (default-install) @ api-util ---
[INFO] Installing org/apache/directory/api/api-util/1.0.1-SNAPSHOT/api-util-1.0.1-SNAPSHOT.jar
[INFO] Writing OBR metadata
[INFO] 
[INFO] >>> maven-source-plugin:3.0.1:jar (default-cli) > generate-sources @ api-util
>>>
[INFO] 
[INFO] --- maven-checkstyle-plugin:2.17:check (validate) @ api-util ---
[PMD] No report found for mojo check
[WARNING] Failed to getClass for org.apache.maven.plugins.source.SourceJarMojo
[INFO] 
[INFO] <<< maven-source-plugin:3.0.1:jar (default-cli) < generate-sources @ api-util
<<<
[INFO] 
[INFO] --- maven-source-plugin:3.0.1:jar (default-cli) @ api-util ---
[INFO] Building jar: <https://builds.apache.org/job/dir-shared-ubuntu-deploy/ws/trunk/util/target/api-util-1.0.1-SNAPSHOT-sources.jar>
[INFO] 
[INFO] --- maven-checkstyle-plugin:2.17:check (validate) @ api-util ---
[PMD] No report found for mojo check
[INFO] 
[INFO] --- maven-remote-resources-plugin:1.5:process (process-resource-bundles) @ api-util
---
[INFO] 
[INFO] --- maven-resources-plugin:3.0.2:resources (default-resources) @ api-util ---
[INFO] Using 'UTF-8' encoding to copy filtered resources.
[INFO] Copying 0 resource
[INFO] Copying 3 resources
[INFO] Copying 3 resources
[INFO] 
[INFO] --- maven-compiler-plugin:3.6.1:compile (default-compile) @ api-util ---
[INFO] Nothing to compile - all classes are up to date
[INFO] 
[INFO] --- maven-resources-plugin:3.0.2:testResources (default-testResources) @ api-util ---
[INFO] Using 'UTF-8' encoding to copy filtered resources.
[INFO] Copying 1 resource
[INFO] Copying 3 resources
[INFO] Copying 3 resources
[INFO] 
[INFO] --- maven-compiler-plugin:3.6.1:testCompile (default-testCompile) @ api-util ---
[INFO] Nothing to compile - all classes are up to date
[INFO] 
[INFO] --- maven-surefire-plugin:2.19.1:test (default-test) @ api-util ---
[INFO] Skipping execution of surefire because it has already been run for this configuration
[JENKINS] Recording test results
[INFO] 
[INFO] --- maven-bundle-plugin:3.3.0:bundle (default-bundle) @ api-util ---
[INFO] 
[INFO] --- maven-site-plugin:3.6:attach-descriptor (attach-descriptor) @ api-util ---
[INFO] Skipping because packaging 'bundle' is not pom.
[INFO] 
[INFO] --- maven-source-plugin:3.0.1:jar-no-fork (attach-sources) @ api-util ---
[INFO] Building jar: <https://builds.apache.org/job/dir-shared-ubuntu-deploy/ws/trunk/util/target/api-util-1.0.1-SNAPSHOT-sources.jar>
[INFO] 
[INFO] --- tools-maven-plugin:1.4:verify-legal-files (verify-legal-files) @ api-util ---
[INFO] Checking legal files in: api-util-1.0.1-SNAPSHOT.jar
[INFO] Checking legal files in: api-util-1.0.1-SNAPSHOT-sources.jar
[INFO] Checking legal files in: api-util-1.0.1-SNAPSHOT-sources.jar
[INFO] Checking legal files in: api-util-1.0.1-SNAPSHOT-sources.jar
[INFO] 
[INFO] --- forbiddenapis:2.2:check (default) @ api-util ---
[INFO] Scanning for classes to check...
[INFO] Reading bundled API signatures: jdk-unsafe-1.7
[INFO] Reading bundled API signatures: jdk-deprecated-1.7
[INFO] Loading classes to check...
[INFO] Scanning classes for violations...
[INFO] Scanned 46 (and 308 related) class file(s) for forbidden API invocations (in 0.07s),
0 error(s).
[PMD] No report found for mojo check
[INFO] 
[INFO] --- forbiddenapis:2.2:testCheck (default) @ api-util ---
[INFO] Scanning for classes to check...
[INFO] Reading bundled API signatures: jdk-unsafe-1.7
[INFO] Reading bundled API signatures: jdk-deprecated-1.7
[INFO] Loading classes to check...
[INFO] Scanning classes for violations...
[INFO] Scanned 14 (and 264 related) class file(s) for forbidden API invocations (in 0.04s),
0 error(s).
[INFO] 
[INFO] --- maven-install-plugin:2.5.2:install (default-install) @ api-util ---
[INFO] Installing <https://builds.apache.org/job/dir-shared-ubuntu-deploy/ws/trunk/util/target/api-util-1.0.1-SNAPSHOT.jar>
to <https://builds.apache.org/job/dir-shared-ubuntu-deploy/ws/.repository/org/apache/directory/api/api-util/1.0.1-SNAPSHOT/api-util-1.0.1-SNAPSHOT.jar>
[INFO] Installing <https://builds.apache.org/job/dir-shared-ubuntu-deploy/ws/trunk/util/pom.xml>
to <https://builds.apache.org/job/dir-shared-ubuntu-deploy/ws/.repository/org/apache/directory/api/api-util/1.0.1-SNAPSHOT/api-util-1.0.1-SNAPSHOT.pom>
[INFO] Installing <https://builds.apache.org/job/dir-shared-ubuntu-deploy/ws/trunk/util/target/api-util-1.0.1-SNAPSHOT-sources.jar>
to <https://builds.apache.org/job/dir-shared-ubuntu-deploy/ws/.repository/org/apache/directory/api/api-util/1.0.1-SNAPSHOT/api-util-1.0.1-SNAPSHOT-sources.jar>
[INFO] Installing <https://builds.apache.org/job/dir-shared-ubuntu-deploy/ws/trunk/util/target/api-util-1.0.1-SNAPSHOT-sources.jar>
to <https://builds.apache.org/job/dir-shared-ubuntu-deploy/ws/.repository/org/apache/directory/api/api-util/1.0.1-SNAPSHOT/api-util-1.0.1-SNAPSHOT-sources.jar>
[INFO] Installing <https://builds.apache.org/job/dir-shared-ubuntu-deploy/ws/trunk/util/target/api-util-1.0.1-SNAPSHOT-sources.jar>
to <https://builds.apache.org/job/dir-shared-ubuntu-deploy/ws/.repository/org/apache/directory/api/api-util/1.0.1-SNAPSHOT/api-util-1.0.1-SNAPSHOT-sources.jar>
[INFO] 
[INFO] --- maven-bundle-plugin:3.3.0:install (default-install) @ api-util ---
[INFO] Installing org/apache/directory/api/api-util/1.0.1-SNAPSHOT/api-util-1.0.1-SNAPSHOT.jar
[INFO] Writing OBR metadata
[INFO] 
[INFO] --- maven-deploy-plugin:2.8.2:deploy (default-deploy) @ api-util ---
[INFO] Downloading: https://repository.apache.org/content/repositories/snapshots/org/apache/directory/api/api-util/1.0.1-SNAPSHOT/maven-metadata.xml
[WARNING] Could not validate integrity of download from https://repository.apache.org/content/repositories/snapshots/org/apache/directory/api/api-util/1.0.1-SNAPSHOT/maven-metadata.xml:
Checksum validation failed, no checksums available
[WARNING] Checksum validation failed, no checksums available for https://repository.apache.org/content/repositories/snapshots/org/apache/directory/api/api-util/1.0.1-SNAPSHOT/maven-metadata.xml
[INFO] Downloaded: https://repository.apache.org/content/repositories/snapshots/org/apache/directory/api/api-util/1.0.1-SNAPSHOT/maven-metadata.xml
(1000 B at 0.5 KB/sec)
[INFO] Uploading: https://repository.apache.org/content/repositories/snapshots/org/apache/directory/api/api-util/1.0.1-SNAPSHOT/api-util-1.0.1-20170823.012522-13.jar
[INFO] Uploading: https://repository.apache.org/content/repositories/snapshots/org/apache/directory/api/api-util/1.0.1-SNAPSHOT/api-util-1.0.1-20170823.012522-13.pom
[INFO] ------------------------------------------------------------------------
[INFO] Reactor Summary:
[INFO] 
[INFO] Apache Directory LDAP API .......................... SUCCESS [ 25.136 s]
[INFO] Apache Directory LDAP API I18n ..................... SUCCESS [ 22.601 s]
[INFO] Apache Directory LDAP API Utilities ................ FAILURE [ 25.538 s]
[INFO] Apache Directory API ASN.1 Parent .................. SKIPPED
[INFO] Apache Directory API ASN.1 API ..................... SKIPPED
[INFO] Apache Directory API ASN.1 BER ..................... SKIPPED
[INFO] Apache Directory LDAP API Parent ................... SKIPPED
[INFO] Apache Directory LDAP API Model .................... SKIPPED
[INFO] Apache Directory LDAP API Codec Parent ............. SKIPPED
[INFO] Apache Directory LDAP API Codec Core ............... SKIPPED
[INFO] Apache Directory LDAP API Net Parent ............... SKIPPED
[INFO] Apache Directory LDAP API Network MINA ............. SKIPPED
[INFO] Apache Directory LDAP API Extras ................... SKIPPED
[INFO] Apache Directory LDAP API Extras Codec API ......... SKIPPED
[INFO] Apache Directory LDAP API Extras Codec ............. SKIPPED
[INFO] Apache Directory LDAP API Codec Standalone ......... SKIPPED
[INFO] Apache Directory LDAP API DSML Parent .............. SKIPPED
[INFO] Apache Directory LDAP API DSML Parser .............. SKIPPED
[INFO] Apache Directory LDAP API Extras ACI ............... SKIPPED
[INFO] Apache Directory LDAP API Schema Parent ............ SKIPPED
[INFO] Apache Directory LDAP API Schema Data .............. SKIPPED
[INFO] Apache Directory LDAP API Client Parent ............ SKIPPED
[INFO] Apache Directory LDAP API Client API ............... SKIPPED
[INFO] Apache Directory LDAP API DSML Engine .............. SKIPPED
[INFO] Apache Directory LDAP API Extras Util .............. SKIPPED
[INFO] Apache Directory LDAP API Extras Stored Procedures . SKIPPED
[INFO] Apache Directory LDAP API Extras Trigger ........... SKIPPED
[INFO] Apache Directory LDAP API Schema Converter ......... SKIPPED
[INFO] Apache Directory API All ........................... SKIPPED
[INFO] Apache Directory LDAP API Client All ............... SKIPPED
[INFO] Apache Directory API Integration Tests ............. SKIPPED
[INFO] Apache Directory API OSGi Integration Tests ........ SKIPPED
[INFO] Apache Directory API OSGi Integration Tests 2 ...... SKIPPED
[INFO] Apache Directory LDAP API Distribution ............. SKIPPED
[INFO] ------------------------------------------------------------------------
[INFO] BUILD FAILURE
[INFO] ------------------------------------------------------------------------
[INFO] Total time: 01:50 min
[INFO] Finished at: 2017-08-23T01:25:51+00:00
[INFO] Final Memory: 47M/404M
[INFO] ------------------------------------------------------------------------
[ERROR] Failed to execute goal org.apache.maven.plugins:maven-deploy-plugin:2.8.2:deploy (default-deploy)
on project api-util: Failed to deploy artifacts: Could not transfer artifact org.apache.directory.api:api-util:jar:1.0.1-20170823.012522-13
from/to apache.snapshots.https (https://repository.apache.org/content/repositories/snapshots):
repository.apache.org: Unknown host repository.apache.org -> [Help 1]
[ERROR] 
[ERROR] To see the full stack trace of the errors, re-run Maven with the -e switch.
[ERROR] Re-run Maven using the -X switch to enable full debug logging.
[ERROR] 
[ERROR] For more information about the errors and possible solutions, please read the following
articles:
[ERROR] [Help 1] http://cwiki.apache.org/confluence/display/MAVEN/MojoExecutionException
[ERROR] 
[ERROR] After correcting the problems, you can resume the build with the command
[ERROR]   mvn <goals> -rf :api-util
[JENKINS] Archiving <https://builds.apache.org/job/dir-shared-ubuntu-deploy/ws/trunk/distribution/pom.xml>
to org.apache.directory.api/apache-ldap-api/1.0.1-SNAPSHOT/apache-ldap-api-1.0.1-SNAPSHOT.pom
[JENKINS] Archiving <https://builds.apache.org/job/dir-shared-ubuntu-deploy/ws/trunk/all/pom.xml>
to org.apache.directory.api/api-all/1.0.1-SNAPSHOT/api-all-1.0.1-SNAPSHOT.pom
[JENKINS] Archiving <https://builds.apache.org/job/dir-shared-ubuntu-deploy/ws/trunk/ldap/client/api/pom.xml>
to org.apache.directory.api/api-ldap-client-api/1.0.1-SNAPSHOT/api-ldap-client-api-1.0.1-SNAPSHOT.pom
[JENKINS] Archiving <https://builds.apache.org/job/dir-shared-ubuntu-deploy/ws/trunk/ldap/client/all/pom.xml>
to org.apache.directory.api/api-ldap-client-all/1.0.1-SNAPSHOT/api-ldap-client-all-1.0.1-SNAPSHOT.pom
[JENKINS] Archiving <https://builds.apache.org/job/dir-shared-ubuntu-deploy/ws/trunk/dsml/parser/pom.xml>
to org.apache.directory.api/api-dsml-parser/1.0.1-SNAPSHOT/api-dsml-parser-1.0.1-SNAPSHOT.pom
[JENKINS] Archiving <https://builds.apache.org/job/dir-shared-ubuntu-deploy/ws/trunk/util/pom.xml>
to org.apache.directory.api/api-util/1.0.1-SNAPSHOT/api-util-1.0.1-SNAPSHOT.pom
[JENKINS] Archiving <https://builds.apache.org/job/dir-shared-ubuntu-deploy/ws/trunk/util/target/api-util-1.0.1-SNAPSHOT.jar>
to org.apache.directory.api/api-util/1.0.1-SNAPSHOT/api-util-1.0.1-SNAPSHOT.jar
[JENKINS] Archiving <https://builds.apache.org/job/dir-shared-ubuntu-deploy/ws/trunk/util/target/api-util-1.0.1-SNAPSHOT-sources.jar>
to org.apache.directory.api/api-util/1.0.1-SNAPSHOT/api-util-1.0.1-SNAPSHOT-sources.jar
[JENKINS] Archiving <https://builds.apache.org/job/dir-shared-ubuntu-deploy/ws/trunk/ldap/extras/codec-api/pom.xml>
to org.apache.directory.api/api-ldap-extras-codec-api/1.0.1-SNAPSHOT/api-ldap-extras-codec-api-1.0.1-SNAPSHOT.pom
[JENKINS] Archiving <https://builds.apache.org/job/dir-shared-ubuntu-deploy/ws/trunk/pom.xml>
to org.apache.directory.api/api-parent/1.0.1-SNAPSHOT/api-parent-1.0.1-SNAPSHOT.pom
[JENKINS] Archiving <https://builds.apache.org/job/dir-shared-ubuntu-deploy/ws/trunk/target/api-parent-1.0.1-SNAPSHOT-site.xml>
to org.apache.directory.api/api-parent/1.0.1-20170823.012421-13/api-parent-1.0.1-20170823.012421-13-site.xml
[JENKINS] Archiving <https://builds.apache.org/job/dir-shared-ubuntu-deploy/ws/trunk/ldap/schema/pom.xml>
to org.apache.directory.api/api-ldap-schema-parent/1.0.1-SNAPSHOT/api-ldap-schema-parent-1.0.1-SNAPSHOT.pom
[JENKINS] Archiving <https://builds.apache.org/job/dir-shared-ubuntu-deploy/ws/trunk/ldap/pom.xml>
to org.apache.directory.api/api-ldap-parent/1.0.1-SNAPSHOT/api-ldap-parent-1.0.1-SNAPSHOT.pom
[JENKINS] Archiving <https://builds.apache.org/job/dir-shared-ubuntu-deploy/ws/trunk/ldap/model/pom.xml>
to org.apache.directory.api/api-ldap-model/1.0.1-SNAPSHOT/api-ldap-model-1.0.1-SNAPSHOT.pom
[JENKINS] Archiving <https://builds.apache.org/job/dir-shared-ubuntu-deploy/ws/trunk/integ/pom.xml>
to org.apache.directory.api/api-integ/1.0.1-SNAPSHOT/api-integ-1.0.1-SNAPSHOT.pom
[JENKINS] Archiving <https://builds.apache.org/job/dir-shared-ubuntu-deploy/ws/trunk/ldap/extras/codec/pom.xml>
to org.apache.directory.api/api-ldap-extras-codec/1.0.1-SNAPSHOT/api-ldap-extras-codec-1.0.1-SNAPSHOT.pom
[JENKINS] Archiving <https://builds.apache.org/job/dir-shared-ubuntu-deploy/ws/trunk/asn1/pom.xml>
to org.apache.directory.api/api-asn1-parent/1.0.1-SNAPSHOT/api-asn1-parent-1.0.1-SNAPSHOT.pom
[JENKINS] Archiving <https://builds.apache.org/job/dir-shared-ubuntu-deploy/ws/trunk/ldap/schema/data/pom.xml>
to org.apache.directory.api/api-ldap-schema-data/1.0.1-SNAPSHOT/api-ldap-schema-data-1.0.1-SNAPSHOT.pom
[JENKINS] Archiving <https://builds.apache.org/job/dir-shared-ubuntu-deploy/ws/trunk/dsml/engine/pom.xml>
to org.apache.directory.api/api-dsml-engine/1.0.1-SNAPSHOT/api-dsml-engine-1.0.1-SNAPSHOT.pom
[JENKINS] Archiving <https://builds.apache.org/job/dir-shared-ubuntu-deploy/ws/trunk/ldap/extras/sp/pom.xml>
to org.apache.directory.api/api-ldap-extras-sp/1.0.1-SNAPSHOT/api-ldap-extras-sp-1.0.1-SNAPSHOT.pom
[JENKINS] Archiving <https://builds.apache.org/job/dir-shared-ubuntu-deploy/ws/trunk/dsml/pom.xml>
to org.apache.directory.api/api-dsml-parent/1.0.1-SNAPSHOT/api-dsml-parent-1.0.1-SNAPSHOT.pom
[JENKINS] Archiving <https://builds.apache.org/job/dir-shared-ubuntu-deploy/ws/trunk/integ-osgi/pom.xml>
to org.apache.directory.api/api-integ-osgi/1.0.1-SNAPSHOT/api-integ-osgi-1.0.1-SNAPSHOT.pom
[JENKINS] Archiving <https://builds.apache.org/job/dir-shared-ubuntu-deploy/ws/trunk/asn1/api/pom.xml>
to org.apache.directory.api/api-asn1-api/1.0.1-SNAPSHOT/api-asn1-api-1.0.1-SNAPSHOT.pom
[JENKINS] Archiving <https://builds.apache.org/job/dir-shared-ubuntu-deploy/ws/trunk/ldap/net/mina/pom.xml>
to org.apache.directory.api/api-ldap-net-mina/1.0.1-SNAPSHOT/api-ldap-net-mina-1.0.1-SNAPSHOT.pom
[JENKINS] Archiving <https://builds.apache.org/job/dir-shared-ubuntu-deploy/ws/trunk/ldap/codec/pom.xml>
to org.apache.directory.api/api-ldap-codec-parent/1.0.1-SNAPSHOT/api-ldap-codec-parent-1.0.1-SNAPSHOT.pom
[JENKINS] Archiving <https://builds.apache.org/job/dir-shared-ubuntu-deploy/ws/trunk/ldap/net/pom.xml>
to org.apache.directory.api/api-ldap-net-parent/1.0.1-SNAPSHOT/api-ldap-net-parent-1.0.1-SNAPSHOT.pom
[JENKINS] Archiving <https://builds.apache.org/job/dir-shared-ubuntu-deploy/ws/trunk/ldap/schema/converter/pom.xml>
to org.apache.directory.api/api-ldap-schema-converter/1.0.1-SNAPSHOT/api-ldap-schema-converter-1.0.1-SNAPSHOT.pom
[JENKINS] Archiving <https://builds.apache.org/job/dir-shared-ubuntu-deploy/ws/trunk/ldap/client/pom.xml>
to org.apache.directory.api/api-ldap-client-parent/1.0.1-SNAPSHOT/api-ldap-client-parent-1.0.1-SNAPSHOT.pom
[JENKINS] Archiving <https://builds.apache.org/job/dir-shared-ubuntu-deploy/ws/trunk/asn1/ber/pom.xml>
to org.apache.directory.api/api-asn1-ber/1.0.1-SNAPSHOT/api-asn1-ber-1.0.1-SNAPSHOT.pom
[JENKINS] Archiving <https://builds.apache.org/job/dir-shared-ubuntu-deploy/ws/trunk/ldap/extras/pom.xml>
to org.apache.directory.api/api-ldap-extras-parent/1.0.1-SNAPSHOT/api-ldap-extras-parent-1.0.1-SNAPSHOT.pom
[JENKINS] Archiving <https://builds.apache.org/job/dir-shared-ubuntu-deploy/ws/trunk/ldap/extras/util/pom.xml>
to org.apache.directory.api/api-ldap-extras-util/1.0.1-SNAPSHOT/api-ldap-extras-util-1.0.1-SNAPSHOT.pom
[JENKINS] Archiving <https://builds.apache.org/job/dir-shared-ubuntu-deploy/ws/trunk/ldap/codec/core/pom.xml>
to org.apache.directory.api/api-ldap-codec-core/1.0.1-SNAPSHOT/api-ldap-codec-core-1.0.1-SNAPSHOT.pom
[JENKINS] Archiving <https://builds.apache.org/job/dir-shared-ubuntu-deploy/ws/trunk/ldap/codec/standalone/pom.xml>
to org.apache.directory.api/api-ldap-codec-standalone/1.0.1-SNAPSHOT/api-ldap-codec-standalone-1.0.1-SNAPSHOT.pom
[JENKINS] Archiving <https://builds.apache.org/job/dir-shared-ubuntu-deploy/ws/trunk/ldap/extras/trigger/pom.xml>
to org.apache.directory.api/api-ldap-extras-trigger/1.0.1-SNAPSHOT/api-ldap-extras-trigger-1.0.1-SNAPSHOT.pom
[JENKINS] Archiving <https://builds.apache.org/job/dir-shared-ubuntu-deploy/ws/trunk/integ-osgi2/pom.xml>
to org.apache.directory.api/api-integ-osgi2/1.0.1-SNAPSHOT/api-integ-osgi2-1.0.1-SNAPSHOT.pom
[JENKINS] Archiving <https://builds.apache.org/job/dir-shared-ubuntu-deploy/ws/trunk/i18n/pom.xml>
to org.apache.directory.api/api-i18n/1.0.1-SNAPSHOT/api-i18n-1.0.1-SNAPSHOT.pom
[JENKINS] Archiving <https://builds.apache.org/job/dir-shared-ubuntu-deploy/ws/trunk/i18n/target/api-i18n-1.0.1-SNAPSHOT.jar>
to org.apache.directory.api/api-i18n/1.0.1-20170823.012444-13/api-i18n-1.0.1-20170823.012444-13.jar
[JENKINS] Archiving <https://builds.apache.org/job/dir-shared-ubuntu-deploy/ws/trunk/i18n/target/api-i18n-1.0.1-SNAPSHOT-sources.jar>
to org.apache.directory.api/api-i18n/1.0.1-20170823.012444-13/api-i18n-1.0.1-20170823.012444-13-sources.jar
[JENKINS] Archiving <https://builds.apache.org/job/dir-shared-ubuntu-deploy/ws/trunk/ldap/extras/aci/pom.xml>
to org.apache.directory.api/api-ldap-extras-aci/1.0.1-SNAPSHOT/api-ldap-extras-aci-1.0.1-SNAPSHOT.pom
Sending e-mails to: notifications@directory.apache.org
channel stopped

Mime
View raw message