directory-notifications mailing list archives

Site index · List index
Message view « Date » · « Thread »
Top « Date » · « Thread »
From Apache Jenkins Server <jenk...@builds.apache.org>
Subject Build failed in Jenkins: dir-studio-ui-tests-in-docker #69
Date Tue, 29 Aug 2017 14:17:54 GMT
See <https://builds.apache.org/job/dir-studio-ui-tests-in-docker/69/display/redirect?page=changes>

Changes:

[elecharny] Removed a duplicated template (item)

------------------------------------------
[...truncated 1.86 MB...]
	at org.apache.directory.studio.test.integration.ui.ApacheDSPluginTest.createServer(ApacheDSPluginTest.java:154)
	at org.apache.directory.studio.test.integration.ui.ApacheDSPluginTest.testSetEnabledProtocols(ApacheDSPluginTest.java:436)

serverCreationStartCreateConnectionStopAndDeletion(org.apache.directory.studio.test.integration.ui.ApacheDSPluginTest)
 Time elapsed: 0.503 sec  <<< FAILURE!
java.lang.AssertionError: expected:<0> but was:<1>
	at org.junit.Assert.fail(Assert.java:88)
	at org.junit.Assert.failNotEquals(Assert.java:834)
	at org.junit.Assert.assertEquals(Assert.java:645)
	at org.junit.Assert.assertEquals(Assert.java:631)
	at org.apache.directory.studio.test.integration.ui.ApacheDSPluginTest.createServer(ApacheDSPluginTest.java:154)
	at org.apache.directory.studio.test.integration.ui.ApacheDSPluginTest.serverCreationStartCreateConnectionStopAndDeletion(ApacheDSPluginTest.java:92)

Running org.apache.directory.studio.test.integration.ui.BrowserTest
Tests run: 12, Failures: 1, Errors: 0, Skipped: 0, Time elapsed: 118.169 sec <<<
FAILURE! - in org.apache.directory.studio.test.integration.ui.BrowserTest
testBookmark(org.apache.directory.studio.test.integration.ui.BrowserTest)  Time elapsed: 3.37
sec
testRefreshRootDSE(org.apache.directory.studio.test.integration.ui.BrowserTest)  Time elapsed:
11.779 sec
TestSetInputOnlyOnce(org.apache.directory.studio.test.integration.ui.BrowserTest)  Time elapsed:
8.263 sec  <<< FAILURE!
org.junit.ComparisonFailure: expected:<uid=user.[2]> but was:<uid=user.[3]>
	at org.junit.Assert.assertEquals(Assert.java:115)
	at org.junit.Assert.assertEquals(Assert.java:144)
	at org.apache.directory.studio.test.integration.ui.BrowserTest.TestSetInputOnlyOnce(BrowserTest.java:614)

testBrowseDnWithIpHostNumber(org.apache.directory.studio.test.integration.ui.BrowserTest)
 Time elapsed: 4.909 sec
testRefreshParent(org.apache.directory.studio.test.integration.ui.BrowserTest)  Time elapsed:
7.99 sec
testCopyPasteValueToBookmark(org.apache.directory.studio.test.integration.ui.BrowserTest)
 Time elapsed: 5.899 sec
testRefreshSearchContinuation(org.apache.directory.studio.test.integration.ui.BrowserTest)
 Time elapsed: 11.361 sec
testDeleteDontUpdateUI(org.apache.directory.studio.test.integration.ui.BrowserTest)  Time
elapsed: 9.378 sec
testBrowseDnWithSharpAndHexSequence(org.apache.directory.studio.test.integration.ui.BrowserTest)
 Time elapsed: 4.411 sec
testNoModificationWhileBrowsingAndRefreshing(org.apache.directory.studio.test.integration.ui.BrowserTest)
 Time elapsed: 15.599 sec
testRefreshContextEntry(org.apache.directory.studio.test.integration.ui.BrowserTest)  Time
elapsed: 8.981 sec
testOnlyOneSearchRequestWhenExpandingEntry(org.apache.directory.studio.test.integration.ui.BrowserTest)
 Time elapsed: 4.119 sec
Running org.apache.directory.studio.test.integration.ui.SwtResourcesTest
### SWT resouces count: 526
Tests run: 2, Failures: 1, Errors: 0, Skipped: 0, Time elapsed: 127.999 sec <<< FAILURE!
- in org.apache.directory.studio.test.integration.ui.SwtResourcesTest
testSwtResourcesCount(org.apache.directory.studio.test.integration.ui.SwtResourcesTest)  Time
elapsed: 2.855 sec
testSwtResourcesDelta(org.apache.directory.studio.test.integration.ui.SwtResourcesTest)  Time
elapsed: 91.256 sec  <<< FAILURE!
java.lang.AssertionError: Too many SWT resources were allocated in testSwtResourcesDelta:
before=558, after=606
	at org.junit.Assert.fail(Assert.java:88)
	at org.junit.Assert.assertTrue(Assert.java:41)
	at org.apache.directory.studio.test.integration.ui.SwtResourcesTest.testSwtResourcesDelta(SwtResourcesTest.java:108)

Running org.apache.directory.studio.test.integration.ui.SchemaBrowserTest
Tests run: 1, Failures: 0, Errors: 0, Skipped: 0, Time elapsed: 12.449 sec - in org.apache.directory.studio.test.integration.ui.SchemaBrowserTest
testRawSchemaDefinitionIsFilled(org.apache.directory.studio.test.integration.ui.SchemaBrowserTest)
 Time elapsed: 3.756 sec
Running org.apache.directory.studio.test.integration.ui.ReferralDialogTest
Tests run: 5, Failures: 0, Errors: 0, Skipped: 0, Time elapsed: 34.859 sec - in org.apache.directory.studio.test.integration.ui.ReferralDialogTest
testBrowseAndFollowManuallyContinuationReference(org.apache.directory.studio.test.integration.ui.ReferralDialogTest)
 Time elapsed: 5.155 sec
testBrowseAndFollowContinuationReference(org.apache.directory.studio.test.integration.ui.ReferralDialogTest)
 Time elapsed: 5.407 sec
testBrowseAndCancelFollowingContinuationReference(org.apache.directory.studio.test.integration.ui.ReferralDialogTest)
 Time elapsed: 4.569 sec
testBrowseAndIgnoreReferral(org.apache.directory.studio.test.integration.ui.ReferralDialogTest)
 Time elapsed: 3.941 sec
testBrowseAndManageReferralEntry(org.apache.directory.studio.test.integration.ui.ReferralDialogTest)
 Time elapsed: 4.7 sec
Running org.apache.directory.studio.test.integration.ui.PreferencesTest
Tests run: 2, Failures: 0, Errors: 0, Skipped: 0, Time elapsed: 10.4 sec - in org.apache.directory.studio.test.integration.ui.PreferencesTest
testCertificatValidationSettingsSaved(org.apache.directory.studio.test.integration.ui.PreferencesTest)
 Time elapsed: 0.666 sec
testCertificatValidationPage(org.apache.directory.studio.test.integration.ui.PreferencesTest)
 Time elapsed: 0.829 sec
Running org.apache.directory.studio.test.integration.ui.SearchTest
Tests run: 3, Failures: 0, Errors: 0, Skipped: 0, Time elapsed: 30.935 sec - in org.apache.directory.studio.test.integration.ui.SearchTest
testOnlyOneUiUpdateOnQuickSearch(org.apache.directory.studio.test.integration.ui.SearchTest)
 Time elapsed: 6.366 sec
testRefresh(org.apache.directory.studio.test.integration.ui.SearchTest)  Time elapsed: 8.261
sec
testCopyPasteSearchBetweenConnections(org.apache.directory.studio.test.integration.ui.SearchTest)
 Time elapsed: 7.309 sec
Running org.apache.directory.studio.test.integration.ui.RenameEntryDialogTest
Tests run: 4, Failures: 3, Errors: 0, Skipped: 0, Time elapsed: 31.998 sec <<< FAILURE!
- in org.apache.directory.studio.test.integration.ui.RenameEntryDialogTest
testRenameMultiValuedRdn(org.apache.directory.studio.test.integration.ui.RenameEntryDialogTest)
 Time elapsed: 6.415 sec
testRenameRdnWithEscapedCharacters(org.apache.directory.studio.test.integration.ui.RenameEntryDialogTest)
 Time elapsed: 4.812 sec  <<< FAILURE!
java.lang.AssertionError: null
	at org.junit.Assert.fail(Assert.java:86)
	at org.junit.Assert.assertTrue(Assert.java:41)
	at org.junit.Assert.assertTrue(Assert.java:52)
	at org.apache.directory.studio.test.integration.ui.RenameEntryDialogTest.testRenameRdnWithEscapedCharacters(RenameEntryDialogTest.java:117)

testRenameRdnWithTrailingSpace(org.apache.directory.studio.test.integration.ui.RenameEntryDialogTest)
 Time elapsed: 4.735 sec  <<< FAILURE!
java.lang.AssertionError: null
	at org.junit.Assert.fail(Assert.java:86)
	at org.junit.Assert.assertTrue(Assert.java:41)
	at org.junit.Assert.assertTrue(Assert.java:52)
	at org.apache.directory.studio.test.integration.ui.RenameEntryDialogTest.testRenameRdnWithTrailingSpace(RenameEntryDialogTest.java:159)

testRenameRdnWithSharp(org.apache.directory.studio.test.integration.ui.RenameEntryDialogTest)
 Time elapsed: 4.821 sec  <<< FAILURE!
java.lang.AssertionError: null
	at org.junit.Assert.fail(Assert.java:86)
	at org.junit.Assert.assertTrue(Assert.java:41)
	at org.junit.Assert.assertTrue(Assert.java:52)
	at org.apache.directory.studio.test.integration.ui.RenameEntryDialogTest.testRenameRdnWithSharp(RenameEntryDialogTest.java:139)

Running org.apache.directory.studio.test.integration.ui.NewEntryWizardTest
Tests run: 8, Failures: 0, Errors: 0, Skipped: 0, Time elapsed: 74.845 sec - in org.apache.directory.studio.test.integration.ui.NewEntryWizardTest
testCreatePersonEntry(org.apache.directory.studio.test.integration.ui.NewEntryWizardTest)
 Time elapsed: 6.487 sec
testCreateEntryBelowReferralObjectCancel(org.apache.directory.studio.test.integration.ui.NewEntryWizardTest)
 Time elapsed: 7.305 sec
testCreateEntryBelowReferralObjectFollow(org.apache.directory.studio.test.integration.ui.NewEntryWizardTest)
 Time elapsed: 7.036 sec
testCreateOrganizationEntry(org.apache.directory.studio.test.integration.ui.NewEntryWizardTest)
 Time elapsed: 6.381 sec
testCreateEntryWithSharp(org.apache.directory.studio.test.integration.ui.NewEntryWizardTest)
 Time elapsed: 6.7 sec
testCreateEntryWithSlash(org.apache.directory.studio.test.integration.ui.NewEntryWizardTest)
 Time elapsed: 6.655 sec
testCreateUpperCaseOrganizationEntries(org.apache.directory.studio.test.integration.ui.NewEntryWizardTest)
 Time elapsed: 8.334 sec
testCreateMvRdnWithNumericOid(org.apache.directory.studio.test.integration.ui.NewEntryWizardTest)
 Time elapsed: 6.601 sec

Results :

Failed tests: 
  SchemaEditorSearchTest.testSearchForAliases:80 
Expected: <1>
     but: was <0>
  ApacheDSPluginTest.verifyServerNameCollisionInNewWizard:191 expected:<0> but was:<1>
  ApacheDSPluginTest.testSetEnabledProtocols:436->createServer:154 expected:<0> but
was:<1>
  ApacheDSPluginTest.serverCreationStartCreateConnectionStopAndDeletion:92->createServer:154
expected:<0> but was:<1>
  BrowserTest.TestSetInputOnlyOnce:614 expected:<uid=user.[2]> but was:<uid=user.[3]>
  SwtResourcesTest.testSwtResourcesDelta:108 Too many SWT resources were allocated in testSwtResourcesDelta:
before=558, after=606
  RenameEntryDialogTest.testRenameRdnWithEscapedCharacters:117 null
  RenameEntryDialogTest.testRenameRdnWithTrailingSpace:159 null
  RenameEntryDialogTest.testRenameRdnWithSharp:139 null

Tests in error: 
  CertificateValidationTest.testLdapsCertificateTrustPermanent:365 » Timeout Tim...
  CertificateValidationTest.testLdapsCertificateTrustTemporary:316 » Timeout Tim...
  CertificateValidationTest.testLdapsCertificateDoNotTrust:255 » Timeout Timeout...
  CertificateValidationTest.testStartTlsCertificateValidationExpired:458 » Timeout
  CertificateValidationTest.testLdapsCertificateValidationNotOK:212 » Timeout Ti...
  CertificateValidationTest.testStartTlsCertificateTrustPermanent:725 » Timeout ...
  CertificateValidationTest.testStartTlsCertificateValidationOK:414 » Timeout Ti...
  CertificateValidationTest.testStartTlsCertificateValidationHostnameMismatch:550 » Timeout
  CertificateValidationTest.testLdapsCertificateValidationOK:174 » Timeout Timeo...
  CertificateValidationTest.testStartTlsCertificateDoNotTrust:596 » Timeout Time...
  ApacheDSPluginTest.repairAndStartAndStop:415 » Timeout Timeout after: 60000 ms...

Tests run: 227, Failures: 9, Errors: 11, Skipped: 0

Caught unexpected exception during test framework shutdown
org.eclipse.swt.SWTException: Failed to execute runnable (org.eclipse.swt.SWTException: Widget
is disposed)
	at org.eclipse.swt.SWT.error(SWT.java:4533)
	at org.eclipse.swt.SWT.error(SWT.java:4448)
	at org.eclipse.swt.widgets.Synchronizer.runAsyncMessages(Synchronizer.java:185)
	at org.eclipse.swt.widgets.Display.runAsyncMessages(Display.java:4536)
	at org.eclipse.swt.widgets.Display.readAndDispatch(Display.java:4154)
	at org.eclipse.swt.widgets.Display.release(Display.java:4206)
	at org.eclipse.swt.graphics.Device.dispose(Device.java:266)
	at org.apache.directory.studio.Application.start(Application.java:63)
	at org.eclipse.tycho.surefire.osgibooter.UITestApplication.runApplication(UITestApplication.java:31)
	at org.eclipse.tycho.surefire.osgibooter.AbstractUITestApplication.run(AbstractUITestApplication.java:120)
	at org.eclipse.tycho.surefire.osgibooter.UITestApplication.start(UITestApplication.java:37)
	at org.eclipse.equinox.internal.app.EclipseAppHandle.run(EclipseAppHandle.java:196)
	at org.eclipse.core.runtime.internal.adaptor.EclipseAppLauncher.runApplication(EclipseAppLauncher.java:134)
	at org.eclipse.core.runtime.internal.adaptor.EclipseAppLauncher.start(EclipseAppLauncher.java:104)
	at org.eclipse.core.runtime.adaptor.EclipseStarter.run(EclipseStarter.java:388)
	at org.eclipse.core.runtime.adaptor.EclipseStarter.run(EclipseStarter.java:243)
	at sun.reflect.NativeMethodAccessorImpl.invoke0(Native Method)
	at sun.reflect.NativeMethodAccessorImpl.invoke(NativeMethodAccessorImpl.java:62)
	at sun.reflect.DelegatingMethodAccessorImpl.invoke(DelegatingMethodAccessorImpl.java:43)
	at java.lang.reflect.Method.invoke(Method.java:498)
	at org.eclipse.equinox.launcher.Main.invokeFramework(Main.java:673)
	at org.eclipse.equinox.launcher.Main.basicRun(Main.java:610)
	at org.eclipse.equinox.launcher.Main.run(Main.java:1519)
	at org.eclipse.equinox.launcher.Main.main(Main.java:1492)
Caused by: org.eclipse.swt.SWTException: Widget is disposed
	at org.eclipse.swt.SWT.error(SWT.java:4533)
	at org.eclipse.swt.SWT.error(SWT.java:4448)
	at org.eclipse.swt.SWT.error(SWT.java:4419)
	at org.eclipse.swt.widgets.Widget.error(Widget.java:483)
	at org.eclipse.swt.widgets.Widget.checkWidget(Widget.java:420)
	at org.eclipse.swt.widgets.Tree.getSelection(Tree.java:1775)
	at org.eclipse.jface.viewers.TreeViewer.getSelection(TreeViewer.java:228)
	at org.eclipse.jface.viewers.TreeViewer.setSelection(TreeViewer.java:299)
	at org.eclipse.jface.viewers.AbstractTreeViewer.setSelectionToWidget(AbstractTreeViewer.java:2533)
	at org.eclipse.jface.viewers.AbstractTreeViewer.setSelectionToWidget(AbstractTreeViewer.java:2989)
	at org.eclipse.jface.viewers.StructuredViewer.preservingSelection(StructuredViewer.java:1465)
	at org.eclipse.jface.viewers.TreeViewer.preservingSelection(TreeViewer.java:354)
	at org.eclipse.jface.viewers.StructuredViewer.preservingSelection(StructuredViewer.java:1419)
	at org.eclipse.jface.viewers.StructuredViewer.refresh(StructuredViewer.java:1519)
	at org.eclipse.jface.viewers.ColumnViewer.refresh(ColumnViewer.java:523)
	at org.apache.directory.studio.ldapservers.views.ServersTableViewer$4.run(ServersTableViewer.java:251)
	at org.eclipse.swt.widgets.RunnableLock.run(RunnableLock.java:35)
	at org.eclipse.swt.widgets.Synchronizer.runAsyncMessages(Synchronizer.java:182)
	... 21 more
Job found still running after platform shutdown.  Jobs should be canceled by the plugin that
scheduled them during shutdown: org.eclipse.ui.internal.console.IOConsolePartitioner$QueueProcessingJob
Job found still running after platform shutdown.  Jobs should be canceled by the plugin that
scheduled them during shutdown: org.eclipse.debug.internal.ui.launchConfigurations.PerspectiveManager$2
Job found still running after platform shutdown.  Jobs should be canceled by the plugin that
scheduled them during shutdown: org.eclipse.ui.internal.console.ConsoleManager$1
Job found still running after platform shutdown.  Jobs should be canceled by the plugin that
scheduled them during shutdown: org.apache.directory.studio.ldapservers.jobs.StudioLdapServerJob
Job found still running after platform shutdown.  Jobs should be canceled by the plugin that
scheduled them during shutdown: org.eclipse.ui.internal.progress.AnimationManager$1
[INFO] ------------------------------------------------------------------------
[INFO] Reactor Summary:
[INFO] 
[INFO] Apache Directory Studio Parent ..................... SUCCESS [  0.879 s]
[INFO] Apache Directory Studio Target Platform for Eclipse  SUCCESS [  0.137 s]
[INFO] Apache Directory Studio Plugins .................... SUCCESS [  0.719 s]
[INFO] Apache Directory Studio Common UI .................. SUCCESS [  3.071 s]
[INFO] Apache Directory Studio Common Core ................ SUCCESS [  0.243 s]
[INFO] Apache Directory Studio LDIF Parser ................ SUCCESS [  1.815 s]
[INFO] Apache Directory Studio Connection Core ............ SUCCESS [  0.964 s]
[INFO] Apache Directory Studio Connection UI .............. SUCCESS [  0.823 s]
[INFO] Apache Directory Studio LDAP Browser Core .......... SUCCESS [  2.773 s]
[INFO] Apache Directory Studio LDAP Browser Common ........ SUCCESS [  2.758 s]
[INFO] Apache Directory Studio Value Editors .............. SUCCESS [  1.780 s]
[INFO] Apache Directory Studio ACI Item Editor ............ SUCCESS [  0.611 s]
[INFO] Apache Directory Studio ApacheDS Configuration ..... SUCCESS [  0.800 s]
[INFO] Apache Directory Studio LDIF Editor ................ SUCCESS [  0.641 s]
[INFO] Apache Directory Studio LDAP Browser UI ............ SUCCESS [  1.277 s]
[INFO] Apache Directory Studio LDAP Servers ............... SUCCESS [  0.436 s]
[INFO] Apache Directory Studio ApacheDS LDAP Server Adapter SUCCESS [  4.505 s]
[INFO] Apache Directory Studio RCP ........................ SUCCESS [  0.418 s]
[INFO] Apache Directory Studio Schema Editor .............. SUCCESS [  3.100 s]
[INFO] Apache Directory Studio OpenLDAP Common UI ......... SUCCESS [  1.264 s]
[INFO] Apache Directory Studio OpenLDAP Syncrepl .......... SUCCESS [  1.207 s]
[INFO] Apache Directory Studio OpenLDAP Configuration Editor SUCCESS [  2.491 s]
[INFO] Apache Directory Studio OpenLDAP ACL Configuration Editor SUCCESS [  2.455 s]
[INFO] Apache Directory Studio Template Editor ............ SUCCESS [  2.394 s]
[INFO] Apache Directory Studio Combined Editor ............ SUCCESS [  0.370 s]
[INFO] Apache Directory Studio SLF4J to Eclipse Log Binding SUCCESS [  0.110 s]
[INFO] Apache Directory Studio Help Plugins ............... SUCCESS [  0.022 s]
[INFO] Apache Directory Studio Apache DS Help ............. SUCCESS [  4.135 s]
[INFO] Apache Directory Studio LDAP Browser Help .......... SUCCESS [  8.697 s]
[INFO] Apache Directory Studio LDIF Editor Help ........... SUCCESS [  1.955 s]
[INFO] Apache Directory Studio RCP Help ................... SUCCESS [  1.923 s]
[INFO] Apache Directory Studio Schema Editor Help ......... SUCCESS [  2.501 s]
[INFO] Apache Directory Studio Feature Plugins ............ SUCCESS [  0.033 s]
[INFO] Apache Directory Studio ApacheDS Feature ........... SUCCESS [  0.161 s]
[INFO] Apache Directory Studio LDAP Browser Feature ....... SUCCESS [  0.125 s]
[INFO] Apache Directory Studio LDIF Editor Feature ........ SUCCESS [  0.092 s]
[INFO] Apache Directory Studio RCP Feature ................ SUCCESS [  0.178 s]
[INFO] Apache Directory Studio Schema Editor Feature ...... SUCCESS [  0.089 s]
[INFO] Apache Directory Studio OpenLDAP Feature ........... SUCCESS [  0.082 s]
[INFO] Apache Directory Studio National Language Support Feature SUCCESS [  0.375 s]
[INFO] Apache Directory Studio Test Plugins ............... SUCCESS [  0.014 s]
[INFO] Apache Directory Studio Core Integration Tests ..... SUCCESS [05:40 min]
[INFO] Apache Directory Studio UI Integration Tests ....... FAILURE [24:29 min]
[INFO] Apache Directory Studio P2 Repositories ............ SKIPPED
[INFO] Apache Directory Studio P2 Repository Dependencies . SKIPPED
[INFO] Apache Directory Studio P2 Repository Eclipse ...... SKIPPED
[INFO] Apache Directory Studio Product .................... SKIPPED
[INFO] Apache Directory Studio Installers ................. SKIPPED
[INFO] ------------------------------------------------------------------------
[INFO] BUILD FAILURE
[INFO] ------------------------------------------------------------------------
[INFO] Total time: 35:04 min
[INFO] Finished at: 2017-08-29T14:17:49+00:00
[INFO] Final Memory: 292M/3901M
[INFO] ------------------------------------------------------------------------
[ERROR] Failed to execute goal org.eclipse.tycho:tycho-surefire-plugin:0.24.0:test (default-test)
on project org.apache.directory.studio.test.integration.ui: There are test failures.
[ERROR] 
[ERROR] Please refer to /home/hnelson/studio/tests/test.integration.ui/target/surefire-reports
for the individual test results.
[ERROR] -> [Help 1]
[ERROR] 
[ERROR] To see the full stack trace of the errors, re-run Maven with the -e switch.
[ERROR] Re-run Maven using the -X switch to enable full debug logging.
[ERROR] 
[ERROR] For more information about the errors and possible solutions, please read the following
articles:
[ERROR] [Help 1] http://cwiki.apache.org/confluence/display/MAVEN/MojoFailureException
[ERROR] 
[ERROR] After correcting the problems, you can resume the build with the command
[ERROR]   mvn <goals> -rf :org.apache.directory.studio.test.integration.ui
Build step 'Execute shell' marked build as failure
Recording test results

Mime
View raw message