directory-notifications mailing list archives

Site index · List index
Message view « Date » · « Thread »
Top « Date » · « Thread »
From Apache Jenkins Server <jenk...@builds.apache.org>
Subject Build failed in Jenkins: dir-fortress-core-docker-openldap-test #391
Date Thu, 13 Jul 2017 12:46:47 GMT
See <https://builds.apache.org/job/dir-fortress-core-docker-openldap-test/391/display/redirect>

------------------------------------------
[...truncated 1.74 MB...]
2017-07-13 12:42:026 INFO  LogUtil:64 - CR-SESS-WRLS-TRST TU1_UPD TR1
2017-07-13 12:42:026 INFO  LogUtil:64 - PWMIN1 PLCY TP1 USR TU5
2017-07-13 12:42:026 INFO  LogUtil:64 - org.apache.directory.fortress.core.impl.TestUtils.sleep
for len=2000
2017-07-13 12:42:028 INFO  LogUtil:64 - org.apache.directory.fortress.core.impl.TestUtils.sleep
for len=2000
2017-07-13 12:42:030 INFO  LogUtil:64 - PWMIN2 PLCY TP1 USR TU5
2017-07-13 12:42:030 INFO  LogUtil:64 - org.apache.directory.fortress.core.impl.TestUtils.sleep
for len=3000
2017-07-13 12:42:033 INFO  LogUtil:64 - org.apache.directory.fortress.core.impl.TestUtils.sleep
for len=3000
2017-07-13 12:42:036 INFO  LogUtil:64 - PWMAX3 PLCY TP1 USR TU5
2017-07-13 12:42:036 INFO  LogUtil:64 - org.apache.directory.fortress.core.impl.TestUtils.sleep
for len=5000
2017-07-13 12:42:041 INFO  LogUtil:64 - org.apache.directory.fortress.core.impl.TestUtils.sleep
for len=1000
2017-07-13 12:42:042 INFO  LogUtil:64 - org.apache.directory.fortress.core.impl.TestUtils.sleep
for len=5000
2017-07-13 12:42:047 INFO  LogUtil:64 - org.apache.directory.fortress.core.impl.TestUtils.sleep
for len=1000
2017-07-13 12:42:048 INFO  LogUtil:64 - org.apache.directory.fortress.core.impl.TestUtils.sleep
for len=5000
2017-07-13 12:42:053 INFO  LogUtil:64 - org.apache.directory.fortress.core.impl.TestUtils.sleep
for len=1000
2017-07-13 12:42:054 INFO  LogUtil:64 - PWMAX4 PLCY TP1 USR TU5
2017-07-13 12:42:054 INFO  LogUtil:64 - org.apache.directory.fortress.core.impl.TestUtils.sleep
for len=2000
2017-07-13 12:42:056 INFO  LogUtil:64 - org.apache.directory.fortress.core.impl.TestUtils.sleep
for len=1000
2017-07-13 12:42:057 INFO  LogUtil:64 - org.apache.directory.fortress.core.impl.TestUtils.sleep
for len=2000
2017-07-13 12:42:059 INFO  LogUtil:64 - org.apache.directory.fortress.core.impl.TestUtils.sleep
for len=1000
2017-07-13 12:43:000 INFO  LogUtil:64 - org.apache.directory.fortress.core.impl.TestUtils.sleep
for len=2000
2017-07-13 12:43:002 INFO  LogUtil:64 - org.apache.directory.fortress.core.impl.TestUtils.sleep
for len=1000
2017-07-13 12:43:003 INFO  LogUtil:64 - PWHIST5 PLCY TP1 USR TU5
2017-07-13 12:43:003 INFO  LogUtil:64 - PWHIST6 PLCY TP1 USR TU5
2017-07-13 12:43:004 INFO  LogUtil:64 - PWLEN7 PLCY TP1 USR TU5
2017-07-13 12:43:004 INFO  LogUtil:64 - PWLEN8 PLCY TP1 USR TU5
2017-07-13 12:43:004 INFO  LogUtil:64 - PWEXP7 PLCY TP1 USR TU5
2017-07-13 12:43:004 INFO  LogUtil:64 - org.apache.directory.fortress.core.impl.TestUtils.sleep
for len=2000
2017-07-13 12:43:006 INFO  LogUtil:64 - org.apache.directory.fortress.core.impl.TestUtils.sleep
for len=1000
2017-07-13 12:43:007 INFO  LogUtil:64 - org.apache.directory.fortress.core.impl.TestUtils.sleep
for len=2000
2017-07-13 12:43:009 INFO  LogUtil:64 - PWEXP8 PLCY TP1 USR TU5
2017-07-13 12:43:009 INFO  LogUtil:64 - org.apache.directory.fortress.core.impl.TestUtils.sleep
for len=4000
2017-07-13 12:43:013 INFO  LogUtil:64 - org.apache.directory.fortress.core.impl.TestUtils.sleep
for len=1000
2017-07-13 12:43:014 INFO  LogUtil:64 - org.apache.directory.fortress.core.impl.TestUtils.sleep
for len=4000
2017-07-13 12:43:018 INFO  LogUtil:64 - PWGRACE9 PLCY TP1 USR TU5
2017-07-13 12:43:018 INFO  LogUtil:64 - org.apache.directory.fortress.core.impl.TestUtils.sleep
for len=6000
2017-07-13 12:43:024 INFO  LogUtil:64 - org.apache.directory.fortress.core.impl.TestUtils.sleep
for len=1000
2017-07-13 12:43:025 INFO  LogUtil:64 - org.apache.directory.fortress.core.impl.TestUtils.sleep
for len=1000
2017-07-13 12:43:026 INFO  LogUtil:64 - org.apache.directory.fortress.core.impl.TestUtils.sleep
for len=1000
2017-07-13 12:43:027 INFO  LogUtil:64 - org.apache.directory.fortress.core.impl.TestUtils.sleep
for len=1000
2017-07-13 12:43:028 INFO  LogUtil:64 - org.apache.directory.fortress.core.impl.TestUtils.sleep
for len=1000
2017-07-13 12:43:029 INFO  LogUtil:64 - org.apache.directory.fortress.core.impl.TestUtils.sleep
for len=1000
2017-07-13 12:43:030 INFO  LogUtil:64 - org.apache.directory.fortress.core.impl.TestUtils.sleep
for len=1000
2017-07-13 12:43:031 INFO  LogUtil:64 - org.apache.directory.fortress.core.impl.TestUtils.sleep
for len=1000
2017-07-13 12:43:032 INFO  LogUtil:64 - org.apache.directory.fortress.core.impl.TestUtils.sleep
for len=1000
2017-07-13 12:43:033 INFO  LogUtil:64 - org.apache.directory.fortress.core.impl.TestUtils.sleep
for len=1000
2017-07-13 12:43:034 INFO  LogUtil:64 - org.apache.directory.fortress.core.impl.TestUtils.sleep
for len=1000
2017-07-13 12:43:035 INFO  LogUtil:64 - PWGRACE10 PLCY TP1 USR TU5
2017-07-13 12:43:035 INFO  LogUtil:64 - org.apache.directory.fortress.core.impl.TestUtils.sleep
for len=5000
2017-07-13 12:43:040 INFO  LogUtil:64 - org.apache.directory.fortress.core.impl.TestUtils.sleep
for len=1000
2017-07-13 12:43:041 INFO  LogUtil:64 - org.apache.directory.fortress.core.impl.TestUtils.sleep
for len=1000
2017-07-13 12:43:042 INFO  LogUtil:64 - org.apache.directory.fortress.core.impl.TestUtils.sleep
for len=1000
2017-07-13 12:43:043 INFO  LogUtil:64 - org.apache.directory.fortress.core.impl.TestUtils.sleep
for len=1000
2017-07-13 12:43:044 INFO  LogUtil:64 - org.apache.directory.fortress.core.impl.TestUtils.sleep
for len=1000
2017-07-13 12:43:045 INFO  LogUtil:64 - org.apache.directory.fortress.core.impl.TestUtils.sleep
for len=1000
2017-07-13 12:43:046 INFO  LogUtil:64 - PWMAXFAILK11 PLCY TP1 USR TU5
2017-07-13 12:43:046 INFO  LogUtil:64 - org.apache.directory.fortress.core.impl.TestUtils.sleep
for len=1000
2017-07-13 12:43:047 INFO  LogUtil:64 - org.apache.directory.fortress.core.impl.TestUtils.sleep
for len=1000
2017-07-13 12:43:048 INFO  LogUtil:64 - org.apache.directory.fortress.core.impl.TestUtils.sleep
for len=1000
2017-07-13 12:43:049 INFO  LogUtil:64 - org.apache.directory.fortress.core.impl.TestUtils.sleep
for len=1000
2017-07-13 12:43:050 INFO  LogUtil:64 - org.apache.directory.fortress.core.impl.TestUtils.sleep
for len=1000
2017-07-13 12:43:051 INFO  LogUtil:64 - org.apache.directory.fortress.core.impl.TestUtils.sleep
for len=1000
2017-07-13 12:43:052 INFO  LogUtil:64 - org.apache.directory.fortress.core.impl.TestUtils.sleep
for len=1000
2017-07-13 12:43:053 INFO  LogUtil:64 - org.apache.directory.fortress.core.impl.TestUtils.sleep
for len=1000
2017-07-13 12:43:054 INFO  LogUtil:64 - org.apache.directory.fortress.core.impl.TestUtils.sleep
for len=1000
2017-07-13 12:43:055 INFO  LogUtil:64 - org.apache.directory.fortress.core.impl.TestUtils.sleep
for len=1000
2017-07-13 12:43:056 INFO  LogUtil:64 - PWMAXFAIL12 PLCY TP1 USR TU5
2017-07-13 12:43:056 INFO  LogUtil:64 - org.apache.directory.fortress.core.impl.TestUtils.sleep
for len=1000
2017-07-13 12:43:057 INFO  LogUtil:64 - org.apache.directory.fortress.core.impl.TestUtils.sleep
for len=1000
2017-07-13 12:43:058 INFO  LogUtil:64 - org.apache.directory.fortress.core.impl.TestUtils.sleep
for len=1000
2017-07-13 12:43:059 INFO  LogUtil:64 - org.apache.directory.fortress.core.impl.TestUtils.sleep
for len=1000
2017-07-13 12:44:000 INFO  LogUtil:64 - org.apache.directory.fortress.core.impl.TestUtils.sleep
for len=1000
2017-07-13 12:44:001 INFO  LogUtil:64 - PWDURATION13 PLCY TP1 USR TU5
2017-07-13 12:44:001 INFO  LogUtil:64 - org.apache.directory.fortress.core.impl.TestUtils.sleep
for len=1000
2017-07-13 12:44:002 INFO  LogUtil:64 - org.apache.directory.fortress.core.impl.TestUtils.sleep
for len=1000
2017-07-13 12:44:003 INFO  LogUtil:64 - org.apache.directory.fortress.core.impl.TestUtils.sleep
for len=1000
2017-07-13 12:44:004 INFO  LogUtil:64 - org.apache.directory.fortress.core.impl.TestUtils.sleep
for len=4000
2017-07-13 12:44:008 INFO  LogUtil:64 - org.apache.directory.fortress.core.impl.TestUtils.sleep
for len=1000
2017-07-13 12:44:009 INFO  LogUtil:64 - PWDURATION14 PLCY TP1 USR TU5
2017-07-13 12:44:009 INFO  LogUtil:64 - org.apache.directory.fortress.core.impl.TestUtils.sleep
for len=1000
2017-07-13 12:44:010 INFO  LogUtil:64 - org.apache.directory.fortress.core.impl.TestUtils.sleep
for len=1000
2017-07-13 12:44:011 INFO  LogUtil:64 - org.apache.directory.fortress.core.impl.TestUtils.sleep
for len=1000
2017-07-13 12:44:012 INFO  LogUtil:64 - org.apache.directory.fortress.core.impl.TestUtils.sleep
for len=1000
2017-07-13 12:44:013 INFO  LogUtil:64 - org.apache.directory.fortress.core.impl.TestUtils.sleep
for len=1000
2017-07-13 12:44:014 INFO  LogUtil:64 - org.apache.directory.fortress.core.impl.TestUtils.sleep
for len=5000
2017-07-13 12:44:019 INFO  LogUtil:64 - org.apache.directory.fortress.core.impl.TestUtils.sleep
for len=1000
2017-07-13 12:44:020 INFO  LogUtil:64 - PWLOCK15 PLCY TP1 USR TU5
2017-07-13 12:44:020 INFO  LogUtil:64 - org.apache.directory.fortress.core.impl.TestUtils.sleep
for len=1000
2017-07-13 12:44:021 INFO  LogUtil:64 - org.apache.directory.fortress.core.impl.TestUtils.sleep
for len=1000
2017-07-13 12:44:022 INFO  LogUtil:64 - org.apache.directory.fortress.core.impl.TestUtils.sleep
for len=1000
2017-07-13 12:44:023 INFO  LogUtil:64 - PWLOCK16 PLCY TP1 USR TU5
2017-07-13 12:44:023 INFO  LogUtil:64 - org.apache.directory.fortress.core.impl.TestUtils.sleep
for len=1000
2017-07-13 12:44:024 INFO  LogUtil:64 - org.apache.directory.fortress.core.impl.TestUtils.sleep
for len=1000
2017-07-13 12:44:025 INFO  LogUtil:64 - org.apache.directory.fortress.core.impl.TestUtils.sleep
for len=1000
2017-07-13 12:44:026 INFO  LogUtil:64 - PWINTERVAL17 PLCY TP1 USR TU5
2017-07-13 12:44:026 INFO  LogUtil:64 - org.apache.directory.fortress.core.impl.TestUtils.sleep
for len=1000
2017-07-13 12:44:027 INFO  LogUtil:64 - org.apache.directory.fortress.core.impl.TestUtils.sleep
for len=1000
2017-07-13 12:44:028 INFO  LogUtil:64 - org.apache.directory.fortress.core.impl.TestUtils.sleep
for len=1000
2017-07-13 12:44:029 INFO  LogUtil:64 - org.apache.directory.fortress.core.impl.TestUtils.sleep
for len=1000
2017-07-13 12:44:030 INFO  LogUtil:64 - org.apache.directory.fortress.core.impl.TestUtils.sleep
for len=1000
2017-07-13 12:44:031 INFO  LogUtil:64 - org.apache.directory.fortress.core.impl.TestUtils.sleep
for len=5000
2017-07-13 12:44:036 INFO  LogUtil:64 - org.apache.directory.fortress.core.impl.TestUtils.sleep
for len=1000
2017-07-13 12:44:037 INFO  LogUtil:64 - org.apache.directory.fortress.core.impl.TestUtils.sleep
for len=1000
2017-07-13 12:44:038 INFO  LogUtil:64 - org.apache.directory.fortress.core.impl.TestUtils.sleep
for len=1000
2017-07-13 12:44:039 INFO  LogUtil:64 - org.apache.directory.fortress.core.impl.TestUtils.sleep
for len=1000
2017-07-13 12:44:040 INFO  LogUtil:64 - org.apache.directory.fortress.core.impl.TestUtils.sleep
for len=1000
2017-07-13 12:44:041 INFO  LogUtil:64 - org.apache.directory.fortress.core.impl.TestUtils.sleep
for len=1000
2017-07-13 12:44:042 INFO  LogUtil:64 - org.apache.directory.fortress.core.impl.TestUtils.sleep
for len=5000
2017-07-13 12:44:047 INFO  LogUtil:64 - org.apache.directory.fortress.core.impl.TestUtils.sleep
for len=1000
2017-07-13 12:44:048 INFO  LogUtil:64 - PWINTERVAL18 PLCY TP1 USR TU5
2017-07-13 12:44:048 INFO  LogUtil:64 - org.apache.directory.fortress.core.impl.TestUtils.sleep
for len=1000
2017-07-13 12:44:049 INFO  LogUtil:64 - org.apache.directory.fortress.core.impl.TestUtils.sleep
for len=1000
2017-07-13 12:44:050 INFO  LogUtil:64 - org.apache.directory.fortress.core.impl.TestUtils.sleep
for len=7000
2017-07-13 12:44:057 INFO  LogUtil:64 - org.apache.directory.fortress.core.impl.TestUtils.sleep
for len=1000
2017-07-13 12:44:058 INFO  LogUtil:64 - org.apache.directory.fortress.core.impl.TestUtils.sleep
for len=1000
2017-07-13 12:44:059 INFO  LogUtil:64 - org.apache.directory.fortress.core.impl.TestUtils.sleep
for len=1000
2017-07-13 12:45:000 INFO  LogUtil:64 - org.apache.directory.fortress.core.impl.TestUtils.sleep
for len=7000
2017-07-13 12:45:007 INFO  LogUtil:64 - org.apache.directory.fortress.core.impl.TestUtils.sleep
for len=1000
2017-07-13 12:45:008 INFO  LogUtil:64 - PWMUST19 PLCY TP1 USR TU5
2017-07-13 12:45:008 INFO  LogUtil:64 - org.apache.directory.fortress.core.impl.TestUtils.sleep
for len=1000
2017-07-13 12:45:009 INFO  LogUtil:64 - PWMUST20 PLCY TP1 USR TU5
2017-07-13 12:45:009 INFO  LogUtil:64 - org.apache.directory.fortress.core.impl.TestUtils.sleep
for len=1000
2017-07-13 12:45:010 INFO  LogUtil:64 - PWALLOW21 PLCY TP1 USR TU5
2017-07-13 12:45:010 INFO  LogUtil:64 - org.apache.directory.fortress.core.impl.TestUtils.sleep
for len=1000
2017-07-13 12:45:011 INFO  LogUtil:64 - PWALLOW22 PLCY TP1 USR TU5
2017-07-13 12:45:011 INFO  LogUtil:64 - PWSAFEW23 PLCY TP1 USR TU5
2017-07-13 12:45:011 INFO  LogUtil:64 - org.apache.directory.fortress.core.impl.TestUtils.sleep
for len=1000
2017-07-13 12:45:012 INFO  LogUtil:64 - PWSAFE24 PLCY TP1 USR TU5
2017-07-13 12:45:013 INFO  LogUtil:64 - BIND-USRS TU1_UPD
2017-07-13 12:45:013 INFO  LogUtil:64 - BIND-USRS TU2_CHG
2017-07-13 12:45:013 INFO  LogUtil:64 - BIND-USRS TU3
2017-07-13 12:45:013 INFO  LogUtil:64 - BIND-USRS TU4
2017-07-13 12:45:013 INFO  LogUtil:64 - GET-AUTHZ TU1_UPD
2017-07-13 12:45:013 INFO  LogUtil:64 - GET-AUTHZ TU3
2017-07-13 12:45:013 INFO  LogUtil:64 - GET-AUTHZ TU4
2017-07-13 12:45:013 INFO  LogUtil:64 - GET-AUTHZ TU1_UPD
2017-07-13 12:45:014 INFO  LogUtil:64 - GET-AUTHZ TU3
2017-07-13 12:45:015 INFO  LogUtil:64 - GET-AUTHZ TU4
2017-07-13 12:45:016 INFO  LogUtil:64 - GET-AUTHZ TU1_UPD
2017-07-13 12:45:018 INFO  LogUtil:64 - GET-AUTHZ TU3
2017-07-13 12:45:019 INFO  LogUtil:64 - GET-AUTHZ TU4
2017-07-13 12:45:020 INFO  LogUtil:64 - SESS-USRS TU1_UPD
2017-07-13 12:45:020 INFO  LogUtil:64 - SESS-USRS TU3
2017-07-13 12:45:020 INFO  LogUtil:64 - SESS-USRS TU4
2017-07-13 12:45:020 INFO  LogUtil:64 - SESS-USRS RBAC TU0
2017-07-13 12:45:021 INFO  LogUtil:64 - SESS-USRS ARBAC TU0
2017-07-13 12:45:021 INFO  LogUtil:64 - SESS-USRS PWPOLICY TU0
Tests run: 129, Failures: 7, Errors: 0, Skipped: 0, Time elapsed: 210.372 sec <<<
FAILURE! - in org.apache.directory.fortress.core.impl.FortressJUnitTest
testCreateSession(org.apache.directory.fortress.core.impl.AccessMgrImplTest)  Time elapsed:
0.016 sec  <<< FAILURE!
junit.framework.AssertionFailedError: org.apache.directory.fortress.core.impl.AccessMgrImplTest.createSessions
user role check failed list size user [jtsUser1] expected:<10> but was:<9>
	at junit.framework.Assert.fail(Assert.java:57)
	at junit.framework.Assert.failNotEquals(Assert.java:329)
	at junit.framework.Assert.assertEquals(Assert.java:78)
	at junit.framework.Assert.assertEquals(Assert.java:234)
	at junit.framework.TestCase.assertEquals(TestCase.java:401)
	at org.apache.directory.fortress.core.impl.AccessMgrImplTest.createSessions(AccessMgrImplTest.java:373)
	at org.apache.directory.fortress.core.impl.AccessMgrImplTest.testCreateSession(AccessMgrImplTest.java:345)

testCreateSessionTrusted(org.apache.directory.fortress.core.impl.AccessMgrImplTest)  Time
elapsed: 0.009 sec  <<< FAILURE!
junit.framework.AssertionFailedError: org.apache.directory.fortress.core.impl.AccessMgrImplTest.createSessionsTrusted
user role check failed list size user [jtsUser1] expected:<10> but was:<9>
	at junit.framework.Assert.fail(Assert.java:57)
	at junit.framework.Assert.failNotEquals(Assert.java:329)
	at junit.framework.Assert.assertEquals(Assert.java:78)
	at junit.framework.Assert.assertEquals(Assert.java:234)
	at junit.framework.TestCase.assertEquals(TestCase.java:401)
	at org.apache.directory.fortress.core.impl.AccessMgrImplTest.createSessionsTrusted(AccessMgrImplTest.java:553)
	at org.apache.directory.fortress.core.impl.AccessMgrImplTest.testCreateSessionTrusted(AccessMgrImplTest.java:524)

testSessionRole(org.apache.directory.fortress.core.impl.AccessMgrImplTest)  Time elapsed:
0.009 sec  <<< FAILURE!
junit.framework.AssertionFailedError: org.apache.directory.fortress.core.impl.AccessMgrImplTest.sessionRoles
user role check failed list size user [jtsUser1] expected:<10> but was:<9>
	at junit.framework.Assert.fail(Assert.java:57)
	at junit.framework.Assert.failNotEquals(Assert.java:329)
	at junit.framework.Assert.assertEquals(Assert.java:78)
	at junit.framework.Assert.assertEquals(Assert.java:234)
	at junit.framework.TestCase.assertEquals(TestCase.java:401)
	at org.apache.directory.fortress.core.impl.AccessMgrImplTest.sessionRoles(AccessMgrImplTest.java:998)
	at org.apache.directory.fortress.core.impl.AccessMgrImplTest.testSessionRole(AccessMgrImplTest.java:970)

testAddActiveRole(org.apache.directory.fortress.core.impl.AccessMgrImplTest)  Time elapsed:
0.015 sec  <<< FAILURE!
junit.framework.AssertionFailedError: org.apache.directory.fortress.core.impl.AccessMgrImplTest.addActiveRoles
failed list size user[jtsUser1] expected:<10> but was:<9>
	at junit.framework.Assert.fail(Assert.java:57)
	at junit.framework.Assert.failNotEquals(Assert.java:329)
	at junit.framework.Assert.assertEquals(Assert.java:78)
	at junit.framework.Assert.assertEquals(Assert.java:234)
	at junit.framework.TestCase.assertEquals(TestCase.java:401)
	at org.apache.directory.fortress.core.impl.AccessMgrImplTest.addActiveRoles(AccessMgrImplTest.java:1061)
	at org.apache.directory.fortress.core.impl.AccessMgrImplTest.testAddActiveRole(AccessMgrImplTest.java:1026)

testDropActiveRole(org.apache.directory.fortress.core.impl.AccessMgrImplTest)  Time elapsed:
0.012 sec  <<< FAILURE!
junit.framework.AssertionFailedError: org.apache.directory.fortress.core.impl.AccessMgrImplTest.dropActiveRoles
failed list size user[jtsUser1] expected:<10> but was:<9>
	at junit.framework.Assert.fail(Assert.java:57)
	at junit.framework.Assert.failNotEquals(Assert.java:329)
	at junit.framework.Assert.assertEquals(Assert.java:78)
	at junit.framework.Assert.assertEquals(Assert.java:234)
	at junit.framework.TestCase.assertEquals(TestCase.java:401)
	at org.apache.directory.fortress.core.impl.AccessMgrImplTest.dropActiveRoles(AccessMgrImplTest.java:1185)
	at org.apache.directory.fortress.core.impl.AccessMgrImplTest.testDropActiveRole(AccessMgrImplTest.java:1161)

testCreateSessionWithRole(org.apache.directory.fortress.core.impl.AccessMgrImplTest)  Time
elapsed: 0.008 sec  <<< FAILURE!
junit.framework.AssertionFailedError: org.apache.directory.fortress.core.impl.AccessMgrImplTest.createSessionsWithRoles
failed role search USER [jtsUser1] CNT [2] size [1]
	at junit.framework.Assert.fail(Assert.java:57)
	at junit.framework.Assert.assertTrue(Assert.java:22)
	at junit.framework.TestCase.assertTrue(TestCase.java:192)
	at org.apache.directory.fortress.core.impl.AccessMgrImplTest.createSessionsWithRoles(AccessMgrImplTest.java:440)
	at org.apache.directory.fortress.core.impl.AccessMgrImplTest.testCreateSessionWithRole(AccessMgrImplTest.java:413)

testCreateSessionWithRolesTrusted(org.apache.directory.fortress.core.impl.AccessMgrImplTest)
 Time elapsed: 0.004 sec  <<< FAILURE!
junit.framework.AssertionFailedError: org.apache.directory.fortress.core.impl.AccessMgrImplTest.createSessionsWithRolesTrusted
failed role search USER [jtsUser1] CNT [2] size [1]
	at junit.framework.Assert.fail(Assert.java:57)
	at junit.framework.Assert.assertTrue(Assert.java:22)
	at junit.framework.TestCase.assertTrue(TestCase.java:192)
	at org.apache.directory.fortress.core.impl.AccessMgrImplTest.createSessionsWithRolesTrusted(AccessMgrImplTest.java:497)
	at org.apache.directory.fortress.core.impl.AccessMgrImplTest.testCreateSessionWithRolesTrusted(AccessMgrImplTest.java:467)


Results :

Failed tests: 
  AccessMgrImplTest.testAddActiveRole:1026->addActiveRoles:1061 org.apache.directory.fortress.core.impl.AccessMgrImplTest.addActiveRoles
failed list size user[jtsUser1] expected:<10> but was:<9>
  AccessMgrImplTest.testCreateSession:345->createSessions:373 org.apache.directory.fortress.core.impl.AccessMgrImplTest.createSessions
user role check failed list size user [jtsUser1] expected:<10> but was:<9>
  AccessMgrImplTest.testCreateSessionTrusted:524->createSessionsTrusted:553 org.apache.directory.fortress.core.impl.AccessMgrImplTest.createSessionsTrusted
user role check failed list size user [jtsUser1] expected:<10> but was:<9>
  AccessMgrImplTest.testCreateSessionWithRole:413->createSessionsWithRoles:440 org.apache.directory.fortress.core.impl.AccessMgrImplTest.createSessionsWithRoles
failed role search USER [jtsUser1] CNT [2] size [1]
  AccessMgrImplTest.testCreateSessionWithRolesTrusted:467->createSessionsWithRolesTrusted:497
org.apache.directory.fortress.core.impl.AccessMgrImplTest.createSessionsWithRolesTrusted failed
role search USER [jtsUser1] CNT [2] size [1]
  AccessMgrImplTest.testDropActiveRole:1161->dropActiveRoles:1185 org.apache.directory.fortress.core.impl.AccessMgrImplTest.dropActiveRoles
failed list size user[jtsUser1] expected:<10> but was:<9>
  AccessMgrImplTest.testSessionRole:970->sessionRoles:998 org.apache.directory.fortress.core.impl.AccessMgrImplTest.sessionRoles
user role check failed list size user [jtsUser1] expected:<10> but was:<9>

Tests run: 129, Failures: 7, Errors: 0, Skipped: 0

[INFO] ------------------------------------------------------------------------
[INFO] BUILD FAILURE
[INFO] ------------------------------------------------------------------------
[INFO] Total time: 03:40 min
[INFO] Finished at: 2017-07-13T12:45:22+00:00
[INFO] Final Memory: 23M/307M
[INFO] ------------------------------------------------------------------------
[ERROR] Failed to execute goal org.apache.maven.plugins:maven-surefire-plugin:2.18.1:test
(default-test) on project fortress-core: There are test failures.
[ERROR] 
[ERROR] Please refer to <https://builds.apache.org/job/dir-fortress-core-docker-openldap-test/ws/target/surefire-reports>
for the individual test results.
[ERROR] -> [Help 1]
[ERROR] 
[ERROR] To see the full stack trace of the errors, re-run Maven with the -e switch.
[ERROR] Re-run Maven using the -X switch to enable full debug logging.
[ERROR] 
[ERROR] For more information about the errors and possible solutions, please read the following
articles:
[ERROR] [Help 1] http://cwiki.apache.org/confluence/display/MAVEN/MojoFailureException
Build step 'Invoke top-level Maven targets' marked build as failure
[dir-fortress-core-docker-openldap-test] $ /bin/bash /tmp/hudson2618167229981565587.sh
dir-fortress-core-docker-openldap-test
dir-fortress-core-docker-openldap-test
CONTAINER ID        IMAGE               COMMAND             CREATED             STATUS   
          PORTS               NAMES

Mime
View raw message