directory-notifications mailing list archives

Site index · List index
Message view « Date » · « Thread »
Top « Date » · « Thread »
From Apache Jenkins Server <jenk...@builds.apache.org>
Subject Build failed in Jenkins: dir-fortress-core-docker-openldap-test #388
Date Fri, 07 Jul 2017 12:28:53 GMT
See <https://builds.apache.org/job/dir-fortress-core-docker-openldap-test/388/display/redirect?page=changes>

Changes:

[clp207] FC-119 remove role constraint when deassigning role

------------------------------------------
[...truncated 1.80 MB...]
2017-07-07 12:26:000 INFO  LogUtil:64 - org.apache.directory.fortress.core.impl.TestUtils.sleep
for len=2000
2017-07-07 12:26:002 INFO  LogUtil:64 - PWMIN2 PLCY TP1 USR TU5
2017-07-07 12:26:002 INFO  LogUtil:64 - org.apache.directory.fortress.core.impl.TestUtils.sleep
for len=3000
2017-07-07 12:26:005 INFO  LogUtil:64 - org.apache.directory.fortress.core.impl.TestUtils.sleep
for len=3000
2017-07-07 12:26:008 INFO  LogUtil:64 - PWMAX3 PLCY TP1 USR TU5
2017-07-07 12:26:008 INFO  LogUtil:64 - org.apache.directory.fortress.core.impl.TestUtils.sleep
for len=5000
2017-07-07 12:26:013 INFO  LogUtil:64 - org.apache.directory.fortress.core.impl.TestUtils.sleep
for len=1000
2017-07-07 12:26:014 INFO  LogUtil:64 - org.apache.directory.fortress.core.impl.TestUtils.sleep
for len=5000
2017-07-07 12:26:019 INFO  LogUtil:64 - org.apache.directory.fortress.core.impl.TestUtils.sleep
for len=1000
2017-07-07 12:26:020 INFO  LogUtil:64 - org.apache.directory.fortress.core.impl.TestUtils.sleep
for len=5000
2017-07-07 12:26:025 INFO  LogUtil:64 - org.apache.directory.fortress.core.impl.TestUtils.sleep
for len=1000
2017-07-07 12:26:026 INFO  LogUtil:64 - PWMAX4 PLCY TP1 USR TU5
2017-07-07 12:26:026 INFO  LogUtil:64 - org.apache.directory.fortress.core.impl.TestUtils.sleep
for len=2000
2017-07-07 12:26:028 INFO  LogUtil:64 - org.apache.directory.fortress.core.impl.TestUtils.sleep
for len=1000
2017-07-07 12:26:029 INFO  LogUtil:64 - org.apache.directory.fortress.core.impl.TestUtils.sleep
for len=2000
2017-07-07 12:26:031 INFO  LogUtil:64 - org.apache.directory.fortress.core.impl.TestUtils.sleep
for len=1000
2017-07-07 12:26:032 INFO  LogUtil:64 - org.apache.directory.fortress.core.impl.TestUtils.sleep
for len=2000
2017-07-07 12:26:034 INFO  LogUtil:64 - org.apache.directory.fortress.core.impl.TestUtils.sleep
for len=1000
2017-07-07 12:26:035 INFO  LogUtil:64 - PWHIST5 PLCY TP1 USR TU5
2017-07-07 12:26:035 INFO  LogUtil:64 - PWHIST6 PLCY TP1 USR TU5
2017-07-07 12:26:036 INFO  LogUtil:64 - PWLEN7 PLCY TP1 USR TU5
2017-07-07 12:26:036 INFO  LogUtil:64 - PWLEN8 PLCY TP1 USR TU5
2017-07-07 12:26:036 INFO  LogUtil:64 - PWEXP7 PLCY TP1 USR TU5
2017-07-07 12:26:036 INFO  LogUtil:64 - org.apache.directory.fortress.core.impl.TestUtils.sleep
for len=2000
2017-07-07 12:26:038 INFO  LogUtil:64 - org.apache.directory.fortress.core.impl.TestUtils.sleep
for len=1000
2017-07-07 12:26:039 INFO  LogUtil:64 - org.apache.directory.fortress.core.impl.TestUtils.sleep
for len=2000
2017-07-07 12:26:041 INFO  LogUtil:64 - PWEXP8 PLCY TP1 USR TU5
2017-07-07 12:26:041 INFO  LogUtil:64 - org.apache.directory.fortress.core.impl.TestUtils.sleep
for len=4000
2017-07-07 12:26:045 INFO  LogUtil:64 - org.apache.directory.fortress.core.impl.TestUtils.sleep
for len=1000
2017-07-07 12:26:046 INFO  LogUtil:64 - org.apache.directory.fortress.core.impl.TestUtils.sleep
for len=4000
2017-07-07 12:26:050 INFO  LogUtil:64 - PWGRACE9 PLCY TP1 USR TU5
2017-07-07 12:26:050 INFO  LogUtil:64 - org.apache.directory.fortress.core.impl.TestUtils.sleep
for len=6000
2017-07-07 12:26:056 INFO  LogUtil:64 - org.apache.directory.fortress.core.impl.TestUtils.sleep
for len=1000
2017-07-07 12:26:057 INFO  LogUtil:64 - org.apache.directory.fortress.core.impl.TestUtils.sleep
for len=1000
2017-07-07 12:26:058 INFO  LogUtil:64 - org.apache.directory.fortress.core.impl.TestUtils.sleep
for len=1000
2017-07-07 12:26:059 INFO  LogUtil:64 - org.apache.directory.fortress.core.impl.TestUtils.sleep
for len=1000
2017-07-07 12:27:000 INFO  LogUtil:64 - org.apache.directory.fortress.core.impl.TestUtils.sleep
for len=1000
2017-07-07 12:27:001 INFO  LogUtil:64 - org.apache.directory.fortress.core.impl.TestUtils.sleep
for len=1000
2017-07-07 12:27:002 INFO  LogUtil:64 - org.apache.directory.fortress.core.impl.TestUtils.sleep
for len=1000
2017-07-07 12:27:003 INFO  LogUtil:64 - org.apache.directory.fortress.core.impl.TestUtils.sleep
for len=1000
2017-07-07 12:27:004 INFO  LogUtil:64 - org.apache.directory.fortress.core.impl.TestUtils.sleep
for len=1000
2017-07-07 12:27:005 INFO  LogUtil:64 - org.apache.directory.fortress.core.impl.TestUtils.sleep
for len=1000
2017-07-07 12:27:006 INFO  LogUtil:64 - org.apache.directory.fortress.core.impl.TestUtils.sleep
for len=1000
2017-07-07 12:27:007 INFO  LogUtil:64 - PWGRACE10 PLCY TP1 USR TU5
2017-07-07 12:27:007 INFO  LogUtil:64 - org.apache.directory.fortress.core.impl.TestUtils.sleep
for len=5000
2017-07-07 12:27:012 INFO  LogUtil:64 - org.apache.directory.fortress.core.impl.TestUtils.sleep
for len=1000
2017-07-07 12:27:013 INFO  LogUtil:64 - org.apache.directory.fortress.core.impl.TestUtils.sleep
for len=1000
2017-07-07 12:27:014 INFO  LogUtil:64 - org.apache.directory.fortress.core.impl.TestUtils.sleep
for len=1000
2017-07-07 12:27:015 INFO  LogUtil:64 - org.apache.directory.fortress.core.impl.TestUtils.sleep
for len=1000
2017-07-07 12:27:016 INFO  LogUtil:64 - org.apache.directory.fortress.core.impl.TestUtils.sleep
for len=1000
2017-07-07 12:27:017 INFO  LogUtil:64 - org.apache.directory.fortress.core.impl.TestUtils.sleep
for len=1000
2017-07-07 12:27:018 INFO  LogUtil:64 - PWMAXFAILK11 PLCY TP1 USR TU5
2017-07-07 12:27:018 INFO  LogUtil:64 - org.apache.directory.fortress.core.impl.TestUtils.sleep
for len=1000
2017-07-07 12:27:019 INFO  LogUtil:64 - org.apache.directory.fortress.core.impl.TestUtils.sleep
for len=1000
2017-07-07 12:27:020 INFO  LogUtil:64 - org.apache.directory.fortress.core.impl.TestUtils.sleep
for len=1000
2017-07-07 12:27:021 INFO  LogUtil:64 - org.apache.directory.fortress.core.impl.TestUtils.sleep
for len=1000
2017-07-07 12:27:022 INFO  LogUtil:64 - org.apache.directory.fortress.core.impl.TestUtils.sleep
for len=1000
2017-07-07 12:27:023 INFO  LogUtil:64 - org.apache.directory.fortress.core.impl.TestUtils.sleep
for len=1000
2017-07-07 12:27:024 INFO  LogUtil:64 - org.apache.directory.fortress.core.impl.TestUtils.sleep
for len=1000
2017-07-07 12:27:025 INFO  LogUtil:64 - org.apache.directory.fortress.core.impl.TestUtils.sleep
for len=1000
2017-07-07 12:27:026 INFO  LogUtil:64 - org.apache.directory.fortress.core.impl.TestUtils.sleep
for len=1000
2017-07-07 12:27:027 INFO  LogUtil:64 - org.apache.directory.fortress.core.impl.TestUtils.sleep
for len=1000
2017-07-07 12:27:028 INFO  LogUtil:64 - PWMAXFAIL12 PLCY TP1 USR TU5
2017-07-07 12:27:028 INFO  LogUtil:64 - org.apache.directory.fortress.core.impl.TestUtils.sleep
for len=1000
2017-07-07 12:27:029 INFO  LogUtil:64 - org.apache.directory.fortress.core.impl.TestUtils.sleep
for len=1000
2017-07-07 12:27:030 INFO  LogUtil:64 - org.apache.directory.fortress.core.impl.TestUtils.sleep
for len=1000
2017-07-07 12:27:031 INFO  LogUtil:64 - org.apache.directory.fortress.core.impl.TestUtils.sleep
for len=1000
2017-07-07 12:27:032 INFO  LogUtil:64 - org.apache.directory.fortress.core.impl.TestUtils.sleep
for len=1000
2017-07-07 12:27:033 INFO  LogUtil:64 - PWDURATION13 PLCY TP1 USR TU5
2017-07-07 12:27:033 INFO  LogUtil:64 - org.apache.directory.fortress.core.impl.TestUtils.sleep
for len=1000
2017-07-07 12:27:034 INFO  LogUtil:64 - org.apache.directory.fortress.core.impl.TestUtils.sleep
for len=1000
2017-07-07 12:27:035 INFO  LogUtil:64 - org.apache.directory.fortress.core.impl.TestUtils.sleep
for len=1000
2017-07-07 12:27:036 INFO  LogUtil:64 - org.apache.directory.fortress.core.impl.TestUtils.sleep
for len=4000
2017-07-07 12:27:040 INFO  LogUtil:64 - org.apache.directory.fortress.core.impl.TestUtils.sleep
for len=1000
2017-07-07 12:27:041 INFO  LogUtil:64 - PWDURATION14 PLCY TP1 USR TU5
2017-07-07 12:27:041 INFO  LogUtil:64 - org.apache.directory.fortress.core.impl.TestUtils.sleep
for len=1000
2017-07-07 12:27:042 INFO  LogUtil:64 - org.apache.directory.fortress.core.impl.TestUtils.sleep
for len=1000
2017-07-07 12:27:043 INFO  LogUtil:64 - org.apache.directory.fortress.core.impl.TestUtils.sleep
for len=1000
2017-07-07 12:27:044 INFO  LogUtil:64 - org.apache.directory.fortress.core.impl.TestUtils.sleep
for len=1000
2017-07-07 12:27:045 INFO  LogUtil:64 - org.apache.directory.fortress.core.impl.TestUtils.sleep
for len=1000
2017-07-07 12:27:046 INFO  LogUtil:64 - org.apache.directory.fortress.core.impl.TestUtils.sleep
for len=5000
2017-07-07 12:27:051 INFO  LogUtil:64 - org.apache.directory.fortress.core.impl.TestUtils.sleep
for len=1000
2017-07-07 12:27:052 INFO  LogUtil:64 - PWLOCK15 PLCY TP1 USR TU5
2017-07-07 12:27:052 INFO  LogUtil:64 - org.apache.directory.fortress.core.impl.TestUtils.sleep
for len=1000
2017-07-07 12:27:053 INFO  LogUtil:64 - org.apache.directory.fortress.core.impl.TestUtils.sleep
for len=1000
2017-07-07 12:27:054 INFO  LogUtil:64 - org.apache.directory.fortress.core.impl.TestUtils.sleep
for len=1000
2017-07-07 12:27:055 INFO  LogUtil:64 - PWLOCK16 PLCY TP1 USR TU5
2017-07-07 12:27:055 INFO  LogUtil:64 - org.apache.directory.fortress.core.impl.TestUtils.sleep
for len=1000
2017-07-07 12:27:056 INFO  LogUtil:64 - org.apache.directory.fortress.core.impl.TestUtils.sleep
for len=1000
2017-07-07 12:27:058 INFO  LogUtil:64 - org.apache.directory.fortress.core.impl.TestUtils.sleep
for len=1000
2017-07-07 12:27:059 INFO  LogUtil:64 - PWINTERVAL17 PLCY TP1 USR TU5
2017-07-07 12:27:059 INFO  LogUtil:64 - org.apache.directory.fortress.core.impl.TestUtils.sleep
for len=1000
2017-07-07 12:28:000 INFO  LogUtil:64 - org.apache.directory.fortress.core.impl.TestUtils.sleep
for len=1000
2017-07-07 12:28:001 INFO  LogUtil:64 - org.apache.directory.fortress.core.impl.TestUtils.sleep
for len=1000
2017-07-07 12:28:002 INFO  LogUtil:64 - org.apache.directory.fortress.core.impl.TestUtils.sleep
for len=1000
2017-07-07 12:28:003 INFO  LogUtil:64 - org.apache.directory.fortress.core.impl.TestUtils.sleep
for len=1000
2017-07-07 12:28:004 INFO  LogUtil:64 - org.apache.directory.fortress.core.impl.TestUtils.sleep
for len=5000
2017-07-07 12:28:009 INFO  LogUtil:64 - org.apache.directory.fortress.core.impl.TestUtils.sleep
for len=1000
2017-07-07 12:28:010 INFO  LogUtil:64 - org.apache.directory.fortress.core.impl.TestUtils.sleep
for len=1000
2017-07-07 12:28:011 INFO  LogUtil:64 - org.apache.directory.fortress.core.impl.TestUtils.sleep
for len=1000
2017-07-07 12:28:012 INFO  LogUtil:64 - org.apache.directory.fortress.core.impl.TestUtils.sleep
for len=1000
2017-07-07 12:28:013 INFO  LogUtil:64 - org.apache.directory.fortress.core.impl.TestUtils.sleep
for len=1000
2017-07-07 12:28:014 INFO  LogUtil:64 - org.apache.directory.fortress.core.impl.TestUtils.sleep
for len=1000
2017-07-07 12:28:015 INFO  LogUtil:64 - org.apache.directory.fortress.core.impl.TestUtils.sleep
for len=5000
2017-07-07 12:28:020 INFO  LogUtil:64 - org.apache.directory.fortress.core.impl.TestUtils.sleep
for len=1000
2017-07-07 12:28:021 INFO  LogUtil:64 - PWINTERVAL18 PLCY TP1 USR TU5
2017-07-07 12:28:021 INFO  LogUtil:64 - org.apache.directory.fortress.core.impl.TestUtils.sleep
for len=1000
2017-07-07 12:28:022 INFO  LogUtil:64 - org.apache.directory.fortress.core.impl.TestUtils.sleep
for len=1000
2017-07-07 12:28:023 INFO  LogUtil:64 - org.apache.directory.fortress.core.impl.TestUtils.sleep
for len=7000
2017-07-07 12:28:030 INFO  LogUtil:64 - org.apache.directory.fortress.core.impl.TestUtils.sleep
for len=1000
2017-07-07 12:28:031 INFO  LogUtil:64 - org.apache.directory.fortress.core.impl.TestUtils.sleep
for len=1000
2017-07-07 12:28:032 INFO  LogUtil:64 - org.apache.directory.fortress.core.impl.TestUtils.sleep
for len=1000
2017-07-07 12:28:033 INFO  LogUtil:64 - org.apache.directory.fortress.core.impl.TestUtils.sleep
for len=7000
2017-07-07 12:28:040 INFO  LogUtil:64 - org.apache.directory.fortress.core.impl.TestUtils.sleep
for len=1000
2017-07-07 12:28:041 INFO  LogUtil:64 - PWMUST19 PLCY TP1 USR TU5
2017-07-07 12:28:041 INFO  LogUtil:64 - org.apache.directory.fortress.core.impl.TestUtils.sleep
for len=1000
2017-07-07 12:28:042 INFO  LogUtil:64 - PWMUST20 PLCY TP1 USR TU5
2017-07-07 12:28:042 INFO  LogUtil:64 - org.apache.directory.fortress.core.impl.TestUtils.sleep
for len=1000
2017-07-07 12:28:043 INFO  LogUtil:64 - PWALLOW21 PLCY TP1 USR TU5
2017-07-07 12:28:043 INFO  LogUtil:64 - org.apache.directory.fortress.core.impl.TestUtils.sleep
for len=1000
2017-07-07 12:28:044 INFO  LogUtil:64 - PWALLOW22 PLCY TP1 USR TU5
2017-07-07 12:28:044 INFO  LogUtil:64 - PWSAFEW23 PLCY TP1 USR TU5
2017-07-07 12:28:044 INFO  LogUtil:64 - org.apache.directory.fortress.core.impl.TestUtils.sleep
for len=1000
2017-07-07 12:28:045 INFO  LogUtil:64 - PWSAFE24 PLCY TP1 USR TU5
2017-07-07 12:28:045 INFO  LogUtil:64 - BIND-USRS TU1_UPD
2017-07-07 12:28:045 INFO  LogUtil:64 - BIND-USRS TU2_CHG
2017-07-07 12:28:045 INFO  LogUtil:64 - BIND-USRS TU3
2017-07-07 12:28:045 INFO  LogUtil:64 - BIND-USRS TU4
2017-07-07 12:28:045 INFO  LogUtil:64 - GET-AUTHZ TU1_UPD
2017-07-07 12:28:045 INFO  LogUtil:64 - GET-AUTHZ TU3
2017-07-07 12:28:045 INFO  LogUtil:64 - GET-AUTHZ TU4
2017-07-07 12:28:045 INFO  LogUtil:64 - GET-AUTHZ TU1_UPD
2017-07-07 12:28:046 INFO  LogUtil:64 - GET-AUTHZ TU3
2017-07-07 12:28:047 INFO  LogUtil:64 - GET-AUTHZ TU4
2017-07-07 12:28:048 INFO  LogUtil:64 - GET-AUTHZ TU1_UPD
2017-07-07 12:28:049 INFO  LogUtil:64 - GET-AUTHZ TU3
2017-07-07 12:28:049 INFO  LogUtil:64 - GET-AUTHZ TU4
2017-07-07 12:28:050 INFO  LogUtil:64 - SESS-USRS TU1_UPD
2017-07-07 12:28:050 INFO  LogUtil:64 - SESS-USRS TU3
2017-07-07 12:28:050 INFO  LogUtil:64 - SESS-USRS TU4
2017-07-07 12:28:050 INFO  LogUtil:64 - SESS-USRS RBAC TU0
2017-07-07 12:28:051 INFO  LogUtil:64 - SESS-USRS ARBAC TU0
2017-07-07 12:28:051 INFO  LogUtil:64 - SESS-USRS PWPOLICY TU0
Tests run: 128, Failures: 7, Errors: 0, Skipped: 0, Time elapsed: 201.988 sec <<<
FAILURE! - in org.apache.directory.fortress.core.impl.FortressJUnitTest
testCreateSession(org.apache.directory.fortress.core.impl.AccessMgrImplTest)  Time elapsed:
0.016 sec  <<< FAILURE!
junit.framework.AssertionFailedError: org.apache.directory.fortress.core.impl.AccessMgrImplTest.createSessions
user role check failed list size user [jtsUser1] expected:<10> but was:<9>
	at junit.framework.Assert.fail(Assert.java:57)
	at junit.framework.Assert.failNotEquals(Assert.java:329)
	at junit.framework.Assert.assertEquals(Assert.java:78)
	at junit.framework.Assert.assertEquals(Assert.java:234)
	at junit.framework.TestCase.assertEquals(TestCase.java:401)
	at org.apache.directory.fortress.core.impl.AccessMgrImplTest.createSessions(AccessMgrImplTest.java:373)
	at org.apache.directory.fortress.core.impl.AccessMgrImplTest.testCreateSession(AccessMgrImplTest.java:345)

testCreateSessionTrusted(org.apache.directory.fortress.core.impl.AccessMgrImplTest)  Time
elapsed: 0.007 sec  <<< FAILURE!
junit.framework.AssertionFailedError: org.apache.directory.fortress.core.impl.AccessMgrImplTest.createSessionsTrusted
user role check failed list size user [jtsUser1] expected:<10> but was:<9>
	at junit.framework.Assert.fail(Assert.java:57)
	at junit.framework.Assert.failNotEquals(Assert.java:329)
	at junit.framework.Assert.assertEquals(Assert.java:78)
	at junit.framework.Assert.assertEquals(Assert.java:234)
	at junit.framework.TestCase.assertEquals(TestCase.java:401)
	at org.apache.directory.fortress.core.impl.AccessMgrImplTest.createSessionsTrusted(AccessMgrImplTest.java:553)
	at org.apache.directory.fortress.core.impl.AccessMgrImplTest.testCreateSessionTrusted(AccessMgrImplTest.java:524)

testSessionRole(org.apache.directory.fortress.core.impl.AccessMgrImplTest)  Time elapsed:
0.011 sec  <<< FAILURE!
junit.framework.AssertionFailedError: org.apache.directory.fortress.core.impl.AccessMgrImplTest.sessionRoles
user role check failed list size user [jtsUser1] expected:<10> but was:<9>
	at junit.framework.Assert.fail(Assert.java:57)
	at junit.framework.Assert.failNotEquals(Assert.java:329)
	at junit.framework.Assert.assertEquals(Assert.java:78)
	at junit.framework.Assert.assertEquals(Assert.java:234)
	at junit.framework.TestCase.assertEquals(TestCase.java:401)
	at org.apache.directory.fortress.core.impl.AccessMgrImplTest.sessionRoles(AccessMgrImplTest.java:998)
	at org.apache.directory.fortress.core.impl.AccessMgrImplTest.testSessionRole(AccessMgrImplTest.java:970)

testAddActiveRole(org.apache.directory.fortress.core.impl.AccessMgrImplTest)  Time elapsed:
0.008 sec  <<< FAILURE!
junit.framework.AssertionFailedError: org.apache.directory.fortress.core.impl.AccessMgrImplTest.addActiveRoles
failed list size user[jtsUser1] expected:<10> but was:<9>
	at junit.framework.Assert.fail(Assert.java:57)
	at junit.framework.Assert.failNotEquals(Assert.java:329)
	at junit.framework.Assert.assertEquals(Assert.java:78)
	at junit.framework.Assert.assertEquals(Assert.java:234)
	at junit.framework.TestCase.assertEquals(TestCase.java:401)
	at org.apache.directory.fortress.core.impl.AccessMgrImplTest.addActiveRoles(AccessMgrImplTest.java:1061)
	at org.apache.directory.fortress.core.impl.AccessMgrImplTest.testAddActiveRole(AccessMgrImplTest.java:1026)

testDropActiveRole(org.apache.directory.fortress.core.impl.AccessMgrImplTest)  Time elapsed:
0.008 sec  <<< FAILURE!
junit.framework.AssertionFailedError: org.apache.directory.fortress.core.impl.AccessMgrImplTest.dropActiveRoles
failed list size user[jtsUser1] expected:<10> but was:<9>
	at junit.framework.Assert.fail(Assert.java:57)
	at junit.framework.Assert.failNotEquals(Assert.java:329)
	at junit.framework.Assert.assertEquals(Assert.java:78)
	at junit.framework.Assert.assertEquals(Assert.java:234)
	at junit.framework.TestCase.assertEquals(TestCase.java:401)
	at org.apache.directory.fortress.core.impl.AccessMgrImplTest.dropActiveRoles(AccessMgrImplTest.java:1185)
	at org.apache.directory.fortress.core.impl.AccessMgrImplTest.testDropActiveRole(AccessMgrImplTest.java:1161)

testCreateSessionWithRole(org.apache.directory.fortress.core.impl.AccessMgrImplTest)  Time
elapsed: 0.008 sec  <<< FAILURE!
junit.framework.AssertionFailedError: org.apache.directory.fortress.core.impl.AccessMgrImplTest.createSessionsWithRoles
failed role search USER [jtsUser1] CNT [2] size [1]
	at junit.framework.Assert.fail(Assert.java:57)
	at junit.framework.Assert.assertTrue(Assert.java:22)
	at junit.framework.TestCase.assertTrue(TestCase.java:192)
	at org.apache.directory.fortress.core.impl.AccessMgrImplTest.createSessionsWithRoles(AccessMgrImplTest.java:440)
	at org.apache.directory.fortress.core.impl.AccessMgrImplTest.testCreateSessionWithRole(AccessMgrImplTest.java:413)

testCreateSessionWithRolesTrusted(org.apache.directory.fortress.core.impl.AccessMgrImplTest)
 Time elapsed: 0.004 sec  <<< FAILURE!
junit.framework.AssertionFailedError: org.apache.directory.fortress.core.impl.AccessMgrImplTest.createSessionsWithRolesTrusted
failed role search USER [jtsUser1] CNT [2] size [1]
	at junit.framework.Assert.fail(Assert.java:57)
	at junit.framework.Assert.assertTrue(Assert.java:22)
	at junit.framework.TestCase.assertTrue(TestCase.java:192)
	at org.apache.directory.fortress.core.impl.AccessMgrImplTest.createSessionsWithRolesTrusted(AccessMgrImplTest.java:497)
	at org.apache.directory.fortress.core.impl.AccessMgrImplTest.testCreateSessionWithRolesTrusted(AccessMgrImplTest.java:467)


Results :

Failed tests: 
  AccessMgrImplTest.testAddActiveRole:1026->addActiveRoles:1061 org.apache.directory.fortress.core.impl.AccessMgrImplTest.addActiveRoles
failed list size user[jtsUser1] expected:<10> but was:<9>
  AccessMgrImplTest.testCreateSession:345->createSessions:373 org.apache.directory.fortress.core.impl.AccessMgrImplTest.createSessions
user role check failed list size user [jtsUser1] expected:<10> but was:<9>
  AccessMgrImplTest.testCreateSessionTrusted:524->createSessionsTrusted:553 org.apache.directory.fortress.core.impl.AccessMgrImplTest.createSessionsTrusted
user role check failed list size user [jtsUser1] expected:<10> but was:<9>
  AccessMgrImplTest.testCreateSessionWithRole:413->createSessionsWithRoles:440 org.apache.directory.fortress.core.impl.AccessMgrImplTest.createSessionsWithRoles
failed role search USER [jtsUser1] CNT [2] size [1]
  AccessMgrImplTest.testCreateSessionWithRolesTrusted:467->createSessionsWithRolesTrusted:497
org.apache.directory.fortress.core.impl.AccessMgrImplTest.createSessionsWithRolesTrusted failed
role search USER [jtsUser1] CNT [2] size [1]
  AccessMgrImplTest.testDropActiveRole:1161->dropActiveRoles:1185 org.apache.directory.fortress.core.impl.AccessMgrImplTest.dropActiveRoles
failed list size user[jtsUser1] expected:<10> but was:<9>
  AccessMgrImplTest.testSessionRole:970->sessionRoles:998 org.apache.directory.fortress.core.impl.AccessMgrImplTest.sessionRoles
user role check failed list size user [jtsUser1] expected:<10> but was:<9>

Tests run: 128, Failures: 7, Errors: 0, Skipped: 0

[INFO] ------------------------------------------------------------------------
[INFO] BUILD FAILURE
[INFO] ------------------------------------------------------------------------
[INFO] Total time: 03:29 min
[INFO] Finished at: 2017-07-07T12:28:52+00:00
[INFO] Final Memory: 23M/307M
[INFO] ------------------------------------------------------------------------
[ERROR] Failed to execute goal org.apache.maven.plugins:maven-surefire-plugin:2.18.1:test
(default-test) on project fortress-core: There are test failures.
[ERROR] 
[ERROR] Please refer to <https://builds.apache.org/job/dir-fortress-core-docker-openldap-test/ws/target/surefire-reports>
for the individual test results.
[ERROR] -> [Help 1]
[ERROR] 
[ERROR] To see the full stack trace of the errors, re-run Maven with the -e switch.
[ERROR] Re-run Maven using the -X switch to enable full debug logging.
[ERROR] 
[ERROR] For more information about the errors and possible solutions, please read the following
articles:
[ERROR] [Help 1] http://cwiki.apache.org/confluence/display/MAVEN/MojoFailureException
Build step 'Invoke top-level Maven targets' marked build as failure
[dir-fortress-core-docker-openldap-test] $ /bin/bash /tmp/hudson5567142118847346832.sh
dir-fortress-core-docker-openldap-test
dir-fortress-core-docker-openldap-test
CONTAINER ID        IMAGE                         COMMAND                  CREATED       
     STATUS              PORTS               NAMES
6396ed6a6b5d        madlib/postgres_9.6:jenkins   "docker-entrypoint..."   15 hours ago  
     Up 15 hours         5432/tcp            madlib
34d411c4a234        mesos-1499346602-27292        "/bin/sh -c './boo..."   23 hours ago  
     Up 23 hours                             affectionate_varahamihira
596a09763c52        mesos-1499320917-8087         "/bin/sh -c './boo..."   30 hours ago  
     Up 30 hours                             friendly_brattain

Mime
View raw message