directory-notifications mailing list archives

Site index · List index
Message view « Date » · « Thread »
Top « Date » · « Thread »
From Apache Jenkins Server <jenk...@builds.apache.org>
Subject Build failed in Jenkins: dir-fortress-core-docker-apacheds-test #30
Date Mon, 10 Jul 2017 15:37:53 GMT
See <https://builds.apache.org/job/dir-fortress-core-docker-apacheds-test/30/display/redirect?page=changes>

Changes:

[clp207] FC-221 add id to non temporal role constraint and method to remove

------------------------------------------
[...truncated 1.83 MB...]
2017-07-10 15:35:024 INFO  UserDAO:1662 - deleteResetFlag user [jtsTU5User6] no such attribute:pwdReset
2017-07-10 15:35:024 INFO  UserDAO:1662 - deleteResetFlag user [jtsTU5User6] no such attribute:pwdReset
2017-07-10 15:35:024 INFO  UserDAO:1662 - deleteResetFlag user [jtsTU5User6] no such attribute:pwdReset
2017-07-10 15:35:024 INFO  UserDAO:1662 - deleteResetFlag user [jtsTU5User6] no such attribute:pwdReset
2017-07-10 15:35:024 INFO  UserDAO:1662 - deleteResetFlag user [jtsTU5User6] no such attribute:pwdReset
2017-07-10 15:35:024 INFO  UserDAO:1662 - deleteResetFlag user [jtsTU5User6] no such attribute:pwdReset
2017-07-10 15:35:024 INFO  UserDAO:1662 - deleteResetFlag user [jtsTU5User6] no such attribute:pwdReset
2017-07-10 15:35:024 INFO  UserDAO:1662 - deleteResetFlag user [jtsTU5User6] no such attribute:pwdReset
2017-07-10 15:35:024 INFO  UserDAO:1662 - deleteResetFlag user [jtsTU5User6] no such attribute:pwdReset
2017-07-10 15:35:024 INFO  UserDAO:1662 - deleteResetFlag user [jtsTU5User6] no such attribute:pwdReset
2017-07-10 15:35:024 INFO  UserDAO:1662 - deleteResetFlag user [jtsTU5User6] no such attribute:pwdReset
2017-07-10 15:35:024 INFO  UserDAO:1662 - deleteResetFlag user [jtsTU5User6] no such attribute:pwdReset
2017-07-10 15:35:024 INFO  UserDAO:1662 - deleteResetFlag user [jtsTU5User6] no such attribute:pwdReset
2017-07-10 15:35:024 INFO  UserDAO:1662 - deleteResetFlag user [jtsTU5User6] no such attribute:pwdReset
2017-07-10 15:35:025 INFO  UserDAO:1662 - deleteResetFlag user [jtsTU5User6] no such attribute:pwdReset
2017-07-10 15:35:025 INFO  UserDAO:1662 - deleteResetFlag user [jtsTU5User6] no such attribute:pwdReset
2017-07-10 15:35:025 INFO  UserDAO:1662 - deleteResetFlag user [jtsTU5User6] no such attribute:pwdReset
2017-07-10 15:35:025 INFO  UserDAO:1662 - deleteResetFlag user [jtsTU5User6] no such attribute:pwdReset
2017-07-10 15:35:025 INFO  UserDAO:1662 - deleteResetFlag user [jtsTU5User6] no such attribute:pwdReset
2017-07-10 15:35:025 INFO  UserDAO:1662 - deleteResetFlag user [jtsTU5User6] no such attribute:pwdReset
2017-07-10 15:35:025 INFO  UserDAO:1662 - deleteResetFlag user [jtsTU5User6] no such attribute:pwdReset
2017-07-10 15:35:025 INFO  UserDAO:1662 - deleteResetFlag user [jtsTU5User6] no such attribute:pwdReset
2017-07-10 15:35:025 INFO  UserDAO:1662 - deleteResetFlag user [jtsTU5User6] no such attribute:pwdReset
2017-07-10 15:35:025 INFO  UserDAO:1662 - deleteResetFlag user [jtsTU5User6] no such attribute:pwdReset
2017-07-10 15:35:025 INFO  UserDAO:1662 - deleteResetFlag user [jtsTU5User6] no such attribute:pwdReset
2017-07-10 15:35:025 INFO  UserDAO:1662 - deleteResetFlag user [jtsTU5User6] no such attribute:pwdReset
2017-07-10 15:35:025 INFO  UserDAO:1662 - deleteResetFlag user [jtsTU5User6] no such attribute:pwdReset
2017-07-10 15:35:025 INFO  UserDAO:1662 - deleteResetFlag user [jtsTU5User6] no such attribute:pwdReset
2017-07-10 15:35:025 INFO  UserDAO:1662 - deleteResetFlag user [jtsTU5User6] no such attribute:pwdReset
2017-07-10 15:35:025 INFO  UserDAO:1662 - deleteResetFlag user [jtsTU5User6] no such attribute:pwdReset
2017-07-10 15:35:025 INFO  UserDAO:1662 - deleteResetFlag user [jtsTU5User6] no such attribute:pwdReset
2017-07-10 15:35:025 INFO  UserDAO:1662 - deleteResetFlag user [jtsTU5User6] no such attribute:pwdReset
2017-07-10 15:35:025 INFO  LogUtil:64 - PWLEN7 PLCY TP1 USR TU5
2017-07-10 15:35:025 INFO  LogUtil:64 - PWLEN8 PLCY TP1 USR TU5
2017-07-10 15:35:025 INFO  LogUtil:64 - PWEXP7 PLCY TP1 USR TU5
2017-07-10 15:35:025 INFO  UserDAO:1662 - deleteResetFlag user [jtsTU5User9] no such attribute:pwdReset
2017-07-10 15:35:025 INFO  LogUtil:64 - org.apache.directory.fortress.core.impl.TestUtils.sleep
for len=2000
2017-07-10 15:35:027 INFO  LogUtil:64 - org.apache.directory.fortress.core.impl.TestUtils.sleep
for len=1000
2017-07-10 15:35:028 INFO  LogUtil:64 - org.apache.directory.fortress.core.impl.TestUtils.sleep
for len=2000
2017-07-10 15:35:031 INFO  LogUtil:64 - PWEXP8 PLCY TP1 USR TU5
2017-07-10 15:35:031 INFO  UserDAO:1662 - deleteResetFlag user [jtsTU5User10] no such attribute:pwdReset
2017-07-10 15:35:031 INFO  LogUtil:64 - org.apache.directory.fortress.core.impl.TestUtils.sleep
for len=4000
2017-07-10 15:35:035 INFO  LogUtil:64 - org.apache.directory.fortress.core.impl.TestUtils.sleep
for len=1000
2017-07-10 15:35:036 INFO  LogUtil:64 - org.apache.directory.fortress.core.impl.TestUtils.sleep
for len=4000
2017-07-10 15:35:040 INFO  LogUtil:64 - PWGRACE9 PLCY TP1 USR TU5
2017-07-10 15:35:040 INFO  UserDAO:1662 - deleteResetFlag user [jtsTU5User11] no such attribute:pwdReset
2017-07-10 15:35:040 INFO  LogUtil:64 - org.apache.directory.fortress.core.impl.TestUtils.sleep
for len=6000
2017-07-10 15:35:046 INFO  LogUtil:64 - org.apache.directory.fortress.core.impl.TestUtils.sleep
for len=1000
2017-07-10 15:35:047 INFO  LogUtil:64 - org.apache.directory.fortress.core.impl.TestUtils.sleep
for len=1000
2017-07-10 15:35:048 INFO  LogUtil:64 - org.apache.directory.fortress.core.impl.TestUtils.sleep
for len=1000
2017-07-10 15:35:049 INFO  LogUtil:64 - org.apache.directory.fortress.core.impl.TestUtils.sleep
for len=1000
2017-07-10 15:35:050 INFO  LogUtil:64 - org.apache.directory.fortress.core.impl.TestUtils.sleep
for len=1000
2017-07-10 15:35:051 INFO  LogUtil:64 - org.apache.directory.fortress.core.impl.TestUtils.sleep
for len=1000
2017-07-10 15:35:052 INFO  LogUtil:64 - org.apache.directory.fortress.core.impl.TestUtils.sleep
for len=1000
2017-07-10 15:35:053 INFO  LogUtil:64 - org.apache.directory.fortress.core.impl.TestUtils.sleep
for len=1000
2017-07-10 15:35:054 INFO  LogUtil:64 - org.apache.directory.fortress.core.impl.TestUtils.sleep
for len=1000
2017-07-10 15:35:055 INFO  LogUtil:64 - org.apache.directory.fortress.core.impl.TestUtils.sleep
for len=1000
2017-07-10 15:35:056 INFO  LogUtil:64 - org.apache.directory.fortress.core.impl.TestUtils.sleep
for len=1000
2017-07-10 15:35:057 INFO  LogUtil:64 - PWGRACE10 PLCY TP1 USR TU5
2017-07-10 15:35:057 INFO  UserDAO:1662 - deleteResetFlag user [jtsTU5User12] no such attribute:pwdReset
2017-07-10 15:35:057 INFO  LogUtil:64 - org.apache.directory.fortress.core.impl.TestUtils.sleep
for len=5000
2017-07-10 15:36:002 INFO  LogUtil:64 - org.apache.directory.fortress.core.impl.TestUtils.sleep
for len=1000
2017-07-10 15:36:003 INFO  LogUtil:64 - org.apache.directory.fortress.core.impl.TestUtils.sleep
for len=1000
2017-07-10 15:36:004 INFO  LogUtil:64 - org.apache.directory.fortress.core.impl.TestUtils.sleep
for len=1000
2017-07-10 15:36:005 INFO  LogUtil:64 - org.apache.directory.fortress.core.impl.TestUtils.sleep
for len=1000
2017-07-10 15:36:006 INFO  LogUtil:64 - org.apache.directory.fortress.core.impl.TestUtils.sleep
for len=1000
2017-07-10 15:36:007 INFO  LogUtil:64 - org.apache.directory.fortress.core.impl.TestUtils.sleep
for len=1000
2017-07-10 15:36:008 INFO  LogUtil:64 - PWMAXFAILK11 PLCY TP1 USR TU5
2017-07-10 15:36:008 INFO  LogUtil:64 - org.apache.directory.fortress.core.impl.TestUtils.sleep
for len=1000
2017-07-10 15:36:009 INFO  LogUtil:64 - org.apache.directory.fortress.core.impl.TestUtils.sleep
for len=1000
2017-07-10 15:36:010 INFO  LogUtil:64 - org.apache.directory.fortress.core.impl.TestUtils.sleep
for len=1000
2017-07-10 15:36:011 INFO  LogUtil:64 - org.apache.directory.fortress.core.impl.TestUtils.sleep
for len=1000
2017-07-10 15:36:012 INFO  LogUtil:64 - org.apache.directory.fortress.core.impl.TestUtils.sleep
for len=1000
2017-07-10 15:36:013 INFO  LogUtil:64 - org.apache.directory.fortress.core.impl.TestUtils.sleep
for len=1000
2017-07-10 15:36:014 INFO  LogUtil:64 - org.apache.directory.fortress.core.impl.TestUtils.sleep
for len=1000
2017-07-10 15:36:015 INFO  LogUtil:64 - org.apache.directory.fortress.core.impl.TestUtils.sleep
for len=1000
2017-07-10 15:36:016 INFO  LogUtil:64 - org.apache.directory.fortress.core.impl.TestUtils.sleep
for len=1000
2017-07-10 15:36:017 INFO  LogUtil:64 - org.apache.directory.fortress.core.impl.TestUtils.sleep
for len=1000
2017-07-10 15:36:019 INFO  LogUtil:64 - PWMAXFAIL12 PLCY TP1 USR TU5
2017-07-10 15:36:019 INFO  LogUtil:64 - org.apache.directory.fortress.core.impl.TestUtils.sleep
for len=1000
2017-07-10 15:36:020 INFO  LogUtil:64 - org.apache.directory.fortress.core.impl.TestUtils.sleep
for len=1000
2017-07-10 15:36:021 INFO  LogUtil:64 - org.apache.directory.fortress.core.impl.TestUtils.sleep
for len=1000
2017-07-10 15:36:022 INFO  LogUtil:64 - org.apache.directory.fortress.core.impl.TestUtils.sleep
for len=1000
2017-07-10 15:36:023 INFO  LogUtil:64 - org.apache.directory.fortress.core.impl.TestUtils.sleep
for len=1000
2017-07-10 15:36:024 INFO  LogUtil:64 - PWDURATION13 PLCY TP1 USR TU5
2017-07-10 15:36:024 INFO  LogUtil:64 - org.apache.directory.fortress.core.impl.TestUtils.sleep
for len=1000
2017-07-10 15:36:025 INFO  LogUtil:64 - org.apache.directory.fortress.core.impl.TestUtils.sleep
for len=1000
2017-07-10 15:36:026 INFO  LogUtil:64 - org.apache.directory.fortress.core.impl.TestUtils.sleep
for len=1000
2017-07-10 15:36:027 INFO  LogUtil:64 - org.apache.directory.fortress.core.impl.TestUtils.sleep
for len=4000
2017-07-10 15:36:031 INFO  LogUtil:64 - org.apache.directory.fortress.core.impl.TestUtils.sleep
for len=1000
2017-07-10 15:36:032 INFO  LogUtil:64 - PWDURATION14 PLCY TP1 USR TU5
2017-07-10 15:36:032 INFO  LogUtil:64 - org.apache.directory.fortress.core.impl.TestUtils.sleep
for len=1000
2017-07-10 15:36:033 INFO  LogUtil:64 - org.apache.directory.fortress.core.impl.TestUtils.sleep
for len=1000
2017-07-10 15:36:034 INFO  LogUtil:64 - org.apache.directory.fortress.core.impl.TestUtils.sleep
for len=1000
2017-07-10 15:36:035 INFO  LogUtil:64 - org.apache.directory.fortress.core.impl.TestUtils.sleep
for len=1000
2017-07-10 15:36:036 INFO  LogUtil:64 - org.apache.directory.fortress.core.impl.TestUtils.sleep
for len=1000
2017-07-10 15:36:037 INFO  LogUtil:64 - org.apache.directory.fortress.core.impl.TestUtils.sleep
for len=5000
2017-07-10 15:36:042 INFO  LogUtil:64 - org.apache.directory.fortress.core.impl.TestUtils.sleep
for len=1000
2017-07-10 15:36:043 INFO  LogUtil:64 - PWLOCK15 PLCY TP1 USR TU5
2017-07-10 15:36:043 INFO  LogUtil:64 - org.apache.directory.fortress.core.impl.TestUtils.sleep
for len=1000
2017-07-10 15:36:044 INFO  LogUtil:64 - org.apache.directory.fortress.core.impl.TestUtils.sleep
for len=1000
2017-07-10 15:36:045 INFO  LogUtil:64 - org.apache.directory.fortress.core.impl.TestUtils.sleep
for len=1000
2017-07-10 15:36:046 INFO  LogUtil:64 - PWLOCK16 PLCY TP1 USR TU5
2017-07-10 15:36:046 INFO  LogUtil:64 - org.apache.directory.fortress.core.impl.TestUtils.sleep
for len=1000
2017-07-10 15:36:047 INFO  LogUtil:64 - org.apache.directory.fortress.core.impl.TestUtils.sleep
for len=1000
2017-07-10 15:36:048 INFO  LogUtil:64 - org.apache.directory.fortress.core.impl.TestUtils.sleep
for len=1000
2017-07-10 15:36:050 INFO  LogUtil:64 - PWINTERVAL17 PLCY TP1 USR TU5
2017-07-10 15:36:050 INFO  LogUtil:64 - org.apache.directory.fortress.core.impl.TestUtils.sleep
for len=1000
2017-07-10 15:36:051 INFO  LogUtil:64 - org.apache.directory.fortress.core.impl.TestUtils.sleep
for len=1000
2017-07-10 15:36:052 INFO  LogUtil:64 - org.apache.directory.fortress.core.impl.TestUtils.sleep
for len=1000
2017-07-10 15:36:053 INFO  LogUtil:64 - org.apache.directory.fortress.core.impl.TestUtils.sleep
for len=1000
2017-07-10 15:36:054 INFO  LogUtil:64 - org.apache.directory.fortress.core.impl.TestUtils.sleep
for len=1000
2017-07-10 15:36:055 INFO  LogUtil:64 - org.apache.directory.fortress.core.impl.TestUtils.sleep
for len=5000
2017-07-10 15:37:000 INFO  LogUtil:64 - org.apache.directory.fortress.core.impl.TestUtils.sleep
for len=1000
2017-07-10 15:37:001 INFO  LogUtil:64 - org.apache.directory.fortress.core.impl.TestUtils.sleep
for len=1000
2017-07-10 15:37:002 INFO  LogUtil:64 - org.apache.directory.fortress.core.impl.TestUtils.sleep
for len=1000
2017-07-10 15:37:003 INFO  LogUtil:64 - org.apache.directory.fortress.core.impl.TestUtils.sleep
for len=1000
2017-07-10 15:37:004 INFO  LogUtil:64 - org.apache.directory.fortress.core.impl.TestUtils.sleep
for len=1000
2017-07-10 15:37:005 INFO  LogUtil:64 - org.apache.directory.fortress.core.impl.TestUtils.sleep
for len=1000
2017-07-10 15:37:006 INFO  LogUtil:64 - org.apache.directory.fortress.core.impl.TestUtils.sleep
for len=5000
2017-07-10 15:37:011 INFO  LogUtil:64 - org.apache.directory.fortress.core.impl.TestUtils.sleep
for len=1000
2017-07-10 15:37:012 INFO  LogUtil:64 - PWINTERVAL18 PLCY TP1 USR TU5
2017-07-10 15:37:012 INFO  LogUtil:64 - org.apache.directory.fortress.core.impl.TestUtils.sleep
for len=1000
2017-07-10 15:37:013 INFO  LogUtil:64 - org.apache.directory.fortress.core.impl.TestUtils.sleep
for len=1000
2017-07-10 15:37:014 INFO  LogUtil:64 - org.apache.directory.fortress.core.impl.TestUtils.sleep
for len=7000
2017-07-10 15:37:021 INFO  LogUtil:64 - org.apache.directory.fortress.core.impl.TestUtils.sleep
for len=1000
2017-07-10 15:37:022 INFO  LogUtil:64 - org.apache.directory.fortress.core.impl.TestUtils.sleep
for len=1000
2017-07-10 15:37:023 INFO  LogUtil:64 - org.apache.directory.fortress.core.impl.TestUtils.sleep
for len=1000
2017-07-10 15:37:024 INFO  LogUtil:64 - org.apache.directory.fortress.core.impl.TestUtils.sleep
for len=7000
2017-07-10 15:37:031 INFO  LogUtil:64 - org.apache.directory.fortress.core.impl.TestUtils.sleep
for len=1000
2017-07-10 15:37:032 INFO  LogUtil:64 - PWMUST19 PLCY TP1 USR TU5
2017-07-10 15:37:032 INFO  LogUtil:64 - org.apache.directory.fortress.core.impl.TestUtils.sleep
for len=1000
2017-07-10 15:37:033 INFO  LogUtil:64 - PWMUST20 PLCY TP1 USR TU5
2017-07-10 15:37:033 INFO  LogUtil:64 - org.apache.directory.fortress.core.impl.TestUtils.sleep
for len=1000
2017-07-10 15:37:034 INFO  LogUtil:64 - PWALLOW21 PLCY TP1 USR TU5
2017-07-10 15:37:034 INFO  LogUtil:64 - org.apache.directory.fortress.core.impl.TestUtils.sleep
for len=1000
2017-07-10 15:37:035 INFO  LogUtil:64 - PWALLOW22 PLCY TP1 USR TU5
2017-07-10 15:37:035 INFO  UserDAO:1662 - deleteResetFlag user [jtsTU5User24] no such attribute:pwdReset
2017-07-10 15:37:035 INFO  LogUtil:64 - PWSAFEW23 PLCY TP1 USR TU5
2017-07-10 15:37:035 INFO  LogUtil:64 - org.apache.directory.fortress.core.impl.TestUtils.sleep
for len=1000
2017-07-10 15:37:036 INFO  LogUtil:64 - PWSAFE24 PLCY TP1 USR TU5
2017-07-10 15:37:036 INFO  UserDAO:1662 - deleteResetFlag user [jtsTU5User26] no such attribute:pwdReset
Tests run: 124, Failures: 7, Errors: 0, Skipped: 0, Time elapsed: 346.416 sec <<<
FAILURE! - in org.apache.directory.fortress.core.impl.FortressJUnitTest
testCreateSession(org.apache.directory.fortress.core.impl.AccessMgrImplTest)  Time elapsed:
0.057 sec  <<< FAILURE!
junit.framework.AssertionFailedError: org.apache.directory.fortress.core.impl.AccessMgrImplTest.createSessions
user role check failed list size user [jtsUser1] expected:<10> but was:<9>
	at junit.framework.Assert.fail(Assert.java:57)
	at junit.framework.Assert.failNotEquals(Assert.java:329)
	at junit.framework.Assert.assertEquals(Assert.java:78)
	at junit.framework.Assert.assertEquals(Assert.java:234)
	at junit.framework.TestCase.assertEquals(TestCase.java:401)
	at org.apache.directory.fortress.core.impl.AccessMgrImplTest.createSessions(AccessMgrImplTest.java:373)
	at org.apache.directory.fortress.core.impl.AccessMgrImplTest.testCreateSession(AccessMgrImplTest.java:345)

testCreateSessionTrusted(org.apache.directory.fortress.core.impl.AccessMgrImplTest)  Time
elapsed: 0.02 sec  <<< FAILURE!
junit.framework.AssertionFailedError: org.apache.directory.fortress.core.impl.AccessMgrImplTest.createSessionsTrusted
user role check failed list size user [jtsUser1] expected:<10> but was:<9>
	at junit.framework.Assert.fail(Assert.java:57)
	at junit.framework.Assert.failNotEquals(Assert.java:329)
	at junit.framework.Assert.assertEquals(Assert.java:78)
	at junit.framework.Assert.assertEquals(Assert.java:234)
	at junit.framework.TestCase.assertEquals(TestCase.java:401)
	at org.apache.directory.fortress.core.impl.AccessMgrImplTest.createSessionsTrusted(AccessMgrImplTest.java:553)
	at org.apache.directory.fortress.core.impl.AccessMgrImplTest.testCreateSessionTrusted(AccessMgrImplTest.java:524)

testSessionRole(org.apache.directory.fortress.core.impl.AccessMgrImplTest)  Time elapsed:
0.026 sec  <<< FAILURE!
junit.framework.AssertionFailedError: org.apache.directory.fortress.core.impl.AccessMgrImplTest.sessionRoles
user role check failed list size user [jtsUser1] expected:<10> but was:<9>
	at junit.framework.Assert.fail(Assert.java:57)
	at junit.framework.Assert.failNotEquals(Assert.java:329)
	at junit.framework.Assert.assertEquals(Assert.java:78)
	at junit.framework.Assert.assertEquals(Assert.java:234)
	at junit.framework.TestCase.assertEquals(TestCase.java:401)
	at org.apache.directory.fortress.core.impl.AccessMgrImplTest.sessionRoles(AccessMgrImplTest.java:998)
	at org.apache.directory.fortress.core.impl.AccessMgrImplTest.testSessionRole(AccessMgrImplTest.java:970)

testAddActiveRole(org.apache.directory.fortress.core.impl.AccessMgrImplTest)  Time elapsed:
0.02 sec  <<< FAILURE!
junit.framework.AssertionFailedError: org.apache.directory.fortress.core.impl.AccessMgrImplTest.addActiveRoles
failed list size user[jtsUser1] expected:<10> but was:<9>
	at junit.framework.Assert.fail(Assert.java:57)
	at junit.framework.Assert.failNotEquals(Assert.java:329)
	at junit.framework.Assert.assertEquals(Assert.java:78)
	at junit.framework.Assert.assertEquals(Assert.java:234)
	at junit.framework.TestCase.assertEquals(TestCase.java:401)
	at org.apache.directory.fortress.core.impl.AccessMgrImplTest.addActiveRoles(AccessMgrImplTest.java:1061)
	at org.apache.directory.fortress.core.impl.AccessMgrImplTest.testAddActiveRole(AccessMgrImplTest.java:1026)

testDropActiveRole(org.apache.directory.fortress.core.impl.AccessMgrImplTest)  Time elapsed:
0.018 sec  <<< FAILURE!
junit.framework.AssertionFailedError: org.apache.directory.fortress.core.impl.AccessMgrImplTest.dropActiveRoles
failed list size user[jtsUser1] expected:<10> but was:<9>
	at junit.framework.Assert.fail(Assert.java:57)
	at junit.framework.Assert.failNotEquals(Assert.java:329)
	at junit.framework.Assert.assertEquals(Assert.java:78)
	at junit.framework.Assert.assertEquals(Assert.java:234)
	at junit.framework.TestCase.assertEquals(TestCase.java:401)
	at org.apache.directory.fortress.core.impl.AccessMgrImplTest.dropActiveRoles(AccessMgrImplTest.java:1185)
	at org.apache.directory.fortress.core.impl.AccessMgrImplTest.testDropActiveRole(AccessMgrImplTest.java:1161)

testCreateSessionWithRole(org.apache.directory.fortress.core.impl.AccessMgrImplTest)  Time
elapsed: 0.01 sec  <<< FAILURE!
junit.framework.AssertionFailedError: org.apache.directory.fortress.core.impl.AccessMgrImplTest.createSessionsWithRoles
failed role search USER [jtsUser1] CNT [2] size [1]
	at junit.framework.Assert.fail(Assert.java:57)
	at junit.framework.Assert.assertTrue(Assert.java:22)
	at junit.framework.TestCase.assertTrue(TestCase.java:192)
	at org.apache.directory.fortress.core.impl.AccessMgrImplTest.createSessionsWithRoles(AccessMgrImplTest.java:440)
	at org.apache.directory.fortress.core.impl.AccessMgrImplTest.testCreateSessionWithRole(AccessMgrImplTest.java:413)

testCreateSessionWithRolesTrusted(org.apache.directory.fortress.core.impl.AccessMgrImplTest)
 Time elapsed: 0.004 sec  <<< FAILURE!
junit.framework.AssertionFailedError: org.apache.directory.fortress.core.impl.AccessMgrImplTest.createSessionsWithRolesTrusted
failed role search USER [jtsUser1] CNT [2] size [1]
	at junit.framework.Assert.fail(Assert.java:57)
	at junit.framework.Assert.assertTrue(Assert.java:22)
	at junit.framework.TestCase.assertTrue(TestCase.java:192)
	at org.apache.directory.fortress.core.impl.AccessMgrImplTest.createSessionsWithRolesTrusted(AccessMgrImplTest.java:497)
	at org.apache.directory.fortress.core.impl.AccessMgrImplTest.testCreateSessionWithRolesTrusted(AccessMgrImplTest.java:467)


Results :

Failed tests: 
  AccessMgrImplTest.testAddActiveRole:1026->addActiveRoles:1061 org.apache.directory.fortress.core.impl.AccessMgrImplTest.addActiveRoles
failed list size user[jtsUser1] expected:<10> but was:<9>
  AccessMgrImplTest.testCreateSession:345->createSessions:373 org.apache.directory.fortress.core.impl.AccessMgrImplTest.createSessions
user role check failed list size user [jtsUser1] expected:<10> but was:<9>
  AccessMgrImplTest.testCreateSessionTrusted:524->createSessionsTrusted:553 org.apache.directory.fortress.core.impl.AccessMgrImplTest.createSessionsTrusted
user role check failed list size user [jtsUser1] expected:<10> but was:<9>
  AccessMgrImplTest.testCreateSessionWithRole:413->createSessionsWithRoles:440 org.apache.directory.fortress.core.impl.AccessMgrImplTest.createSessionsWithRoles
failed role search USER [jtsUser1] CNT [2] size [1]
  AccessMgrImplTest.testCreateSessionWithRolesTrusted:467->createSessionsWithRolesTrusted:497
org.apache.directory.fortress.core.impl.AccessMgrImplTest.createSessionsWithRolesTrusted failed
role search USER [jtsUser1] CNT [2] size [1]
  AccessMgrImplTest.testDropActiveRole:1161->dropActiveRoles:1185 org.apache.directory.fortress.core.impl.AccessMgrImplTest.dropActiveRoles
failed list size user[jtsUser1] expected:<10> but was:<9>
  AccessMgrImplTest.testSessionRole:970->sessionRoles:998 org.apache.directory.fortress.core.impl.AccessMgrImplTest.sessionRoles
user role check failed list size user [jtsUser1] expected:<10> but was:<9>

Tests run: 124, Failures: 7, Errors: 0, Skipped: 0

[INFO] ------------------------------------------------------------------------
[INFO] BUILD FAILURE
[INFO] ------------------------------------------------------------------------
[INFO] Total time: 05:54 min
[INFO] Finished at: 2017-07-10T15:37:37+00:00
[INFO] Final Memory: 23M/308M
[INFO] ------------------------------------------------------------------------
[ERROR] Failed to execute goal org.apache.maven.plugins:maven-surefire-plugin:2.18.1:test
(default-test) on project fortress-core: There are test failures.
[ERROR] 
[ERROR] Please refer to <https://builds.apache.org/job/dir-fortress-core-docker-apacheds-test/ws/target/surefire-reports>
for the individual test results.
[ERROR] -> [Help 1]
[ERROR] 
[ERROR] To see the full stack trace of the errors, re-run Maven with the -e switch.
[ERROR] Re-run Maven using the -X switch to enable full debug logging.
[ERROR] 
[ERROR] For more information about the errors and possible solutions, please read the following
articles:
[ERROR] [Help 1] http://cwiki.apache.org/confluence/display/MAVEN/MojoFailureException
Build step 'Invoke top-level Maven targets' marked build as failure
[dir-fortress-core-docker-apacheds-test] $ /bin/bash /tmp/hudson1440036565575194789.sh
dir-fortress-core-docker-apacheds-test
dir-fortress-core-docker-apacheds-test
CONTAINER ID        IMAGE                         COMMAND                  CREATED       
     STATUS              PORTS               NAMES
ed08797a8bfc        mesos-1499384218-31107        "/bin/sh -c './boo..."   3 days ago    
     Up 3 days                               stoic_hawking
0f1d194633f8        mesos-1499364722-16615        "/bin/sh -c './boo..."   3 days ago    
     Up 3 days                               hungry_mirzakhani
7a5fb49c78ad        mesos-1499320926-11595        "/bin/sh -c './boo..."   4 days ago    
     Up 4 days                               condescending_easley
e82cd10174a4        madlib/postgres_9.6:jenkins   "docker-entrypoint..."   11 days ago   
     Up 11 days          5432/tcp            madlib

Mime
View raw message