directory-notifications mailing list archives

Site index · List index
Message view « Date » · « Thread »
Top « Date » · « Thread »
From Apache Jenkins Server <jenk...@builds.apache.org>
Subject Build failed in Jenkins: dir-fortress-core-docker-apacheds-test #31
Date Tue, 11 Jul 2017 16:50:03 GMT
See <https://builds.apache.org/job/dir-fortress-core-docker-apacheds-test/31/display/redirect?page=changes>

Changes:

[clp207] FC-222 added method to find user role with constraint type and attribute

------------------------------------------
[...truncated 231.92 KB...]
2017-07-11 16:47:039 INFO  UserDAO:1735 - deleteResetFlag user [jtsTU5User6] no such attribute:pwdReset
2017-07-11 16:47:039 INFO  UserDAO:1735 - deleteResetFlag user [jtsTU5User6] no such attribute:pwdReset
2017-07-11 16:47:039 INFO  UserDAO:1735 - deleteResetFlag user [jtsTU5User6] no such attribute:pwdReset
2017-07-11 16:47:039 INFO  UserDAO:1735 - deleteResetFlag user [jtsTU5User6] no such attribute:pwdReset
2017-07-11 16:47:039 INFO  UserDAO:1735 - deleteResetFlag user [jtsTU5User6] no such attribute:pwdReset
2017-07-11 16:47:039 INFO  UserDAO:1735 - deleteResetFlag user [jtsTU5User6] no such attribute:pwdReset
2017-07-11 16:47:039 INFO  UserDAO:1735 - deleteResetFlag user [jtsTU5User6] no such attribute:pwdReset
2017-07-11 16:47:039 INFO  UserDAO:1735 - deleteResetFlag user [jtsTU5User6] no such attribute:pwdReset
2017-07-11 16:47:039 INFO  UserDAO:1735 - deleteResetFlag user [jtsTU5User6] no such attribute:pwdReset
2017-07-11 16:47:039 INFO  UserDAO:1735 - deleteResetFlag user [jtsTU5User6] no such attribute:pwdReset
2017-07-11 16:47:039 INFO  UserDAO:1735 - deleteResetFlag user [jtsTU5User6] no such attribute:pwdReset
2017-07-11 16:47:039 INFO  UserDAO:1735 - deleteResetFlag user [jtsTU5User6] no such attribute:pwdReset
2017-07-11 16:47:039 INFO  UserDAO:1735 - deleteResetFlag user [jtsTU5User6] no such attribute:pwdReset
2017-07-11 16:47:039 INFO  UserDAO:1735 - deleteResetFlag user [jtsTU5User6] no such attribute:pwdReset
2017-07-11 16:47:039 INFO  UserDAO:1735 - deleteResetFlag user [jtsTU5User6] no such attribute:pwdReset
2017-07-11 16:47:039 INFO  UserDAO:1735 - deleteResetFlag user [jtsTU5User6] no such attribute:pwdReset
2017-07-11 16:47:040 INFO  UserDAO:1735 - deleteResetFlag user [jtsTU5User6] no such attribute:pwdReset
2017-07-11 16:47:040 INFO  UserDAO:1735 - deleteResetFlag user [jtsTU5User6] no such attribute:pwdReset
2017-07-11 16:47:040 INFO  UserDAO:1735 - deleteResetFlag user [jtsTU5User6] no such attribute:pwdReset
2017-07-11 16:47:040 INFO  UserDAO:1735 - deleteResetFlag user [jtsTU5User6] no such attribute:pwdReset
2017-07-11 16:47:040 INFO  UserDAO:1735 - deleteResetFlag user [jtsTU5User6] no such attribute:pwdReset
2017-07-11 16:47:040 INFO  UserDAO:1735 - deleteResetFlag user [jtsTU5User6] no such attribute:pwdReset
2017-07-11 16:47:040 INFO  UserDAO:1735 - deleteResetFlag user [jtsTU5User6] no such attribute:pwdReset
2017-07-11 16:47:040 INFO  UserDAO:1735 - deleteResetFlag user [jtsTU5User6] no such attribute:pwdReset
2017-07-11 16:47:040 INFO  UserDAO:1735 - deleteResetFlag user [jtsTU5User6] no such attribute:pwdReset
2017-07-11 16:47:040 INFO  UserDAO:1735 - deleteResetFlag user [jtsTU5User6] no such attribute:pwdReset
2017-07-11 16:47:040 INFO  UserDAO:1735 - deleteResetFlag user [jtsTU5User6] no such attribute:pwdReset
2017-07-11 16:47:040 INFO  UserDAO:1735 - deleteResetFlag user [jtsTU5User6] no such attribute:pwdReset
2017-07-11 16:47:040 INFO  UserDAO:1735 - deleteResetFlag user [jtsTU5User6] no such attribute:pwdReset
2017-07-11 16:47:040 INFO  UserDAO:1735 - deleteResetFlag user [jtsTU5User6] no such attribute:pwdReset
2017-07-11 16:47:040 INFO  UserDAO:1735 - deleteResetFlag user [jtsTU5User6] no such attribute:pwdReset
2017-07-11 16:47:040 INFO  UserDAO:1735 - deleteResetFlag user [jtsTU5User6] no such attribute:pwdReset
2017-07-11 16:47:040 INFO  LogUtil:64 - PWLEN7 PLCY TP1 USR TU5
2017-07-11 16:47:040 INFO  LogUtil:64 - PWLEN8 PLCY TP1 USR TU5
2017-07-11 16:47:040 INFO  LogUtil:64 - PWEXP7 PLCY TP1 USR TU5
2017-07-11 16:47:040 INFO  UserDAO:1735 - deleteResetFlag user [jtsTU5User9] no such attribute:pwdReset
2017-07-11 16:47:040 INFO  LogUtil:64 - org.apache.directory.fortress.core.impl.TestUtils.sleep
for len=2000
2017-07-11 16:47:042 INFO  LogUtil:64 - org.apache.directory.fortress.core.impl.TestUtils.sleep
for len=1000
2017-07-11 16:47:043 INFO  LogUtil:64 - org.apache.directory.fortress.core.impl.TestUtils.sleep
for len=2000
2017-07-11 16:47:045 INFO  LogUtil:64 - PWEXP8 PLCY TP1 USR TU5
2017-07-11 16:47:046 INFO  UserDAO:1735 - deleteResetFlag user [jtsTU5User10] no such attribute:pwdReset
2017-07-11 16:47:046 INFO  LogUtil:64 - org.apache.directory.fortress.core.impl.TestUtils.sleep
for len=4000
2017-07-11 16:47:050 INFO  LogUtil:64 - org.apache.directory.fortress.core.impl.TestUtils.sleep
for len=1000
2017-07-11 16:47:051 INFO  LogUtil:64 - org.apache.directory.fortress.core.impl.TestUtils.sleep
for len=4000
2017-07-11 16:47:055 INFO  LogUtil:64 - PWGRACE9 PLCY TP1 USR TU5
2017-07-11 16:47:055 INFO  UserDAO:1735 - deleteResetFlag user [jtsTU5User11] no such attribute:pwdReset
2017-07-11 16:47:055 INFO  LogUtil:64 - org.apache.directory.fortress.core.impl.TestUtils.sleep
for len=6000
2017-07-11 16:48:001 INFO  LogUtil:64 - org.apache.directory.fortress.core.impl.TestUtils.sleep
for len=1000
2017-07-11 16:48:002 INFO  LogUtil:64 - org.apache.directory.fortress.core.impl.TestUtils.sleep
for len=1000
2017-07-11 16:48:003 INFO  LogUtil:64 - org.apache.directory.fortress.core.impl.TestUtils.sleep
for len=1000
2017-07-11 16:48:004 INFO  LogUtil:64 - org.apache.directory.fortress.core.impl.TestUtils.sleep
for len=1000
2017-07-11 16:48:005 INFO  LogUtil:64 - org.apache.directory.fortress.core.impl.TestUtils.sleep
for len=1000
2017-07-11 16:48:006 INFO  LogUtil:64 - org.apache.directory.fortress.core.impl.TestUtils.sleep
for len=1000
2017-07-11 16:48:007 INFO  LogUtil:64 - org.apache.directory.fortress.core.impl.TestUtils.sleep
for len=1000
2017-07-11 16:48:008 INFO  LogUtil:64 - org.apache.directory.fortress.core.impl.TestUtils.sleep
for len=1000
2017-07-11 16:48:009 INFO  LogUtil:64 - org.apache.directory.fortress.core.impl.TestUtils.sleep
for len=1000
2017-07-11 16:48:010 INFO  LogUtil:64 - org.apache.directory.fortress.core.impl.TestUtils.sleep
for len=1000
2017-07-11 16:48:011 INFO  LogUtil:64 - org.apache.directory.fortress.core.impl.TestUtils.sleep
for len=1000
2017-07-11 16:48:012 INFO  LogUtil:64 - PWGRACE10 PLCY TP1 USR TU5
2017-07-11 16:48:012 INFO  UserDAO:1735 - deleteResetFlag user [jtsTU5User12] no such attribute:pwdReset
2017-07-11 16:48:012 INFO  LogUtil:64 - org.apache.directory.fortress.core.impl.TestUtils.sleep
for len=5000
2017-07-11 16:48:017 INFO  LogUtil:64 - org.apache.directory.fortress.core.impl.TestUtils.sleep
for len=1000
2017-07-11 16:48:018 INFO  LogUtil:64 - org.apache.directory.fortress.core.impl.TestUtils.sleep
for len=1000
2017-07-11 16:48:019 INFO  LogUtil:64 - org.apache.directory.fortress.core.impl.TestUtils.sleep
for len=1000
2017-07-11 16:48:020 INFO  LogUtil:64 - org.apache.directory.fortress.core.impl.TestUtils.sleep
for len=1000
2017-07-11 16:48:021 INFO  LogUtil:64 - org.apache.directory.fortress.core.impl.TestUtils.sleep
for len=1000
2017-07-11 16:48:022 INFO  LogUtil:64 - org.apache.directory.fortress.core.impl.TestUtils.sleep
for len=1000
2017-07-11 16:48:023 INFO  LogUtil:64 - PWMAXFAILK11 PLCY TP1 USR TU5
2017-07-11 16:48:023 INFO  LogUtil:64 - org.apache.directory.fortress.core.impl.TestUtils.sleep
for len=1000
2017-07-11 16:48:025 INFO  LogUtil:64 - org.apache.directory.fortress.core.impl.TestUtils.sleep
for len=1000
2017-07-11 16:48:026 INFO  LogUtil:64 - org.apache.directory.fortress.core.impl.TestUtils.sleep
for len=1000
2017-07-11 16:48:027 INFO  LogUtil:64 - org.apache.directory.fortress.core.impl.TestUtils.sleep
for len=1000
2017-07-11 16:48:028 INFO  LogUtil:64 - org.apache.directory.fortress.core.impl.TestUtils.sleep
for len=1000
2017-07-11 16:48:029 INFO  LogUtil:64 - org.apache.directory.fortress.core.impl.TestUtils.sleep
for len=1000
2017-07-11 16:48:030 INFO  LogUtil:64 - org.apache.directory.fortress.core.impl.TestUtils.sleep
for len=1000
2017-07-11 16:48:031 INFO  LogUtil:64 - org.apache.directory.fortress.core.impl.TestUtils.sleep
for len=1000
2017-07-11 16:48:032 INFO  LogUtil:64 - org.apache.directory.fortress.core.impl.TestUtils.sleep
for len=1000
2017-07-11 16:48:033 INFO  LogUtil:64 - org.apache.directory.fortress.core.impl.TestUtils.sleep
for len=1000
2017-07-11 16:48:034 INFO  LogUtil:64 - PWMAXFAIL12 PLCY TP1 USR TU5
2017-07-11 16:48:034 INFO  LogUtil:64 - org.apache.directory.fortress.core.impl.TestUtils.sleep
for len=1000
2017-07-11 16:48:035 INFO  LogUtil:64 - org.apache.directory.fortress.core.impl.TestUtils.sleep
for len=1000
2017-07-11 16:48:036 INFO  LogUtil:64 - org.apache.directory.fortress.core.impl.TestUtils.sleep
for len=1000
2017-07-11 16:48:037 INFO  LogUtil:64 - org.apache.directory.fortress.core.impl.TestUtils.sleep
for len=1000
2017-07-11 16:48:038 INFO  LogUtil:64 - org.apache.directory.fortress.core.impl.TestUtils.sleep
for len=1000
2017-07-11 16:48:039 INFO  LogUtil:64 - PWDURATION13 PLCY TP1 USR TU5
2017-07-11 16:48:039 INFO  LogUtil:64 - org.apache.directory.fortress.core.impl.TestUtils.sleep
for len=1000
2017-07-11 16:48:040 INFO  LogUtil:64 - org.apache.directory.fortress.core.impl.TestUtils.sleep
for len=1000
2017-07-11 16:48:041 INFO  LogUtil:64 - org.apache.directory.fortress.core.impl.TestUtils.sleep
for len=1000
2017-07-11 16:48:042 INFO  LogUtil:64 - org.apache.directory.fortress.core.impl.TestUtils.sleep
for len=4000
2017-07-11 16:48:046 INFO  LogUtil:64 - org.apache.directory.fortress.core.impl.TestUtils.sleep
for len=1000
2017-07-11 16:48:047 INFO  LogUtil:64 - PWDURATION14 PLCY TP1 USR TU5
2017-07-11 16:48:047 INFO  LogUtil:64 - org.apache.directory.fortress.core.impl.TestUtils.sleep
for len=1000
2017-07-11 16:48:048 INFO  LogUtil:64 - org.apache.directory.fortress.core.impl.TestUtils.sleep
for len=1000
2017-07-11 16:48:049 INFO  LogUtil:64 - org.apache.directory.fortress.core.impl.TestUtils.sleep
for len=1000
2017-07-11 16:48:050 INFO  LogUtil:64 - org.apache.directory.fortress.core.impl.TestUtils.sleep
for len=1000
2017-07-11 16:48:051 INFO  LogUtil:64 - org.apache.directory.fortress.core.impl.TestUtils.sleep
for len=1000
2017-07-11 16:48:052 INFO  LogUtil:64 - org.apache.directory.fortress.core.impl.TestUtils.sleep
for len=5000
2017-07-11 16:48:057 INFO  LogUtil:64 - org.apache.directory.fortress.core.impl.TestUtils.sleep
for len=1000
2017-07-11 16:48:058 INFO  LogUtil:64 - PWLOCK15 PLCY TP1 USR TU5
2017-07-11 16:48:058 INFO  LogUtil:64 - org.apache.directory.fortress.core.impl.TestUtils.sleep
for len=1000
2017-07-11 16:48:059 INFO  LogUtil:64 - org.apache.directory.fortress.core.impl.TestUtils.sleep
for len=1000
2017-07-11 16:49:001 INFO  LogUtil:64 - org.apache.directory.fortress.core.impl.TestUtils.sleep
for len=1000
2017-07-11 16:49:002 INFO  LogUtil:64 - PWLOCK16 PLCY TP1 USR TU5
2017-07-11 16:49:002 INFO  LogUtil:64 - org.apache.directory.fortress.core.impl.TestUtils.sleep
for len=1000
2017-07-11 16:49:003 INFO  LogUtil:64 - org.apache.directory.fortress.core.impl.TestUtils.sleep
for len=1000
2017-07-11 16:49:004 INFO  LogUtil:64 - org.apache.directory.fortress.core.impl.TestUtils.sleep
for len=1000
2017-07-11 16:49:005 INFO  LogUtil:64 - PWINTERVAL17 PLCY TP1 USR TU5
2017-07-11 16:49:005 INFO  LogUtil:64 - org.apache.directory.fortress.core.impl.TestUtils.sleep
for len=1000
2017-07-11 16:49:006 INFO  LogUtil:64 - org.apache.directory.fortress.core.impl.TestUtils.sleep
for len=1000
2017-07-11 16:49:007 INFO  LogUtil:64 - org.apache.directory.fortress.core.impl.TestUtils.sleep
for len=1000
2017-07-11 16:49:008 INFO  LogUtil:64 - org.apache.directory.fortress.core.impl.TestUtils.sleep
for len=1000
2017-07-11 16:49:009 INFO  LogUtil:64 - org.apache.directory.fortress.core.impl.TestUtils.sleep
for len=1000
2017-07-11 16:49:010 INFO  LogUtil:64 - org.apache.directory.fortress.core.impl.TestUtils.sleep
for len=5000
2017-07-11 16:49:015 INFO  LogUtil:64 - org.apache.directory.fortress.core.impl.TestUtils.sleep
for len=1000
2017-07-11 16:49:016 INFO  LogUtil:64 - org.apache.directory.fortress.core.impl.TestUtils.sleep
for len=1000
2017-07-11 16:49:017 INFO  LogUtil:64 - org.apache.directory.fortress.core.impl.TestUtils.sleep
for len=1000
2017-07-11 16:49:018 INFO  LogUtil:64 - org.apache.directory.fortress.core.impl.TestUtils.sleep
for len=1000
2017-07-11 16:49:019 INFO  LogUtil:64 - org.apache.directory.fortress.core.impl.TestUtils.sleep
for len=1000
2017-07-11 16:49:020 INFO  LogUtil:64 - org.apache.directory.fortress.core.impl.TestUtils.sleep
for len=1000
2017-07-11 16:49:021 INFO  LogUtil:64 - org.apache.directory.fortress.core.impl.TestUtils.sleep
for len=5000
2017-07-11 16:49:026 INFO  LogUtil:64 - org.apache.directory.fortress.core.impl.TestUtils.sleep
for len=1000
2017-07-11 16:49:027 INFO  LogUtil:64 - PWINTERVAL18 PLCY TP1 USR TU5
2017-07-11 16:49:027 INFO  LogUtil:64 - org.apache.directory.fortress.core.impl.TestUtils.sleep
for len=1000
2017-07-11 16:49:028 INFO  LogUtil:64 - org.apache.directory.fortress.core.impl.TestUtils.sleep
for len=1000
2017-07-11 16:49:029 INFO  LogUtil:64 - org.apache.directory.fortress.core.impl.TestUtils.sleep
for len=7000
2017-07-11 16:49:036 INFO  LogUtil:64 - org.apache.directory.fortress.core.impl.TestUtils.sleep
for len=1000
2017-07-11 16:49:037 INFO  LogUtil:64 - org.apache.directory.fortress.core.impl.TestUtils.sleep
for len=1000
2017-07-11 16:49:038 INFO  LogUtil:64 - org.apache.directory.fortress.core.impl.TestUtils.sleep
for len=1000
2017-07-11 16:49:039 INFO  LogUtil:64 - org.apache.directory.fortress.core.impl.TestUtils.sleep
for len=7000
2017-07-11 16:49:046 INFO  LogUtil:64 - org.apache.directory.fortress.core.impl.TestUtils.sleep
for len=1000
2017-07-11 16:49:047 INFO  LogUtil:64 - PWMUST19 PLCY TP1 USR TU5
2017-07-11 16:49:047 INFO  LogUtil:64 - org.apache.directory.fortress.core.impl.TestUtils.sleep
for len=1000
2017-07-11 16:49:048 INFO  LogUtil:64 - PWMUST20 PLCY TP1 USR TU5
2017-07-11 16:49:048 INFO  LogUtil:64 - org.apache.directory.fortress.core.impl.TestUtils.sleep
for len=1000
2017-07-11 16:49:049 INFO  LogUtil:64 - PWALLOW21 PLCY TP1 USR TU5
2017-07-11 16:49:049 INFO  LogUtil:64 - org.apache.directory.fortress.core.impl.TestUtils.sleep
for len=1000
2017-07-11 16:49:050 INFO  LogUtil:64 - PWALLOW22 PLCY TP1 USR TU5
2017-07-11 16:49:050 INFO  UserDAO:1735 - deleteResetFlag user [jtsTU5User24] no such attribute:pwdReset
2017-07-11 16:49:050 INFO  LogUtil:64 - PWSAFEW23 PLCY TP1 USR TU5
2017-07-11 16:49:050 INFO  LogUtil:64 - org.apache.directory.fortress.core.impl.TestUtils.sleep
for len=1000
2017-07-11 16:49:051 INFO  LogUtil:64 - PWSAFE24 PLCY TP1 USR TU5
2017-07-11 16:49:052 INFO  UserDAO:1735 - deleteResetFlag user [jtsTU5User26] no such attribute:pwdReset
Tests run: 124, Failures: 7, Errors: 0, Skipped: 0, Time elapsed: 344.635 sec <<<
FAILURE! - in org.apache.directory.fortress.core.impl.FortressJUnitTest
testCreateSession(org.apache.directory.fortress.core.impl.AccessMgrImplTest)  Time elapsed:
0.059 sec  <<< FAILURE!
junit.framework.AssertionFailedError: org.apache.directory.fortress.core.impl.AccessMgrImplTest.createSessions
user role check failed list size user [jtsUser1] expected:<10> but was:<9>
	at junit.framework.Assert.fail(Assert.java:57)
	at junit.framework.Assert.failNotEquals(Assert.java:329)
	at junit.framework.Assert.assertEquals(Assert.java:78)
	at junit.framework.Assert.assertEquals(Assert.java:234)
	at junit.framework.TestCase.assertEquals(TestCase.java:401)
	at org.apache.directory.fortress.core.impl.AccessMgrImplTest.createSessions(AccessMgrImplTest.java:373)
	at org.apache.directory.fortress.core.impl.AccessMgrImplTest.testCreateSession(AccessMgrImplTest.java:345)

testCreateSessionTrusted(org.apache.directory.fortress.core.impl.AccessMgrImplTest)  Time
elapsed: 0.019 sec  <<< FAILURE!
junit.framework.AssertionFailedError: org.apache.directory.fortress.core.impl.AccessMgrImplTest.createSessionsTrusted
user role check failed list size user [jtsUser1] expected:<10> but was:<9>
	at junit.framework.Assert.fail(Assert.java:57)
	at junit.framework.Assert.failNotEquals(Assert.java:329)
	at junit.framework.Assert.assertEquals(Assert.java:78)
	at junit.framework.Assert.assertEquals(Assert.java:234)
	at junit.framework.TestCase.assertEquals(TestCase.java:401)
	at org.apache.directory.fortress.core.impl.AccessMgrImplTest.createSessionsTrusted(AccessMgrImplTest.java:553)
	at org.apache.directory.fortress.core.impl.AccessMgrImplTest.testCreateSessionTrusted(AccessMgrImplTest.java:524)

testSessionRole(org.apache.directory.fortress.core.impl.AccessMgrImplTest)  Time elapsed:
0.015 sec  <<< FAILURE!
junit.framework.AssertionFailedError: org.apache.directory.fortress.core.impl.AccessMgrImplTest.sessionRoles
user role check failed list size user [jtsUser1] expected:<10> but was:<9>
	at junit.framework.Assert.fail(Assert.java:57)
	at junit.framework.Assert.failNotEquals(Assert.java:329)
	at junit.framework.Assert.assertEquals(Assert.java:78)
	at junit.framework.Assert.assertEquals(Assert.java:234)
	at junit.framework.TestCase.assertEquals(TestCase.java:401)
	at org.apache.directory.fortress.core.impl.AccessMgrImplTest.sessionRoles(AccessMgrImplTest.java:998)
	at org.apache.directory.fortress.core.impl.AccessMgrImplTest.testSessionRole(AccessMgrImplTest.java:970)

testAddActiveRole(org.apache.directory.fortress.core.impl.AccessMgrImplTest)  Time elapsed:
0.024 sec  <<< FAILURE!
junit.framework.AssertionFailedError: org.apache.directory.fortress.core.impl.AccessMgrImplTest.addActiveRoles
failed list size user[jtsUser1] expected:<10> but was:<9>
	at junit.framework.Assert.fail(Assert.java:57)
	at junit.framework.Assert.failNotEquals(Assert.java:329)
	at junit.framework.Assert.assertEquals(Assert.java:78)
	at junit.framework.Assert.assertEquals(Assert.java:234)
	at junit.framework.TestCase.assertEquals(TestCase.java:401)
	at org.apache.directory.fortress.core.impl.AccessMgrImplTest.addActiveRoles(AccessMgrImplTest.java:1061)
	at org.apache.directory.fortress.core.impl.AccessMgrImplTest.testAddActiveRole(AccessMgrImplTest.java:1026)

testDropActiveRole(org.apache.directory.fortress.core.impl.AccessMgrImplTest)  Time elapsed:
0.027 sec  <<< FAILURE!
junit.framework.AssertionFailedError: org.apache.directory.fortress.core.impl.AccessMgrImplTest.dropActiveRoles
failed list size user[jtsUser1] expected:<10> but was:<9>
	at junit.framework.Assert.fail(Assert.java:57)
	at junit.framework.Assert.failNotEquals(Assert.java:329)
	at junit.framework.Assert.assertEquals(Assert.java:78)
	at junit.framework.Assert.assertEquals(Assert.java:234)
	at junit.framework.TestCase.assertEquals(TestCase.java:401)
	at org.apache.directory.fortress.core.impl.AccessMgrImplTest.dropActiveRoles(AccessMgrImplTest.java:1185)
	at org.apache.directory.fortress.core.impl.AccessMgrImplTest.testDropActiveRole(AccessMgrImplTest.java:1161)

testCreateSessionWithRole(org.apache.directory.fortress.core.impl.AccessMgrImplTest)  Time
elapsed: 0.01 sec  <<< FAILURE!
junit.framework.AssertionFailedError: org.apache.directory.fortress.core.impl.AccessMgrImplTest.createSessionsWithRoles
failed role search USER [jtsUser1] CNT [2] size [1]
	at junit.framework.Assert.fail(Assert.java:57)
	at junit.framework.Assert.assertTrue(Assert.java:22)
	at junit.framework.TestCase.assertTrue(TestCase.java:192)
	at org.apache.directory.fortress.core.impl.AccessMgrImplTest.createSessionsWithRoles(AccessMgrImplTest.java:440)
	at org.apache.directory.fortress.core.impl.AccessMgrImplTest.testCreateSessionWithRole(AccessMgrImplTest.java:413)

testCreateSessionWithRolesTrusted(org.apache.directory.fortress.core.impl.AccessMgrImplTest)
 Time elapsed: 0.005 sec  <<< FAILURE!
junit.framework.AssertionFailedError: org.apache.directory.fortress.core.impl.AccessMgrImplTest.createSessionsWithRolesTrusted
failed role search USER [jtsUser1] CNT [2] size [1]
	at junit.framework.Assert.fail(Assert.java:57)
	at junit.framework.Assert.assertTrue(Assert.java:22)
	at junit.framework.TestCase.assertTrue(TestCase.java:192)
	at org.apache.directory.fortress.core.impl.AccessMgrImplTest.createSessionsWithRolesTrusted(AccessMgrImplTest.java:497)
	at org.apache.directory.fortress.core.impl.AccessMgrImplTest.testCreateSessionWithRolesTrusted(AccessMgrImplTest.java:467)


Results :

Failed tests: 
  AccessMgrImplTest.testAddActiveRole:1026->addActiveRoles:1061 org.apache.directory.fortress.core.impl.AccessMgrImplTest.addActiveRoles
failed list size user[jtsUser1] expected:<10> but was:<9>
  AccessMgrImplTest.testCreateSession:345->createSessions:373 org.apache.directory.fortress.core.impl.AccessMgrImplTest.createSessions
user role check failed list size user [jtsUser1] expected:<10> but was:<9>
  AccessMgrImplTest.testCreateSessionTrusted:524->createSessionsTrusted:553 org.apache.directory.fortress.core.impl.AccessMgrImplTest.createSessionsTrusted
user role check failed list size user [jtsUser1] expected:<10> but was:<9>
  AccessMgrImplTest.testCreateSessionWithRole:413->createSessionsWithRoles:440 org.apache.directory.fortress.core.impl.AccessMgrImplTest.createSessionsWithRoles
failed role search USER [jtsUser1] CNT [2] size [1]
  AccessMgrImplTest.testCreateSessionWithRolesTrusted:467->createSessionsWithRolesTrusted:497
org.apache.directory.fortress.core.impl.AccessMgrImplTest.createSessionsWithRolesTrusted failed
role search USER [jtsUser1] CNT [2] size [1]
  AccessMgrImplTest.testDropActiveRole:1161->dropActiveRoles:1185 org.apache.directory.fortress.core.impl.AccessMgrImplTest.dropActiveRoles
failed list size user[jtsUser1] expected:<10> but was:<9>
  AccessMgrImplTest.testSessionRole:970->sessionRoles:998 org.apache.directory.fortress.core.impl.AccessMgrImplTest.sessionRoles
user role check failed list size user [jtsUser1] expected:<10> but was:<9>

Tests run: 124, Failures: 7, Errors: 0, Skipped: 0

[INFO] ------------------------------------------------------------------------
[INFO] BUILD FAILURE
[INFO] ------------------------------------------------------------------------
[INFO] Total time: 05:51 min
[INFO] Finished at: 2017-07-11T16:49:52+00:00
[INFO] Final Memory: 20M/303M
[INFO] ------------------------------------------------------------------------
[ERROR] Failed to execute goal org.apache.maven.plugins:maven-surefire-plugin:2.18.1:test
(default-test) on project fortress-core: There are test failures.
[ERROR] 
[ERROR] Please refer to <https://builds.apache.org/job/dir-fortress-core-docker-apacheds-test/ws/target/surefire-reports>
for the individual test results.
[ERROR] -> [Help 1]
[ERROR] 
[ERROR] To see the full stack trace of the errors, re-run Maven with the -e switch.
[ERROR] Re-run Maven using the -X switch to enable full debug logging.
[ERROR] 
[ERROR] For more information about the errors and possible solutions, please read the following
articles:
[ERROR] [Help 1] http://cwiki.apache.org/confluence/display/MAVEN/MojoFailureException
Build step 'Invoke top-level Maven targets' marked build as failure
[dir-fortress-core-docker-apacheds-test] $ /bin/bash /tmp/hudson7294939912471806928.sh
dir-fortress-core-docker-apacheds-test
dir-fortress-core-docker-apacheds-test
CONTAINER ID        IMAGE                         COMMAND                  CREATED       
     STATUS              PORTS                                                           
                                   NAMES
1fd4d3cfef65        madlib/postgres_9.6:jenkins   "docker-entrypoint.sh"   11 days ago   
     Up 11 days          5432/tcp                                                        
                                   madlib
a56a85282ccb        nerdammer/hbase               "/bin/sh -c /opt/hbas"   2 weeks ago   
     Up 2 weeks          60020/tcp, 60030/tcp, 0.0.0.0:32874->2181/tcp, 0.0.0.0:32873->60000/tcp,
0.0.0.0:32872->60010/tcp   tender_hypatia
efc991457940        elasticsearch:2.3.5           "/docker-entrypoint.s"   2 weeks ago   
     Up 2 weeks          0.0.0.0:32871->9200/tcp, 0.0.0.0:32870->9300/tcp          
                                         reverent_einstein
8ee3b8b947a2        cassandra:3.9                 "/docker-entrypoint.s"   2 weeks ago   
     Up 2 weeks          7000-7001/tcp, 7199/tcp, 9160/tcp, 0.0.0.0:32869->9042/tcp   
                                      admiring_davinci

Mime
View raw message