directory-notifications mailing list archives

Site index · List index
Message view « Date » · « Thread »
Top « Date » · « Thread »
From Apache Jenkins Server <jenk...@builds.apache.org>
Subject Build failed in Jenkins: dir-fortress-core-docker-apacheds-test #28
Date Fri, 07 Jul 2017 12:30:50 GMT
See <https://builds.apache.org/job/dir-fortress-core-docker-apacheds-test/28/display/redirect?page=changes>

Changes:

[clp207] FC-119 remove role constraint when deassigning role

------------------------------------------
[...truncated 231.66 KB...]
2017-07-07 12:28:027 INFO  UserDAO:1662 - deleteResetFlag user [jtsTU5User6] no such attribute:pwdReset
2017-07-07 12:28:027 INFO  UserDAO:1662 - deleteResetFlag user [jtsTU5User6] no such attribute:pwdReset
2017-07-07 12:28:027 INFO  UserDAO:1662 - deleteResetFlag user [jtsTU5User6] no such attribute:pwdReset
2017-07-07 12:28:027 INFO  UserDAO:1662 - deleteResetFlag user [jtsTU5User6] no such attribute:pwdReset
2017-07-07 12:28:027 INFO  UserDAO:1662 - deleteResetFlag user [jtsTU5User6] no such attribute:pwdReset
2017-07-07 12:28:027 INFO  UserDAO:1662 - deleteResetFlag user [jtsTU5User6] no such attribute:pwdReset
2017-07-07 12:28:027 INFO  UserDAO:1662 - deleteResetFlag user [jtsTU5User6] no such attribute:pwdReset
2017-07-07 12:28:027 INFO  UserDAO:1662 - deleteResetFlag user [jtsTU5User6] no such attribute:pwdReset
2017-07-07 12:28:027 INFO  UserDAO:1662 - deleteResetFlag user [jtsTU5User6] no such attribute:pwdReset
2017-07-07 12:28:027 INFO  UserDAO:1662 - deleteResetFlag user [jtsTU5User6] no such attribute:pwdReset
2017-07-07 12:28:027 INFO  UserDAO:1662 - deleteResetFlag user [jtsTU5User6] no such attribute:pwdReset
2017-07-07 12:28:027 INFO  UserDAO:1662 - deleteResetFlag user [jtsTU5User6] no such attribute:pwdReset
2017-07-07 12:28:027 INFO  UserDAO:1662 - deleteResetFlag user [jtsTU5User6] no such attribute:pwdReset
2017-07-07 12:28:027 INFO  UserDAO:1662 - deleteResetFlag user [jtsTU5User6] no such attribute:pwdReset
2017-07-07 12:28:027 INFO  UserDAO:1662 - deleteResetFlag user [jtsTU5User6] no such attribute:pwdReset
2017-07-07 12:28:028 INFO  UserDAO:1662 - deleteResetFlag user [jtsTU5User6] no such attribute:pwdReset
2017-07-07 12:28:028 INFO  UserDAO:1662 - deleteResetFlag user [jtsTU5User6] no such attribute:pwdReset
2017-07-07 12:28:028 INFO  UserDAO:1662 - deleteResetFlag user [jtsTU5User6] no such attribute:pwdReset
2017-07-07 12:28:028 INFO  UserDAO:1662 - deleteResetFlag user [jtsTU5User6] no such attribute:pwdReset
2017-07-07 12:28:028 INFO  UserDAO:1662 - deleteResetFlag user [jtsTU5User6] no such attribute:pwdReset
2017-07-07 12:28:028 INFO  UserDAO:1662 - deleteResetFlag user [jtsTU5User6] no such attribute:pwdReset
2017-07-07 12:28:028 INFO  UserDAO:1662 - deleteResetFlag user [jtsTU5User6] no such attribute:pwdReset
2017-07-07 12:28:028 INFO  UserDAO:1662 - deleteResetFlag user [jtsTU5User6] no such attribute:pwdReset
2017-07-07 12:28:028 INFO  UserDAO:1662 - deleteResetFlag user [jtsTU5User6] no such attribute:pwdReset
2017-07-07 12:28:028 INFO  UserDAO:1662 - deleteResetFlag user [jtsTU5User6] no such attribute:pwdReset
2017-07-07 12:28:028 INFO  UserDAO:1662 - deleteResetFlag user [jtsTU5User6] no such attribute:pwdReset
2017-07-07 12:28:028 INFO  UserDAO:1662 - deleteResetFlag user [jtsTU5User6] no such attribute:pwdReset
2017-07-07 12:28:028 INFO  UserDAO:1662 - deleteResetFlag user [jtsTU5User6] no such attribute:pwdReset
2017-07-07 12:28:028 INFO  UserDAO:1662 - deleteResetFlag user [jtsTU5User6] no such attribute:pwdReset
2017-07-07 12:28:028 INFO  UserDAO:1662 - deleteResetFlag user [jtsTU5User6] no such attribute:pwdReset
2017-07-07 12:28:028 INFO  UserDAO:1662 - deleteResetFlag user [jtsTU5User6] no such attribute:pwdReset
2017-07-07 12:28:028 INFO  UserDAO:1662 - deleteResetFlag user [jtsTU5User6] no such attribute:pwdReset
2017-07-07 12:28:028 INFO  LogUtil:64 - PWLEN7 PLCY TP1 USR TU5
2017-07-07 12:28:028 INFO  LogUtil:64 - PWLEN8 PLCY TP1 USR TU5
2017-07-07 12:28:028 INFO  LogUtil:64 - PWEXP7 PLCY TP1 USR TU5
2017-07-07 12:28:028 INFO  UserDAO:1662 - deleteResetFlag user [jtsTU5User9] no such attribute:pwdReset
2017-07-07 12:28:028 INFO  LogUtil:64 - org.apache.directory.fortress.core.impl.TestUtils.sleep
for len=2000
2017-07-07 12:28:030 INFO  LogUtil:64 - org.apache.directory.fortress.core.impl.TestUtils.sleep
for len=1000
2017-07-07 12:28:031 INFO  LogUtil:64 - org.apache.directory.fortress.core.impl.TestUtils.sleep
for len=2000
2017-07-07 12:28:033 INFO  LogUtil:64 - PWEXP8 PLCY TP1 USR TU5
2017-07-07 12:28:034 INFO  UserDAO:1662 - deleteResetFlag user [jtsTU5User10] no such attribute:pwdReset
2017-07-07 12:28:034 INFO  LogUtil:64 - org.apache.directory.fortress.core.impl.TestUtils.sleep
for len=4000
2017-07-07 12:28:038 INFO  LogUtil:64 - org.apache.directory.fortress.core.impl.TestUtils.sleep
for len=1000
2017-07-07 12:28:039 INFO  LogUtil:64 - org.apache.directory.fortress.core.impl.TestUtils.sleep
for len=4000
2017-07-07 12:28:043 INFO  LogUtil:64 - PWGRACE9 PLCY TP1 USR TU5
2017-07-07 12:28:043 INFO  UserDAO:1662 - deleteResetFlag user [jtsTU5User11] no such attribute:pwdReset
2017-07-07 12:28:043 INFO  LogUtil:64 - org.apache.directory.fortress.core.impl.TestUtils.sleep
for len=6000
2017-07-07 12:28:049 INFO  LogUtil:64 - org.apache.directory.fortress.core.impl.TestUtils.sleep
for len=1000
2017-07-07 12:28:050 INFO  LogUtil:64 - org.apache.directory.fortress.core.impl.TestUtils.sleep
for len=1000
2017-07-07 12:28:051 INFO  LogUtil:64 - org.apache.directory.fortress.core.impl.TestUtils.sleep
for len=1000
2017-07-07 12:28:052 INFO  LogUtil:64 - org.apache.directory.fortress.core.impl.TestUtils.sleep
for len=1000
2017-07-07 12:28:053 INFO  LogUtil:64 - org.apache.directory.fortress.core.impl.TestUtils.sleep
for len=1000
2017-07-07 12:28:054 INFO  LogUtil:64 - org.apache.directory.fortress.core.impl.TestUtils.sleep
for len=1000
2017-07-07 12:28:055 INFO  LogUtil:64 - org.apache.directory.fortress.core.impl.TestUtils.sleep
for len=1000
2017-07-07 12:28:056 INFO  LogUtil:64 - org.apache.directory.fortress.core.impl.TestUtils.sleep
for len=1000
2017-07-07 12:28:057 INFO  LogUtil:64 - org.apache.directory.fortress.core.impl.TestUtils.sleep
for len=1000
2017-07-07 12:28:058 INFO  LogUtil:64 - org.apache.directory.fortress.core.impl.TestUtils.sleep
for len=1000
2017-07-07 12:28:059 INFO  LogUtil:64 - org.apache.directory.fortress.core.impl.TestUtils.sleep
for len=1000
2017-07-07 12:29:000 INFO  LogUtil:64 - PWGRACE10 PLCY TP1 USR TU5
2017-07-07 12:29:000 INFO  UserDAO:1662 - deleteResetFlag user [jtsTU5User12] no such attribute:pwdReset
2017-07-07 12:29:000 INFO  LogUtil:64 - org.apache.directory.fortress.core.impl.TestUtils.sleep
for len=5000
2017-07-07 12:29:005 INFO  LogUtil:64 - org.apache.directory.fortress.core.impl.TestUtils.sleep
for len=1000
2017-07-07 12:29:006 INFO  LogUtil:64 - org.apache.directory.fortress.core.impl.TestUtils.sleep
for len=1000
2017-07-07 12:29:007 INFO  LogUtil:64 - org.apache.directory.fortress.core.impl.TestUtils.sleep
for len=1000
2017-07-07 12:29:008 INFO  LogUtil:64 - org.apache.directory.fortress.core.impl.TestUtils.sleep
for len=1000
2017-07-07 12:29:009 INFO  LogUtil:64 - org.apache.directory.fortress.core.impl.TestUtils.sleep
for len=1000
2017-07-07 12:29:010 INFO  LogUtil:64 - org.apache.directory.fortress.core.impl.TestUtils.sleep
for len=1000
2017-07-07 12:29:011 INFO  LogUtil:64 - PWMAXFAILK11 PLCY TP1 USR TU5
2017-07-07 12:29:011 INFO  LogUtil:64 - org.apache.directory.fortress.core.impl.TestUtils.sleep
for len=1000
2017-07-07 12:29:012 INFO  LogUtil:64 - org.apache.directory.fortress.core.impl.TestUtils.sleep
for len=1000
2017-07-07 12:29:013 INFO  LogUtil:64 - org.apache.directory.fortress.core.impl.TestUtils.sleep
for len=1000
2017-07-07 12:29:014 INFO  LogUtil:64 - org.apache.directory.fortress.core.impl.TestUtils.sleep
for len=1000
2017-07-07 12:29:015 INFO  LogUtil:64 - org.apache.directory.fortress.core.impl.TestUtils.sleep
for len=1000
2017-07-07 12:29:016 INFO  LogUtil:64 - org.apache.directory.fortress.core.impl.TestUtils.sleep
for len=1000
2017-07-07 12:29:017 INFO  LogUtil:64 - org.apache.directory.fortress.core.impl.TestUtils.sleep
for len=1000
2017-07-07 12:29:018 INFO  LogUtil:64 - org.apache.directory.fortress.core.impl.TestUtils.sleep
for len=1000
2017-07-07 12:29:019 INFO  LogUtil:64 - org.apache.directory.fortress.core.impl.TestUtils.sleep
for len=1000
2017-07-07 12:29:020 INFO  LogUtil:64 - org.apache.directory.fortress.core.impl.TestUtils.sleep
for len=1000
2017-07-07 12:29:021 INFO  LogUtil:64 - PWMAXFAIL12 PLCY TP1 USR TU5
2017-07-07 12:29:021 INFO  LogUtil:64 - org.apache.directory.fortress.core.impl.TestUtils.sleep
for len=1000
2017-07-07 12:29:023 INFO  LogUtil:64 - org.apache.directory.fortress.core.impl.TestUtils.sleep
for len=1000
2017-07-07 12:29:024 INFO  LogUtil:64 - org.apache.directory.fortress.core.impl.TestUtils.sleep
for len=1000
2017-07-07 12:29:025 INFO  LogUtil:64 - org.apache.directory.fortress.core.impl.TestUtils.sleep
for len=1000
2017-07-07 12:29:026 INFO  LogUtil:64 - org.apache.directory.fortress.core.impl.TestUtils.sleep
for len=1000
2017-07-07 12:29:027 INFO  LogUtil:64 - PWDURATION13 PLCY TP1 USR TU5
2017-07-07 12:29:027 INFO  LogUtil:64 - org.apache.directory.fortress.core.impl.TestUtils.sleep
for len=1000
2017-07-07 12:29:028 INFO  LogUtil:64 - org.apache.directory.fortress.core.impl.TestUtils.sleep
for len=1000
2017-07-07 12:29:029 INFO  LogUtil:64 - org.apache.directory.fortress.core.impl.TestUtils.sleep
for len=1000
2017-07-07 12:29:030 INFO  LogUtil:64 - org.apache.directory.fortress.core.impl.TestUtils.sleep
for len=4000
2017-07-07 12:29:034 INFO  LogUtil:64 - org.apache.directory.fortress.core.impl.TestUtils.sleep
for len=1000
2017-07-07 12:29:035 INFO  LogUtil:64 - PWDURATION14 PLCY TP1 USR TU5
2017-07-07 12:29:035 INFO  LogUtil:64 - org.apache.directory.fortress.core.impl.TestUtils.sleep
for len=1000
2017-07-07 12:29:036 INFO  LogUtil:64 - org.apache.directory.fortress.core.impl.TestUtils.sleep
for len=1000
2017-07-07 12:29:037 INFO  LogUtil:64 - org.apache.directory.fortress.core.impl.TestUtils.sleep
for len=1000
2017-07-07 12:29:038 INFO  LogUtil:64 - org.apache.directory.fortress.core.impl.TestUtils.sleep
for len=1000
2017-07-07 12:29:039 INFO  LogUtil:64 - org.apache.directory.fortress.core.impl.TestUtils.sleep
for len=1000
2017-07-07 12:29:040 INFO  LogUtil:64 - org.apache.directory.fortress.core.impl.TestUtils.sleep
for len=5000
2017-07-07 12:29:045 INFO  LogUtil:64 - org.apache.directory.fortress.core.impl.TestUtils.sleep
for len=1000
2017-07-07 12:29:046 INFO  LogUtil:64 - PWLOCK15 PLCY TP1 USR TU5
2017-07-07 12:29:046 INFO  LogUtil:64 - org.apache.directory.fortress.core.impl.TestUtils.sleep
for len=1000
2017-07-07 12:29:047 INFO  LogUtil:64 - org.apache.directory.fortress.core.impl.TestUtils.sleep
for len=1000
2017-07-07 12:29:048 INFO  LogUtil:64 - org.apache.directory.fortress.core.impl.TestUtils.sleep
for len=1000
2017-07-07 12:29:049 INFO  LogUtil:64 - PWLOCK16 PLCY TP1 USR TU5
2017-07-07 12:29:049 INFO  LogUtil:64 - org.apache.directory.fortress.core.impl.TestUtils.sleep
for len=1000
2017-07-07 12:29:050 INFO  LogUtil:64 - org.apache.directory.fortress.core.impl.TestUtils.sleep
for len=1000
2017-07-07 12:29:051 INFO  LogUtil:64 - org.apache.directory.fortress.core.impl.TestUtils.sleep
for len=1000
2017-07-07 12:29:052 INFO  LogUtil:64 - PWINTERVAL17 PLCY TP1 USR TU5
2017-07-07 12:29:052 INFO  LogUtil:64 - org.apache.directory.fortress.core.impl.TestUtils.sleep
for len=1000
2017-07-07 12:29:053 INFO  LogUtil:64 - org.apache.directory.fortress.core.impl.TestUtils.sleep
for len=1000
2017-07-07 12:29:054 INFO  LogUtil:64 - org.apache.directory.fortress.core.impl.TestUtils.sleep
for len=1000
2017-07-07 12:29:055 INFO  LogUtil:64 - org.apache.directory.fortress.core.impl.TestUtils.sleep
for len=1000
2017-07-07 12:29:056 INFO  LogUtil:64 - org.apache.directory.fortress.core.impl.TestUtils.sleep
for len=1000
2017-07-07 12:29:057 INFO  LogUtil:64 - org.apache.directory.fortress.core.impl.TestUtils.sleep
for len=5000
2017-07-07 12:30:002 INFO  LogUtil:64 - org.apache.directory.fortress.core.impl.TestUtils.sleep
for len=1000
2017-07-07 12:30:003 INFO  LogUtil:64 - org.apache.directory.fortress.core.impl.TestUtils.sleep
for len=1000
2017-07-07 12:30:005 INFO  LogUtil:64 - org.apache.directory.fortress.core.impl.TestUtils.sleep
for len=1000
2017-07-07 12:30:006 INFO  LogUtil:64 - org.apache.directory.fortress.core.impl.TestUtils.sleep
for len=1000
2017-07-07 12:30:007 INFO  LogUtil:64 - org.apache.directory.fortress.core.impl.TestUtils.sleep
for len=1000
2017-07-07 12:30:008 INFO  LogUtil:64 - org.apache.directory.fortress.core.impl.TestUtils.sleep
for len=1000
2017-07-07 12:30:009 INFO  LogUtil:64 - org.apache.directory.fortress.core.impl.TestUtils.sleep
for len=5000
2017-07-07 12:30:014 INFO  LogUtil:64 - org.apache.directory.fortress.core.impl.TestUtils.sleep
for len=1000
2017-07-07 12:30:015 INFO  LogUtil:64 - PWINTERVAL18 PLCY TP1 USR TU5
2017-07-07 12:30:015 INFO  LogUtil:64 - org.apache.directory.fortress.core.impl.TestUtils.sleep
for len=1000
2017-07-07 12:30:016 INFO  LogUtil:64 - org.apache.directory.fortress.core.impl.TestUtils.sleep
for len=1000
2017-07-07 12:30:017 INFO  LogUtil:64 - org.apache.directory.fortress.core.impl.TestUtils.sleep
for len=7000
2017-07-07 12:30:024 INFO  LogUtil:64 - org.apache.directory.fortress.core.impl.TestUtils.sleep
for len=1000
2017-07-07 12:30:025 INFO  LogUtil:64 - org.apache.directory.fortress.core.impl.TestUtils.sleep
for len=1000
2017-07-07 12:30:026 INFO  LogUtil:64 - org.apache.directory.fortress.core.impl.TestUtils.sleep
for len=1000
2017-07-07 12:30:027 INFO  LogUtil:64 - org.apache.directory.fortress.core.impl.TestUtils.sleep
for len=7000
2017-07-07 12:30:034 INFO  LogUtil:64 - org.apache.directory.fortress.core.impl.TestUtils.sleep
for len=1000
2017-07-07 12:30:035 INFO  LogUtil:64 - PWMUST19 PLCY TP1 USR TU5
2017-07-07 12:30:035 INFO  LogUtil:64 - org.apache.directory.fortress.core.impl.TestUtils.sleep
for len=1000
2017-07-07 12:30:036 INFO  LogUtil:64 - PWMUST20 PLCY TP1 USR TU5
2017-07-07 12:30:036 INFO  LogUtil:64 - org.apache.directory.fortress.core.impl.TestUtils.sleep
for len=1000
2017-07-07 12:30:037 INFO  LogUtil:64 - PWALLOW21 PLCY TP1 USR TU5
2017-07-07 12:30:037 INFO  LogUtil:64 - org.apache.directory.fortress.core.impl.TestUtils.sleep
for len=1000
2017-07-07 12:30:038 INFO  LogUtil:64 - PWALLOW22 PLCY TP1 USR TU5
2017-07-07 12:30:038 INFO  UserDAO:1662 - deleteResetFlag user [jtsTU5User24] no such attribute:pwdReset
2017-07-07 12:30:038 INFO  LogUtil:64 - PWSAFEW23 PLCY TP1 USR TU5
2017-07-07 12:30:038 INFO  LogUtil:64 - org.apache.directory.fortress.core.impl.TestUtils.sleep
for len=1000
2017-07-07 12:30:039 INFO  LogUtil:64 - PWSAFE24 PLCY TP1 USR TU5
2017-07-07 12:30:039 INFO  UserDAO:1662 - deleteResetFlag user [jtsTU5User26] no such attribute:pwdReset
Tests run: 123, Failures: 7, Errors: 0, Skipped: 0, Time elapsed: 337.846 sec <<<
FAILURE! - in org.apache.directory.fortress.core.impl.FortressJUnitTest
testCreateSession(org.apache.directory.fortress.core.impl.AccessMgrImplTest)  Time elapsed:
0.062 sec  <<< FAILURE!
junit.framework.AssertionFailedError: org.apache.directory.fortress.core.impl.AccessMgrImplTest.createSessions
user role check failed list size user [jtsUser1] expected:<10> but was:<9>
	at junit.framework.Assert.fail(Assert.java:57)
	at junit.framework.Assert.failNotEquals(Assert.java:329)
	at junit.framework.Assert.assertEquals(Assert.java:78)
	at junit.framework.Assert.assertEquals(Assert.java:234)
	at junit.framework.TestCase.assertEquals(TestCase.java:401)
	at org.apache.directory.fortress.core.impl.AccessMgrImplTest.createSessions(AccessMgrImplTest.java:373)
	at org.apache.directory.fortress.core.impl.AccessMgrImplTest.testCreateSession(AccessMgrImplTest.java:345)

testCreateSessionTrusted(org.apache.directory.fortress.core.impl.AccessMgrImplTest)  Time
elapsed: 0.025 sec  <<< FAILURE!
junit.framework.AssertionFailedError: org.apache.directory.fortress.core.impl.AccessMgrImplTest.createSessionsTrusted
user role check failed list size user [jtsUser1] expected:<10> but was:<9>
	at junit.framework.Assert.fail(Assert.java:57)
	at junit.framework.Assert.failNotEquals(Assert.java:329)
	at junit.framework.Assert.assertEquals(Assert.java:78)
	at junit.framework.Assert.assertEquals(Assert.java:234)
	at junit.framework.TestCase.assertEquals(TestCase.java:401)
	at org.apache.directory.fortress.core.impl.AccessMgrImplTest.createSessionsTrusted(AccessMgrImplTest.java:553)
	at org.apache.directory.fortress.core.impl.AccessMgrImplTest.testCreateSessionTrusted(AccessMgrImplTest.java:524)

testSessionRole(org.apache.directory.fortress.core.impl.AccessMgrImplTest)  Time elapsed:
0.033 sec  <<< FAILURE!
junit.framework.AssertionFailedError: org.apache.directory.fortress.core.impl.AccessMgrImplTest.sessionRoles
user role check failed list size user [jtsUser1] expected:<10> but was:<9>
	at junit.framework.Assert.fail(Assert.java:57)
	at junit.framework.Assert.failNotEquals(Assert.java:329)
	at junit.framework.Assert.assertEquals(Assert.java:78)
	at junit.framework.Assert.assertEquals(Assert.java:234)
	at junit.framework.TestCase.assertEquals(TestCase.java:401)
	at org.apache.directory.fortress.core.impl.AccessMgrImplTest.sessionRoles(AccessMgrImplTest.java:998)
	at org.apache.directory.fortress.core.impl.AccessMgrImplTest.testSessionRole(AccessMgrImplTest.java:970)

testAddActiveRole(org.apache.directory.fortress.core.impl.AccessMgrImplTest)  Time elapsed:
0.018 sec  <<< FAILURE!
junit.framework.AssertionFailedError: org.apache.directory.fortress.core.impl.AccessMgrImplTest.addActiveRoles
failed list size user[jtsUser1] expected:<10> but was:<9>
	at junit.framework.Assert.fail(Assert.java:57)
	at junit.framework.Assert.failNotEquals(Assert.java:329)
	at junit.framework.Assert.assertEquals(Assert.java:78)
	at junit.framework.Assert.assertEquals(Assert.java:234)
	at junit.framework.TestCase.assertEquals(TestCase.java:401)
	at org.apache.directory.fortress.core.impl.AccessMgrImplTest.addActiveRoles(AccessMgrImplTest.java:1061)
	at org.apache.directory.fortress.core.impl.AccessMgrImplTest.testAddActiveRole(AccessMgrImplTest.java:1026)

testDropActiveRole(org.apache.directory.fortress.core.impl.AccessMgrImplTest)  Time elapsed:
0.017 sec  <<< FAILURE!
junit.framework.AssertionFailedError: org.apache.directory.fortress.core.impl.AccessMgrImplTest.dropActiveRoles
failed list size user[jtsUser1] expected:<10> but was:<9>
	at junit.framework.Assert.fail(Assert.java:57)
	at junit.framework.Assert.failNotEquals(Assert.java:329)
	at junit.framework.Assert.assertEquals(Assert.java:78)
	at junit.framework.Assert.assertEquals(Assert.java:234)
	at junit.framework.TestCase.assertEquals(TestCase.java:401)
	at org.apache.directory.fortress.core.impl.AccessMgrImplTest.dropActiveRoles(AccessMgrImplTest.java:1185)
	at org.apache.directory.fortress.core.impl.AccessMgrImplTest.testDropActiveRole(AccessMgrImplTest.java:1161)

testCreateSessionWithRole(org.apache.directory.fortress.core.impl.AccessMgrImplTest)  Time
elapsed: 0.008 sec  <<< FAILURE!
junit.framework.AssertionFailedError: org.apache.directory.fortress.core.impl.AccessMgrImplTest.createSessionsWithRoles
failed role search USER [jtsUser1] CNT [2] size [1]
	at junit.framework.Assert.fail(Assert.java:57)
	at junit.framework.Assert.assertTrue(Assert.java:22)
	at junit.framework.TestCase.assertTrue(TestCase.java:192)
	at org.apache.directory.fortress.core.impl.AccessMgrImplTest.createSessionsWithRoles(AccessMgrImplTest.java:440)
	at org.apache.directory.fortress.core.impl.AccessMgrImplTest.testCreateSessionWithRole(AccessMgrImplTest.java:413)

testCreateSessionWithRolesTrusted(org.apache.directory.fortress.core.impl.AccessMgrImplTest)
 Time elapsed: 0.004 sec  <<< FAILURE!
junit.framework.AssertionFailedError: org.apache.directory.fortress.core.impl.AccessMgrImplTest.createSessionsWithRolesTrusted
failed role search USER [jtsUser1] CNT [2] size [1]
	at junit.framework.Assert.fail(Assert.java:57)
	at junit.framework.Assert.assertTrue(Assert.java:22)
	at junit.framework.TestCase.assertTrue(TestCase.java:192)
	at org.apache.directory.fortress.core.impl.AccessMgrImplTest.createSessionsWithRolesTrusted(AccessMgrImplTest.java:497)
	at org.apache.directory.fortress.core.impl.AccessMgrImplTest.testCreateSessionWithRolesTrusted(AccessMgrImplTest.java:467)


Results :

Failed tests: 
  AccessMgrImplTest.testAddActiveRole:1026->addActiveRoles:1061 org.apache.directory.fortress.core.impl.AccessMgrImplTest.addActiveRoles
failed list size user[jtsUser1] expected:<10> but was:<9>
  AccessMgrImplTest.testCreateSession:345->createSessions:373 org.apache.directory.fortress.core.impl.AccessMgrImplTest.createSessions
user role check failed list size user [jtsUser1] expected:<10> but was:<9>
  AccessMgrImplTest.testCreateSessionTrusted:524->createSessionsTrusted:553 org.apache.directory.fortress.core.impl.AccessMgrImplTest.createSessionsTrusted
user role check failed list size user [jtsUser1] expected:<10> but was:<9>
  AccessMgrImplTest.testCreateSessionWithRole:413->createSessionsWithRoles:440 org.apache.directory.fortress.core.impl.AccessMgrImplTest.createSessionsWithRoles
failed role search USER [jtsUser1] CNT [2] size [1]
  AccessMgrImplTest.testCreateSessionWithRolesTrusted:467->createSessionsWithRolesTrusted:497
org.apache.directory.fortress.core.impl.AccessMgrImplTest.createSessionsWithRolesTrusted failed
role search USER [jtsUser1] CNT [2] size [1]
  AccessMgrImplTest.testDropActiveRole:1161->dropActiveRoles:1185 org.apache.directory.fortress.core.impl.AccessMgrImplTest.dropActiveRoles
failed list size user[jtsUser1] expected:<10> but was:<9>
  AccessMgrImplTest.testSessionRole:970->sessionRoles:998 org.apache.directory.fortress.core.impl.AccessMgrImplTest.sessionRoles
user role check failed list size user [jtsUser1] expected:<10> but was:<9>

Tests run: 123, Failures: 7, Errors: 0, Skipped: 0

[INFO] ------------------------------------------------------------------------
[INFO] BUILD FAILURE
[INFO] ------------------------------------------------------------------------
[INFO] Total time: 05:44 min
[INFO] Finished at: 2017-07-07T12:30:39+00:00
[INFO] Final Memory: 20M/300M
[INFO] ------------------------------------------------------------------------
[ERROR] Failed to execute goal org.apache.maven.plugins:maven-surefire-plugin:2.18.1:test
(default-test) on project fortress-core: There are test failures.
[ERROR] 
[ERROR] Please refer to <https://builds.apache.org/job/dir-fortress-core-docker-apacheds-test/ws/target/surefire-reports>
for the individual test results.
[ERROR] -> [Help 1]
[ERROR] 
[ERROR] To see the full stack trace of the errors, re-run Maven with the -e switch.
[ERROR] Re-run Maven using the -X switch to enable full debug logging.
[ERROR] 
[ERROR] For more information about the errors and possible solutions, please read the following
articles:
[ERROR] [Help 1] http://cwiki.apache.org/confluence/display/MAVEN/MojoFailureException
Build step 'Invoke top-level Maven targets' marked build as failure
[dir-fortress-core-docker-apacheds-test] $ /bin/bash /tmp/hudson7283656047214256292.sh
dir-fortress-core-docker-apacheds-test
dir-fortress-core-docker-apacheds-test
CONTAINER ID        IMAGE                         COMMAND                  CREATED       
     STATUS              PORTS                                                           
                                   NAMES
1fd4d3cfef65        madlib/postgres_9.6:jenkins   "docker-entrypoint.sh"   7 days ago    
     Up 7 days           5432/tcp                                                        
                                   madlib
a56a85282ccb        nerdammer/hbase               "/bin/sh -c /opt/hbas"   2 weeks ago   
     Up 2 weeks          60020/tcp, 60030/tcp, 0.0.0.0:32874->2181/tcp, 0.0.0.0:32873->60000/tcp,
0.0.0.0:32872->60010/tcp   tender_hypatia
efc991457940        elasticsearch:2.3.5           "/docker-entrypoint.s"   2 weeks ago   
     Up 2 weeks          0.0.0.0:32871->9200/tcp, 0.0.0.0:32870->9300/tcp          
                                         reverent_einstein
8ee3b8b947a2        cassandra:3.9                 "/docker-entrypoint.s"   2 weeks ago   
     Up 2 weeks          7000-7001/tcp, 7199/tcp, 9160/tcp, 0.0.0.0:32869->9042/tcp   
                                      admiring_davinci

Mime
View raw message