directory-notifications mailing list archives

Site index · List index
Message view « Date » · « Thread »
Top « Date » · « Thread »
From Apache Jenkins Server <jenk...@builds.apache.org>
Subject Build failed in Jenkins: dir-studio-ui-tests-in-docker #54
Date Wed, 21 Jun 2017 13:57:51 GMT
See <https://builds.apache.org/job/dir-studio-ui-tests-in-docker/54/display/redirect>

------------------------------------------
[...truncated 2.26 MB...]

testExportImportDsmlWithGermanUmlautInDN(org.apache.directory.studio.test.integration.ui.ImportExportTest)
 Time elapsed: 7.945 sec
testExportImportLdifWithGermanUmlautInDN(org.apache.directory.studio.test.integration.ui.ImportExportTest)
 Time elapsed: 5.853 sec
testImportDoesNotUpdateUI(org.apache.directory.studio.test.integration.ui.ImportExportTest)
 Time elapsed: 5.283 sec
Running org.apache.directory.studio.test.integration.ui.RenameEntryDialogTest
Tests run: 4, Failures: 0, Errors: 0, Skipped: 0, Time elapsed: 23.648 sec - in org.apache.directory.studio.test.integration.ui.RenameEntryDialogTest
testRenameMultiValuedRdn(org.apache.directory.studio.test.integration.ui.RenameEntryDialogTest)
 Time elapsed: 5.653 sec
testRenameRdnWithEscapedCharacters(org.apache.directory.studio.test.integration.ui.RenameEntryDialogTest)
 Time elapsed: 5.242 sec
testRenameRdnWithTrailingSpace(org.apache.directory.studio.test.integration.ui.RenameEntryDialogTest)
 Time elapsed: 5.78 sec
testRenameRdnWithSharp(org.apache.directory.studio.test.integration.ui.RenameEntryDialogTest)
 Time elapsed: 5.27 sec
Running org.apache.directory.studio.test.integration.ui.SchemaEditorSearchTest
Tests run: 1, Failures: 0, Errors: 0, Skipped: 0, Time elapsed: 2.001 sec - in org.apache.directory.studio.test.integration.ui.SchemaEditorSearchTest
testSearchForAliases(org.apache.directory.studio.test.integration.ui.SchemaEditorSearchTest)
 Time elapsed: 0.867 sec
Running org.apache.directory.studio.test.integration.ui.GssApiTest
Tests run: 2, Failures: 0, Errors: 0, Skipped: 0, Time elapsed: 30.056 sec - in org.apache.directory.studio.test.integration.ui.GssApiTest
testGssApiObtainTgtAndUseManualConfigurationAndObtainServiceTicket(org.apache.directory.studio.test.integration.ui.GssApiTest)
 Time elapsed: 14.233 sec
testGssApiUseNativeTgtAndNativeConfigurationAndObtainServiceTicket(org.apache.directory.studio.test.integration.ui.GssApiTest)
 Time elapsed: 14.364 sec
Running org.apache.directory.studio.test.integration.ui.SchemaBrowserTest
Tests run: 1, Failures: 0, Errors: 0, Skipped: 0, Time elapsed: 5.234 sec - in org.apache.directory.studio.test.integration.ui.SchemaBrowserTest
testRawSchemaDefinitionIsFilled(org.apache.directory.studio.test.integration.ui.SchemaBrowserTest)
 Time elapsed: 3.681 sec
Running org.apache.directory.studio.test.integration.ui.ApacheDSPluginTest
Tests run: 4, Failures: 0, Errors: 0, Skipped: 0, Time elapsed: 44.36 sec - in org.apache.directory.studio.test.integration.ui.ApacheDSPluginTest
editRemoteConfig(org.apache.directory.studio.test.integration.ui.ApacheDSPluginTest)  Time
elapsed: 15.328 sec
repairAndStartAndStop(org.apache.directory.studio.test.integration.ui.ApacheDSPluginTest)
 Time elapsed: 14.751 sec
verifyServerNameCollisionInNewWizard(org.apache.directory.studio.test.integration.ui.ApacheDSPluginTest)
 Time elapsed: 1.182 sec
serverCreationStartCreateConnectionStopAndDeletion(org.apache.directory.studio.test.integration.ui.ApacheDSPluginTest)
 Time elapsed: 11.879 sec
Running org.apache.directory.studio.test.integration.ui.ValueEditorTest
Tests run: 140, Failures: 0, Errors: 0, Skipped: 0, Time elapsed: 0.078 sec - in org.apache.directory.studio.test.integration.ui.ValueEditorTest
testGetDisplayValue[InPlaceTextValueEditor - empty value](org.apache.directory.studio.test.integration.ui.ValueEditorTest)
 Time elapsed: 0.001 sec
testGetStringOrBinaryValue[InPlaceTextValueEditor - empty value](org.apache.directory.studio.test.integration.ui.ValueEditorTest)
 Time elapsed: 0 sec
testHasValue[InPlaceTextValueEditor - empty value](org.apache.directory.studio.test.integration.ui.ValueEditorTest)
 Time elapsed: 0 sec
testGetRawValue[InPlaceTextValueEditor - empty value](org.apache.directory.studio.test.integration.ui.ValueEditorTest)
 Time elapsed: 0 sec
testGetDisplayValue[InPlaceTextValueEditor - empty string](org.apache.directory.studio.test.integration.ui.ValueEditorTest)
 Time elapsed: 0 sec
testGetStringOrBinaryValue[InPlaceTextValueEditor - empty string](org.apache.directory.studio.test.integration.ui.ValueEditorTest)
 Time elapsed: 0 sec
testHasValue[InPlaceTextValueEditor - empty string](org.apache.directory.studio.test.integration.ui.ValueEditorTest)
 Time elapsed: 0 sec
testGetRawValue[InPlaceTextValueEditor - empty string](org.apache.directory.studio.test.integration.ui.ValueEditorTest)
 Time elapsed: 0 sec
testGetDisplayValue[InPlaceTextValueEditor - ascii](org.apache.directory.studio.test.integration.ui.ValueEditorTest)
 Time elapsed: 0 sec
testGetStringOrBinaryValue[InPlaceTextValueEditor - ascii](org.apache.directory.studio.test.integration.ui.ValueEditorTest)
 Time elapsed: 0 sec
testHasValue[InPlaceTextValueEditor - ascii](org.apache.directory.studio.test.integration.ui.ValueEditorTest)
 Time elapsed: 0 sec
testGetRawValue[InPlaceTextValueEditor - ascii](org.apache.directory.studio.test.integration.ui.ValueEditorTest)
 Time elapsed: 0 sec
testGetDisplayValue[InPlaceTextValueEditor - unicode](org.apache.directory.studio.test.integration.ui.ValueEditorTest)
 Time elapsed: 0 sec
testGetStringOrBinaryValue[InPlaceTextValueEditor - unicode](org.apache.directory.studio.test.integration.ui.ValueEditorTest)
 Time elapsed: 0 sec
testHasValue[InPlaceTextValueEditor - unicode](org.apache.directory.studio.test.integration.ui.ValueEditorTest)
 Time elapsed: 0.001 sec
testGetRawValue[InPlaceTextValueEditor - unicode](org.apache.directory.studio.test.integration.ui.ValueEditorTest)
 Time elapsed: 0.001 sec
testGetDisplayValue[InPlaceTextValueEditor - bytearray UTF8](org.apache.directory.studio.test.integration.ui.ValueEditorTest)
 Time elapsed: 0 sec
testGetStringOrBinaryValue[InPlaceTextValueEditor - bytearray UTF8](org.apache.directory.studio.test.integration.ui.ValueEditorTest)
 Time elapsed: 0 sec
testHasValue[InPlaceTextValueEditor - bytearray UTF8](org.apache.directory.studio.test.integration.ui.ValueEditorTest)
 Time elapsed: 0 sec
testGetRawValue[InPlaceTextValueEditor - bytearray UTF8](org.apache.directory.studio.test.integration.ui.ValueEditorTest)
 Time elapsed: 0 sec
testGetDisplayValue[InPlaceTextValueEditor - bytearray ISO-8859-1](org.apache.directory.studio.test.integration.ui.ValueEditorTest)
 Time elapsed: 0.001 sec
testGetStringOrBinaryValue[InPlaceTextValueEditor - bytearray ISO-8859-1](org.apache.directory.studio.test.integration.ui.ValueEditorTest)
 Time elapsed: 0 sec
testHasValue[InPlaceTextValueEditor - bytearray ISO-8859-1](org.apache.directory.studio.test.integration.ui.ValueEditorTest)
 Time elapsed: 0 sec
testGetRawValue[InPlaceTextValueEditor - bytearray ISO-8859-1](org.apache.directory.studio.test.integration.ui.ValueEditorTest)
 Time elapsed: 0 sec
testGetDisplayValue[InPlaceTextValueEditor - bytearray PNG](org.apache.directory.studio.test.integration.ui.ValueEditorTest)
 Time elapsed: 0 sec
testGetStringOrBinaryValue[InPlaceTextValueEditor - bytearray PNG](org.apache.directory.studio.test.integration.ui.ValueEditorTest)
 Time elapsed: 0 sec
testHasValue[InPlaceTextValueEditor - bytearray PNG](org.apache.directory.studio.test.integration.ui.ValueEditorTest)
 Time elapsed: 0 sec
testGetRawValue[InPlaceTextValueEditor - bytearray PNG](org.apache.directory.studio.test.integration.ui.ValueEditorTest)
 Time elapsed: 0 sec
testGetDisplayValue[InPlaceBooleanValueEditor - TRUE](org.apache.directory.studio.test.integration.ui.ValueEditorTest)
 Time elapsed: 0 sec
testGetStringOrBinaryValue[InPlaceBooleanValueEditor - TRUE](org.apache.directory.studio.test.integration.ui.ValueEditorTest)
 Time elapsed: 0 sec
testHasValue[InPlaceBooleanValueEditor - TRUE](org.apache.directory.studio.test.integration.ui.ValueEditorTest)
 Time elapsed: 0 sec
testGetRawValue[InPlaceBooleanValueEditor - TRUE](org.apache.directory.studio.test.integration.ui.ValueEditorTest)
 Time elapsed: 0 sec
testGetDisplayValue[InPlaceBooleanValueEditor - FALSE](org.apache.directory.studio.test.integration.ui.ValueEditorTest)
 Time elapsed: 0 sec
testGetStringOrBinaryValue[InPlaceBooleanValueEditor - FALSE](org.apache.directory.studio.test.integration.ui.ValueEditorTest)
 Time elapsed: 0.001 sec
testHasValue[InPlaceBooleanValueEditor - FALSE](org.apache.directory.studio.test.integration.ui.ValueEditorTest)
 Time elapsed: 0 sec
testGetRawValue[InPlaceBooleanValueEditor - FALSE](org.apache.directory.studio.test.integration.ui.ValueEditorTest)
 Time elapsed: 0 sec
testGetDisplayValue[InPlaceBooleanValueEditor - INVALID](org.apache.directory.studio.test.integration.ui.ValueEditorTest)
 Time elapsed: 0 sec
testGetStringOrBinaryValue[InPlaceBooleanValueEditor - INVALID](org.apache.directory.studio.test.integration.ui.ValueEditorTest)
 Time elapsed: 0 sec
testHasValue[InPlaceBooleanValueEditor - INVALID](org.apache.directory.studio.test.integration.ui.ValueEditorTest)
 Time elapsed: 0 sec
testGetRawValue[InPlaceBooleanValueEditor - INVALID](org.apache.directory.studio.test.integration.ui.ValueEditorTest)
 Time elapsed: 0 sec
testGetDisplayValue[InPlaceBooleanValueEditor - bytearray TRUE](org.apache.directory.studio.test.integration.ui.ValueEditorTest)
 Time elapsed: 0 sec
testGetStringOrBinaryValue[InPlaceBooleanValueEditor - bytearray TRUE](org.apache.directory.studio.test.integration.ui.ValueEditorTest)
 Time elapsed: 0 sec
testHasValue[InPlaceBooleanValueEditor - bytearray TRUE](org.apache.directory.studio.test.integration.ui.ValueEditorTest)
 Time elapsed: 0 sec
testGetRawValue[InPlaceBooleanValueEditor - bytearray TRUE](org.apache.directory.studio.test.integration.ui.ValueEditorTest)
 Time elapsed: 0 sec
testGetDisplayValue[InPlaceBooleanValueEditor - bytearray FALSE](org.apache.directory.studio.test.integration.ui.ValueEditorTest)
 Time elapsed: 0.001 sec
testGetStringOrBinaryValue[InPlaceBooleanValueEditor - bytearray FALSE](org.apache.directory.studio.test.integration.ui.ValueEditorTest)
 Time elapsed: 0 sec
testHasValue[InPlaceBooleanValueEditor - bytearray FALSE](org.apache.directory.studio.test.integration.ui.ValueEditorTest)
 Time elapsed: 0 sec
testGetRawValue[InPlaceBooleanValueEditor - bytearray FALSE](org.apache.directory.studio.test.integration.ui.ValueEditorTest)
 Time elapsed: 0 sec
testGetDisplayValue[InPlaceBooleanValueEditor - bytearray INVALID](org.apache.directory.studio.test.integration.ui.ValueEditorTest)
 Time elapsed: 0 sec
testGetStringOrBinaryValue[InPlaceBooleanValueEditor - bytearray INVALID](org.apache.directory.studio.test.integration.ui.ValueEditorTest)
 Time elapsed: 0 sec
testHasValue[InPlaceBooleanValueEditor - bytearray INVALID](org.apache.directory.studio.test.integration.ui.ValueEditorTest)
 Time elapsed: 0 sec
testGetRawValue[InPlaceBooleanValueEditor - bytearray INVALID](org.apache.directory.studio.test.integration.ui.ValueEditorTest)
 Time elapsed: 0 sec
testGetDisplayValue[InPlaceOidValueEditor - numeric OID](org.apache.directory.studio.test.integration.ui.ValueEditorTest)
 Time elapsed: 0 sec
testGetStringOrBinaryValue[InPlaceOidValueEditor - numeric OID](org.apache.directory.studio.test.integration.ui.ValueEditorTest)
 Time elapsed: 0 sec
testHasValue[InPlaceOidValueEditor - numeric OID](org.apache.directory.studio.test.integration.ui.ValueEditorTest)
 Time elapsed: 0 sec
testGetRawValue[InPlaceOidValueEditor - numeric OID](org.apache.directory.studio.test.integration.ui.ValueEditorTest)
 Time elapsed: 0 sec
testGetDisplayValue[InPlaceOidValueEditor - descr OID](org.apache.directory.studio.test.integration.ui.ValueEditorTest)
 Time elapsed: 0.001 sec
testGetStringOrBinaryValue[InPlaceOidValueEditor - descr OID](org.apache.directory.studio.test.integration.ui.ValueEditorTest)
 Time elapsed: 0 sec
testHasValue[InPlaceOidValueEditor - descr OID](org.apache.directory.studio.test.integration.ui.ValueEditorTest)
 Time elapsed: 0 sec
testGetRawValue[InPlaceOidValueEditor - descr OID](org.apache.directory.studio.test.integration.ui.ValueEditorTest)
 Time elapsed: 0 sec
testGetDisplayValue[InPlaceOidValueEditor - INVALID](org.apache.directory.studio.test.integration.ui.ValueEditorTest)
 Time elapsed: 0.001 sec
testGetStringOrBinaryValue[InPlaceOidValueEditor - INVALID](org.apache.directory.studio.test.integration.ui.ValueEditorTest)
 Time elapsed: 0 sec
testHasValue[InPlaceOidValueEditor - INVALID](org.apache.directory.studio.test.integration.ui.ValueEditorTest)
 Time elapsed: 0 sec
testGetRawValue[InPlaceOidValueEditor - INVALID](org.apache.directory.studio.test.integration.ui.ValueEditorTest)
 Time elapsed: 0 sec
testGetDisplayValue[InPlaceOidValueEditor - bytearray numeric OID](org.apache.directory.studio.test.integration.ui.ValueEditorTest)
 Time elapsed: 0 sec
testGetStringOrBinaryValue[InPlaceOidValueEditor - bytearray numeric OID](org.apache.directory.studio.test.integration.ui.ValueEditorTest)
 Time elapsed: 0 sec
testHasValue[InPlaceOidValueEditor - bytearray numeric OID](org.apache.directory.studio.test.integration.ui.ValueEditorTest)
 Time elapsed: 0.001 sec
testGetRawValue[InPlaceOidValueEditor - bytearray numeric OID](org.apache.directory.studio.test.integration.ui.ValueEditorTest)
 Time elapsed: 0 sec
testGetDisplayValue[InPlaceOidValueEditor - bytearray INVALID](org.apache.directory.studio.test.integration.ui.ValueEditorTest)
 Time elapsed: 0 sec
testGetStringOrBinaryValue[InPlaceOidValueEditor - bytearray INVALID](org.apache.directory.studio.test.integration.ui.ValueEditorTest)
 Time elapsed: 0 sec
testHasValue[InPlaceOidValueEditor - bytearray INVALID](org.apache.directory.studio.test.integration.ui.ValueEditorTest)
 Time elapsed: 0 sec
testGetRawValue[InPlaceOidValueEditor - bytearray INVALID](org.apache.directory.studio.test.integration.ui.ValueEditorTest)
 Time elapsed: 0 sec
testGetDisplayValue[TextValueEditor - empty string value](org.apache.directory.studio.test.integration.ui.ValueEditorTest)
 Time elapsed: 0 sec
testGetStringOrBinaryValue[TextValueEditor - empty string value](org.apache.directory.studio.test.integration.ui.ValueEditorTest)
 Time elapsed: 0 sec
testHasValue[TextValueEditor - empty string value](org.apache.directory.studio.test.integration.ui.ValueEditorTest)
 Time elapsed: 0 sec
testGetRawValue[TextValueEditor - empty string value](org.apache.directory.studio.test.integration.ui.ValueEditorTest)
 Time elapsed: 0 sec
testGetDisplayValue[TextValueEditor - empty string](org.apache.directory.studio.test.integration.ui.ValueEditorTest)
 Time elapsed: 0 sec
testGetStringOrBinaryValue[TextValueEditor - empty string](org.apache.directory.studio.test.integration.ui.ValueEditorTest)
 Time elapsed: 0 sec
testHasValue[TextValueEditor - empty string](org.apache.directory.studio.test.integration.ui.ValueEditorTest)
 Time elapsed: 0 sec
testGetRawValue[TextValueEditor - empty string](org.apache.directory.studio.test.integration.ui.ValueEditorTest)
 Time elapsed: 0 sec
testGetDisplayValue[TextValueEditor - ascii](org.apache.directory.studio.test.integration.ui.ValueEditorTest)
 Time elapsed: 0 sec
testGetStringOrBinaryValue[TextValueEditor - ascii](org.apache.directory.studio.test.integration.ui.ValueEditorTest)
 Time elapsed: 0 sec
testHasValue[TextValueEditor - ascii](org.apache.directory.studio.test.integration.ui.ValueEditorTest)
 Time elapsed: 0 sec
testGetRawValue[TextValueEditor - ascii](org.apache.directory.studio.test.integration.ui.ValueEditorTest)
 Time elapsed: 0 sec
testGetDisplayValue[TextValueEditor - unicode](org.apache.directory.studio.test.integration.ui.ValueEditorTest)
 Time elapsed: 0 sec
testGetStringOrBinaryValue[TextValueEditor - unicode](org.apache.directory.studio.test.integration.ui.ValueEditorTest)
 Time elapsed: 0 sec
testHasValue[TextValueEditor - unicode](org.apache.directory.studio.test.integration.ui.ValueEditorTest)
 Time elapsed: 0 sec
testGetRawValue[TextValueEditor - unicode](org.apache.directory.studio.test.integration.ui.ValueEditorTest)
 Time elapsed: 0 sec
testGetDisplayValue[TextValueEditor - empty binary value](org.apache.directory.studio.test.integration.ui.ValueEditorTest)
 Time elapsed: 0 sec
testGetStringOrBinaryValue[TextValueEditor - empty binary value](org.apache.directory.studio.test.integration.ui.ValueEditorTest)
 Time elapsed: 0 sec
testHasValue[TextValueEditor - empty binary value](org.apache.directory.studio.test.integration.ui.ValueEditorTest)
 Time elapsed: 0 sec
testGetRawValue[TextValueEditor - empty binary value](org.apache.directory.studio.test.integration.ui.ValueEditorTest)
 Time elapsed: 0 sec
testGetDisplayValue[TextValueEditor - empty bytearray](org.apache.directory.studio.test.integration.ui.ValueEditorTest)
 Time elapsed: 0 sec
testGetStringOrBinaryValue[TextValueEditor - empty bytearray](org.apache.directory.studio.test.integration.ui.ValueEditorTest)
 Time elapsed: 0 sec
testHasValue[TextValueEditor - empty bytearray](org.apache.directory.studio.test.integration.ui.ValueEditorTest)
 Time elapsed: 0 sec
testGetRawValue[TextValueEditor - empty bytearray](org.apache.directory.studio.test.integration.ui.ValueEditorTest)
 Time elapsed: 0 sec
testGetDisplayValue[TextValueEditor - bytearray UTF8](org.apache.directory.studio.test.integration.ui.ValueEditorTest)
 Time elapsed: 0 sec
testGetStringOrBinaryValue[TextValueEditor - bytearray UTF8](org.apache.directory.studio.test.integration.ui.ValueEditorTest)
 Time elapsed: 0 sec
testHasValue[TextValueEditor - bytearray UTF8](org.apache.directory.studio.test.integration.ui.ValueEditorTest)
 Time elapsed: 0 sec
testGetRawValue[TextValueEditor - bytearray UTF8](org.apache.directory.studio.test.integration.ui.ValueEditorTest)
 Time elapsed: 0 sec
testGetDisplayValue[TextValueEditor - bytearray ISO-8859-1](org.apache.directory.studio.test.integration.ui.ValueEditorTest)
 Time elapsed: 0 sec
testGetStringOrBinaryValue[TextValueEditor - bytearray ISO-8859-1](org.apache.directory.studio.test.integration.ui.ValueEditorTest)
 Time elapsed: 0 sec
testHasValue[TextValueEditor - bytearray ISO-8859-1](org.apache.directory.studio.test.integration.ui.ValueEditorTest)
 Time elapsed: 0 sec
testGetRawValue[TextValueEditor - bytearray ISO-8859-1](org.apache.directory.studio.test.integration.ui.ValueEditorTest)
 Time elapsed: 0 sec
testGetDisplayValue[TextValueEditor - bytearray PNG](org.apache.directory.studio.test.integration.ui.ValueEditorTest)
 Time elapsed: 0 sec
testGetStringOrBinaryValue[TextValueEditor - bytearray PNG](org.apache.directory.studio.test.integration.ui.ValueEditorTest)
 Time elapsed: 0 sec
testHasValue[TextValueEditor - bytearray PNG](org.apache.directory.studio.test.integration.ui.ValueEditorTest)
 Time elapsed: 0 sec
testGetRawValue[TextValueEditor - bytearray PNG](org.apache.directory.studio.test.integration.ui.ValueEditorTest)
 Time elapsed: 0 sec
testGetDisplayValue[HexValueEditor - empty string value](org.apache.directory.studio.test.integration.ui.ValueEditorTest)
 Time elapsed: 0 sec
testGetStringOrBinaryValue[HexValueEditor - empty string value](org.apache.directory.studio.test.integration.ui.ValueEditorTest)
 Time elapsed: 0.001 sec
testHasValue[HexValueEditor - empty string value](org.apache.directory.studio.test.integration.ui.ValueEditorTest)
 Time elapsed: 0 sec
testGetRawValue[HexValueEditor - empty string value](org.apache.directory.studio.test.integration.ui.ValueEditorTest)
 Time elapsed: 0 sec
testGetDisplayValue[HexValueEditor - empty string](org.apache.directory.studio.test.integration.ui.ValueEditorTest)
 Time elapsed: 0 sec
testGetStringOrBinaryValue[HexValueEditor - empty string](org.apache.directory.studio.test.integration.ui.ValueEditorTest)
 Time elapsed: 0 sec
testHasValue[HexValueEditor - empty string](org.apache.directory.studio.test.integration.ui.ValueEditorTest)
 Time elapsed: 0 sec
testGetRawValue[HexValueEditor - empty string](org.apache.directory.studio.test.integration.ui.ValueEditorTest)
 Time elapsed: 0 sec
testGetDisplayValue[HexValueEditor - ascii](org.apache.directory.studio.test.integration.ui.ValueEditorTest)
 Time elapsed: 0 sec
testGetStringOrBinaryValue[HexValueEditor - ascii](org.apache.directory.studio.test.integration.ui.ValueEditorTest)
 Time elapsed: 0 sec
testHasValue[HexValueEditor - ascii](org.apache.directory.studio.test.integration.ui.ValueEditorTest)
 Time elapsed: 0 sec
testGetRawValue[HexValueEditor - ascii](org.apache.directory.studio.test.integration.ui.ValueEditorTest)
 Time elapsed: 0 sec
testGetDisplayValue[HexValueEditor - empty binary value](org.apache.directory.studio.test.integration.ui.ValueEditorTest)
 Time elapsed: 0 sec
testGetStringOrBinaryValue[HexValueEditor - empty binary value](org.apache.directory.studio.test.integration.ui.ValueEditorTest)
 Time elapsed: 0 sec
testHasValue[HexValueEditor - empty binary value](org.apache.directory.studio.test.integration.ui.ValueEditorTest)
 Time elapsed: 0 sec
testGetRawValue[HexValueEditor - empty binary value](org.apache.directory.studio.test.integration.ui.ValueEditorTest)
 Time elapsed: 0 sec
testGetDisplayValue[HexValueEditor - empty bytearray](org.apache.directory.studio.test.integration.ui.ValueEditorTest)
 Time elapsed: 0 sec
testGetStringOrBinaryValue[HexValueEditor - empty bytearray](org.apache.directory.studio.test.integration.ui.ValueEditorTest)
 Time elapsed: 0 sec
testHasValue[HexValueEditor - empty bytearray](org.apache.directory.studio.test.integration.ui.ValueEditorTest)
 Time elapsed: 0 sec
testGetRawValue[HexValueEditor - empty bytearray](org.apache.directory.studio.test.integration.ui.ValueEditorTest)
 Time elapsed: 0 sec
testGetDisplayValue[HexValueEditor - bytearray UTF8](org.apache.directory.studio.test.integration.ui.ValueEditorTest)
 Time elapsed: 0 sec
testGetStringOrBinaryValue[HexValueEditor - bytearray UTF8](org.apache.directory.studio.test.integration.ui.ValueEditorTest)
 Time elapsed: 0 sec
testHasValue[HexValueEditor - bytearray UTF8](org.apache.directory.studio.test.integration.ui.ValueEditorTest)
 Time elapsed: 0 sec
testGetRawValue[HexValueEditor - bytearray UTF8](org.apache.directory.studio.test.integration.ui.ValueEditorTest)
 Time elapsed: 0 sec
testGetDisplayValue[HexValueEditor - bytearray ISO-8859-1](org.apache.directory.studio.test.integration.ui.ValueEditorTest)
 Time elapsed: 0 sec
testGetStringOrBinaryValue[HexValueEditor - bytearray ISO-8859-1](org.apache.directory.studio.test.integration.ui.ValueEditorTest)
 Time elapsed: 0.001 sec
testHasValue[HexValueEditor - bytearray ISO-8859-1](org.apache.directory.studio.test.integration.ui.ValueEditorTest)
 Time elapsed: 0 sec
testGetRawValue[HexValueEditor - bytearray ISO-8859-1](org.apache.directory.studio.test.integration.ui.ValueEditorTest)
 Time elapsed: 0 sec
testGetDisplayValue[HexValueEditor - bytearray PNG](org.apache.directory.studio.test.integration.ui.ValueEditorTest)
 Time elapsed: 0 sec
testGetStringOrBinaryValue[HexValueEditor - bytearray PNG](org.apache.directory.studio.test.integration.ui.ValueEditorTest)
 Time elapsed: 0 sec
testHasValue[HexValueEditor - bytearray PNG](org.apache.directory.studio.test.integration.ui.ValueEditorTest)
 Time elapsed: 0 sec
testGetRawValue[HexValueEditor - bytearray PNG](org.apache.directory.studio.test.integration.ui.ValueEditorTest)
 Time elapsed: 0 sec

Results :

Tests in error: 
  ImportExportTest.testImportContextEntryRefreshesRootDSE:233 » Timeout Timeout ...

Tests run: 226, Failures: 0, Errors: 1, Skipped: 0

[INFO] ------------------------------------------------------------------------
[INFO] Reactor Summary:
[INFO] 
[INFO] Apache Directory Studio Parent ..................... SUCCESS [  1.131 s]
[INFO] Apache Directory Studio Target Platform for Eclipse  SUCCESS [  0.153 s]
[INFO] Apache Directory Studio Plugins .................... SUCCESS [  0.847 s]
[INFO] Apache Directory Studio Common UI .................. SUCCESS [  4.182 s]
[INFO] Apache Directory Studio Common Core ................ SUCCESS [  0.231 s]
[INFO] Apache Directory Studio LDIF Parser ................ SUCCESS [  2.416 s]
[INFO] Apache Directory Studio Connection Core ............ SUCCESS [  1.155 s]
[INFO] Apache Directory Studio Connection UI .............. SUCCESS [  0.984 s]
[INFO] Apache Directory Studio LDAP Browser Core .......... SUCCESS [  3.686 s]
[INFO] Apache Directory Studio LDAP Browser Common ........ SUCCESS [  3.485 s]
[INFO] Apache Directory Studio Value Editors .............. SUCCESS [  2.054 s]
[INFO] Apache Directory Studio ACI Item Editor ............ SUCCESS [  1.139 s]
[INFO] Apache Directory Studio ApacheDS Configuration ..... SUCCESS [  1.138 s]
[INFO] Apache Directory Studio LDIF Editor ................ SUCCESS [  0.725 s]
[INFO] Apache Directory Studio LDAP Browser UI ............ SUCCESS [  1.397 s]
[INFO] Apache Directory Studio LDAP Servers ............... SUCCESS [  0.501 s]
[INFO] Apache Directory Studio ApacheDS LDAP Server Adapter SUCCESS [  3.072 s]
[INFO] Apache Directory Studio RCP ........................ SUCCESS [  0.361 s]
[INFO] Apache Directory Studio Schema Editor .............. SUCCESS [  3.225 s]
[INFO] Apache Directory Studio OpenLDAP Common UI ......... SUCCESS [  1.419 s]
[INFO] Apache Directory Studio OpenLDAP Syncrepl .......... SUCCESS [  1.199 s]
[INFO] Apache Directory Studio OpenLDAP Configuration Editor SUCCESS [  3.325 s]
[INFO] Apache Directory Studio OpenLDAP ACL Configuration Editor SUCCESS [  2.505 s]
[INFO] Apache Directory Studio Template Editor ............ SUCCESS [  2.243 s]
[INFO] Apache Directory Studio Combined Editor ............ SUCCESS [  0.332 s]
[INFO] Apache Directory Studio SLF4J to Eclipse Log Binding SUCCESS [  0.096 s]
[INFO] Apache Directory Studio Help Plugins ............... SUCCESS [  0.015 s]
[INFO] Apache Directory Studio Apache DS Help ............. SUCCESS [  5.250 s]
[INFO] Apache Directory Studio LDAP Browser Help .......... SUCCESS [  9.243 s]
[INFO] Apache Directory Studio LDIF Editor Help ........... SUCCESS [  1.870 s]
[INFO] Apache Directory Studio RCP Help ................... SUCCESS [  1.906 s]
[INFO] Apache Directory Studio Schema Editor Help ......... SUCCESS [  2.537 s]
[INFO] Apache Directory Studio Feature Plugins ............ SUCCESS [  0.019 s]
[INFO] Apache Directory Studio ApacheDS Feature ........... SUCCESS [  0.249 s]
[INFO] Apache Directory Studio LDAP Browser Feature ....... SUCCESS [  0.122 s]
[INFO] Apache Directory Studio LDIF Editor Feature ........ SUCCESS [  0.095 s]
[INFO] Apache Directory Studio RCP Feature ................ SUCCESS [  0.333 s]
[INFO] Apache Directory Studio Schema Editor Feature ...... SUCCESS [  0.185 s]
[INFO] Apache Directory Studio OpenLDAP Feature ........... SUCCESS [  0.092 s]
[INFO] Apache Directory Studio National Language Support Feature SUCCESS [  0.399 s]
[INFO] Apache Directory Studio Test Plugins ............... SUCCESS [  0.024 s]
[INFO] Apache Directory Studio Core Integration Tests ..... SUCCESS [ 42.815 s]
[INFO] Apache Directory Studio UI Integration Tests ....... FAILURE [09:28 min]
[INFO] Apache Directory Studio P2 Repositories ............ SKIPPED
[INFO] Apache Directory Studio P2 Repository Dependencies . SKIPPED
[INFO] Apache Directory Studio P2 Repository Eclipse ...... SKIPPED
[INFO] Apache Directory Studio Product .................... SKIPPED
[INFO] Apache Directory Studio Installers ................. SKIPPED
[INFO] ------------------------------------------------------------------------
[INFO] BUILD FAILURE
[INFO] ------------------------------------------------------------------------
[INFO] Total time: 15:04 min
[INFO] Finished at: 2017-06-21T13:57:46+00:00
[INFO] Final Memory: 296M/5034M
[INFO] ------------------------------------------------------------------------
[ERROR] Failed to execute goal org.eclipse.tycho:tycho-surefire-plugin:0.24.0:test (default-test)
on project org.apache.directory.studio.test.integration.ui: There are test failures.
[ERROR] 
[ERROR] Please refer to /home/hnelson/studio/tests/test.integration.ui/target/surefire-reports
for the individual test results.
[ERROR] -> [Help 1]
[ERROR] 
[ERROR] To see the full stack trace of the errors, re-run Maven with the -e switch.
[ERROR] Re-run Maven using the -X switch to enable full debug logging.
[ERROR] 
[ERROR] For more information about the errors and possible solutions, please read the following
articles:
[ERROR] [Help 1] http://cwiki.apache.org/confluence/display/MAVEN/MojoFailureException
[ERROR] 
[ERROR] After correcting the problems, you can resume the build with the command
[ERROR]   mvn <goals> -rf :org.apache.directory.studio.test.integration.ui
Build step 'Execute shell' marked build as failure
Recording test results

Mime
View raw message