directory-notifications mailing list archives

Site index · List index
Message view « Date » · « Thread »
Top « Date » · « Thread »
From Apache Jenkins Server <jenk...@builds.apache.org>
Subject Build failed in Jenkins: dir-apacheds-win #586
Date Mon, 12 Jun 2017 09:43:19 GMT
See <https://builds.apache.org/job/dir-apacheds-win/586/display/redirect?page=changes>

Changes:

[elecharny] No need to create the temp file twice...

[elecharny] Fixed a double definition of a variable

------------------------------------------
[...truncated 24.68 KB...]
[INFO] Downloading: https://repo.maven.apache.org/maven2/org/apache/directory/api/api-ldap-extras-aci/1.0.0/api-ldap-extras-aci-1.0.0.jar
[INFO] Downloaded: https://repo.maven.apache.org/maven2/org/apache/directory/api/api-ldap-client-api/1.0.0/api-ldap-client-api-1.0.0.jar
(140 KB at 489.5 KB/sec)
[INFO] Downloading: https://repo.maven.apache.org/maven2/org/apache/directory/api/api-ldap-extras-util/1.0.0/api-ldap-extras-util-1.0.0.jar
[INFO] Downloaded: https://repo.maven.apache.org/maven2/org/apache/directory/api/api-ldap-extras-codec/1.0.0/api-ldap-extras-codec-1.0.0.jar
(257 KB at 876.9 KB/sec)
[INFO] Downloading: https://repo.maven.apache.org/maven2/org/apache/directory/api/api-ldap-model/1.0.0/api-ldap-model-1.0.0.jar
[INFO] Downloaded: https://repo.maven.apache.org/maven2/org/apache/directory/api/api-asn1-ber/1.0.0/api-asn1-ber-1.0.0.jar
(42 KB at 97.2 KB/sec)
[INFO] Downloading: https://repo.maven.apache.org/maven2/org/apache/directory/api/api-ldap-schema-data/1.0.0/api-ldap-schema-data-1.0.0.jar
[INFO] Downloaded: https://repo.maven.apache.org/maven2/org/apache/directory/api/api-ldap-extras-util/1.0.0/api-ldap-extras-util-1.0.0.jar
(20 KB at 42.0 KB/sec)
[INFO] Downloading: https://repo.maven.apache.org/maven2/org/apache/directory/api/api-util/1.0.0/api-util-1.0.0.jar
[INFO] Downloaded: https://repo.maven.apache.org/maven2/org/apache/directory/api/api-ldap-codec-core/1.0.0/api-ldap-codec-core-1.0.0.jar
(341 KB at 715.8 KB/sec)
[INFO] Downloaded: https://repo.maven.apache.org/maven2/org/apache/directory/api/api-ldap-extras-aci/1.0.0/api-ldap-extras-aci-1.0.0.jar
(103 KB at 215.0 KB/sec)
[INFO] Downloaded: https://repo.maven.apache.org/maven2/org/apache/directory/api/api-ldap-model/1.0.0/api-ldap-model-1.0.0.jar
(1039 KB at 1596.0 KB/sec)
[INFO] Downloaded: https://repo.maven.apache.org/maven2/org/apache/directory/api/api-util/1.0.0/api-util-1.0.0.jar
(84 KB at 122.0 KB/sec)
[INFO] Downloaded: https://repo.maven.apache.org/maven2/org/apache/directory/api/api-ldap-schema-data/1.0.0/api-ldap-schema-data-1.0.0.jar
(671 KB at 970.0 KB/sec)
[INFO] 
[INFO] --- maven-clean-plugin:3.0.0:clean (default-clean) @ apacheds-core-api ---
[INFO] Deleting F:\jenkins\jenkins-slave\workspace\dir-apacheds-win\trunk\core-api\target
[INFO] 
[INFO] --- maven-checkstyle-plugin:2.17:check (validate) @ apacheds-core-api ---
[INFO] 
[INFO] --- maven-remote-resources-plugin:1.5:process (process-resource-bundles) @ apacheds-core-api
---
[INFO] 
[INFO] --- maven-resources-plugin:3.0.2:resources (default-resources) @ apacheds-core-api
---
[INFO] Using 'UTF-8' encoding to copy filtered resources.
[INFO] Copying 1 resource
[INFO] Copying 3 resources
[INFO] 
[INFO] --- maven-compiler-plugin:3.6.1:compile (default-compile) @ apacheds-core-api ---
[INFO] Changes detected - recompiling the module!
[INFO] Compiling 132 source files to F:\jenkins\jenkins-slave\workspace\dir-apacheds-win\trunk\core-api\target\classes
[INFO] /F:/jenkins/jenkins-slave/workspace/dir-apacheds-win/trunk/core-api/src/main/java/org/apache/directory/server/core/api/LdapCoreSessionConnection.java:
F:\jenkins\jenkins-slave\workspace\dir-apacheds-win\trunk\core-api\src\main\java\org\apache\directory\server\core\api\LdapCoreSessionConnection.java
uses or overrides a deprecated API.
[INFO] /F:/jenkins/jenkins-slave/workspace/dir-apacheds-win/trunk/core-api/src/main/java/org/apache/directory/server/core/api/LdapCoreSessionConnection.java:
Recompile with -Xlint:deprecation for details.
[INFO] /F:/jenkins/jenkins-slave/workspace/dir-apacheds-win/trunk/core-api/src/main/java/org/apache/directory/server/core/api/schema/registries/synchronizers/AbstractRegistrySynchronizer.java:
Some input files use unchecked or unsafe operations.
[INFO] /F:/jenkins/jenkins-slave/workspace/dir-apacheds-win/trunk/core-api/src/main/java/org/apache/directory/server/core/api/schema/registries/synchronizers/AbstractRegistrySynchronizer.java:
Recompile with -Xlint:unchecked for details.
[INFO] 
[INFO] --- maven-resources-plugin:3.0.2:testResources (default-testResources) @ apacheds-core-api
---
[INFO] Using 'UTF-8' encoding to copy filtered resources.
[INFO] Copying 1 resource
[INFO] Copying 3 resources
[INFO] 
[INFO] --- maven-compiler-plugin:3.6.1:testCompile (default-testCompile) @ apacheds-core-api
---
[INFO] Changes detected - recompiling the module!
[INFO] Compiling 12 source files to F:\jenkins\jenkins-slave\workspace\dir-apacheds-win\trunk\core-api\target\test-classes
[INFO] /F:/jenkins/jenkins-slave/workspace/dir-apacheds-win/trunk/core-api/src/test/java/org/apache/directory/server/core/api/MockDirectoryService.java:
F:\jenkins\jenkins-slave\workspace\dir-apacheds-win\trunk\core-api\src\test\java\org\apache\directory\server\core\api\MockDirectoryService.java
uses unchecked or unsafe operations.
[INFO] /F:/jenkins/jenkins-slave/workspace/dir-apacheds-win/trunk/core-api/src/test/java/org/apache/directory/server/core/api/MockDirectoryService.java:
Recompile with -Xlint:unchecked for details.
[INFO] 
[INFO] --- maven-surefire-plugin:2.19.1:test (default-test) @ apacheds-core-api ---

-------------------------------------------------------
 T E S T S
-------------------------------------------------------
Running org.apache.directory.server.core.api.changelog.TagTest
Tests run: 8, Failures: 0, Errors: 0, Skipped: 0, Time elapsed: 0.146 sec - in org.apache.directory.server.core.api.changelog.TagTest
Running org.apache.directory.server.core.api.entry.ClonedServerEntryTest
Tests run: 8, Failures: 0, Errors: 0, Skipped: 0, Time elapsed: 0.288 sec - in org.apache.directory.server.core.api.entry.ClonedServerEntryTest
Running org.apache.directory.server.core.api.entry.SchemaAwareEntryTest
Tests run: 81, Failures: 0, Errors: 0, Skipped: 0, Time elapsed: 2.423 sec - in org.apache.directory.server.core.api.entry.SchemaAwareEntryTest
Running org.apache.directory.server.core.api.entry.SchemaAwareModificationTest
Tests run: 7, Failures: 0, Errors: 0, Skipped: 0, Time elapsed: 0.854 sec - in org.apache.directory.server.core.api.entry.SchemaAwareModificationTest
Running org.apache.directory.server.core.api.normalization.FilterNormalizingVisitorTest
Tests run: 1, Failures: 0, Errors: 0, Skipped: 0, Time elapsed: 0.6 sec - in org.apache.directory.server.core.api.normalization.FilterNormalizingVisitorTest
Running org.apache.directory.server.core.api.sp.StoredProcUtilsTest
Tests run: 1, Failures: 0, Errors: 0, Skipped: 0, Time elapsed: 0.001 sec - in org.apache.directory.server.core.api.sp.StoredProcUtilsTest

Results :

Tests run: 106, Failures: 0, Errors: 0, Skipped: 0

[JENKINS] Recording test results
[INFO] 
[INFO] --- maven-bundle-plugin:3.3.0:bundle (default-bundle) @ apacheds-core-api ---
[INFO] 
[INFO] --- maven-site-plugin:3.6:attach-descriptor (attach-descriptor) @ apacheds-core-api
---
[INFO] Skipping because packaging 'bundle' is not pom.
[INFO] 
[INFO] --- maven-jar-plugin:3.0.2:test-jar (attach-tests) @ apacheds-core-api ---
[INFO] Building jar: F:\jenkins\jenkins-slave\workspace\dir-apacheds-win\trunk\core-api\target\apacheds-core-api-2.0.0-M25-SNAPSHOT-tests.jar
[INFO] 
[INFO] --- tools-maven-plugin:1.4:verify-legal-files (verify-legal-files) @ apacheds-core-api
---
[INFO] Checking legal files in: apacheds-core-api-2.0.0-M25-SNAPSHOT.jar
[INFO] Checking legal files in: apacheds-core-api-2.0.0-M25-SNAPSHOT-tests.jar
[INFO] 
[INFO] >>> maven-source-plugin:3.0.1:jar (attach-sources) > generate-sources @
apacheds-core-api >>>
[INFO] 
[INFO] --- maven-checkstyle-plugin:2.17:check (validate) @ apacheds-core-api ---
[WARNING] Failed to getClass for org.apache.maven.plugins.source.SourceJarMojo
[INFO] 
[INFO] <<< maven-source-plugin:3.0.1:jar (attach-sources) < generate-sources @
apacheds-core-api <<<
[INFO] 
[INFO] --- maven-source-plugin:3.0.1:jar (attach-sources) @ apacheds-core-api ---
[INFO] Building jar: F:\jenkins\jenkins-slave\workspace\dir-apacheds-win\trunk\core-api\target\apacheds-core-api-2.0.0-M25-SNAPSHOT-sources.jar
[INFO] 
[INFO] --- maven-install-plugin:2.5.2:install (default-install) @ apacheds-core-api ---
[INFO] Installing F:\jenkins\jenkins-slave\workspace\dir-apacheds-win\trunk\core-api\target\apacheds-core-api-2.0.0-M25-SNAPSHOT.jar
to f:\jenkins\jenkins-slave\maven-repositories\0\org\apache\directory\server\apacheds-core-api\2.0.0-M25-SNAPSHOT\apacheds-core-api-2.0.0-M25-SNAPSHOT.jar
[INFO] Installing F:\jenkins\jenkins-slave\workspace\dir-apacheds-win\trunk\core-api\pom.xml
to f:\jenkins\jenkins-slave\maven-repositories\0\org\apache\directory\server\apacheds-core-api\2.0.0-M25-SNAPSHOT\apacheds-core-api-2.0.0-M25-SNAPSHOT.pom
[INFO] Installing F:\jenkins\jenkins-slave\workspace\dir-apacheds-win\trunk\core-api\target\apacheds-core-api-2.0.0-M25-SNAPSHOT-tests.jar
to f:\jenkins\jenkins-slave\maven-repositories\0\org\apache\directory\server\apacheds-core-api\2.0.0-M25-SNAPSHOT\apacheds-core-api-2.0.0-M25-SNAPSHOT-tests.jar
[INFO] Installing F:\jenkins\jenkins-slave\workspace\dir-apacheds-win\trunk\core-api\target\apacheds-core-api-2.0.0-M25-SNAPSHOT-sources.jar
to f:\jenkins\jenkins-slave\maven-repositories\0\org\apache\directory\server\apacheds-core-api\2.0.0-M25-SNAPSHOT\apacheds-core-api-2.0.0-M25-SNAPSHOT-sources.jar
[INFO] 
[INFO] --- maven-bundle-plugin:3.3.0:install (default-install) @ apacheds-core-api ---
[INFO] Installing org/apache/directory/server/apacheds-core-api/2.0.0-M25-SNAPSHOT/apacheds-core-api-2.0.0-M25-SNAPSHOT.jar
[INFO] Writing OBR metadata
[JENKINS] Archiving disabled
[INFO]                                                                         
[INFO] ------------------------------------------------------------------------
[INFO] Building ApacheDS Core Shared 2.0.0-M25-SNAPSHOT
[INFO] ------------------------------------------------------------------------
[INFO] 
[INFO] --- maven-clean-plugin:3.0.0:clean (default-clean) @ apacheds-core-shared ---
[INFO] Deleting F:\jenkins\jenkins-slave\workspace\dir-apacheds-win\trunk\core-shared\target
[INFO] 
[INFO] --- maven-checkstyle-plugin:2.17:check (validate) @ apacheds-core-shared ---
[INFO] There are 2 errors reported by Checkstyle 7.8 with directory-checks.xml ruleset.
[ERROR] src\main\java\org\apache\directory\server\core\shared\DefaultCoreSession.java:[1346,23]
(whitespace) ParenPad: '(' is not followed by whitespace.
[ERROR] src\main\java\org\apache\directory\server\core\shared\DefaultCoreSession.java:[1346,142]
(whitespace) ParenPad: ')' is not preceded with whitespace.
[JENKINS] Archiving disabled
[JENKINS] Archiving disabled
[JENKINS] Archiving disabled
[JENKINS] Archiving disabled
[JENKINS] Archiving disabled
[JENKINS] Archiving disabled
[JENKINS] Archiving disabled
[JENKINS] Archiving disabled
[JENKINS] Archiving disabled
[JENKINS] Archiving disabled
[JENKINS] Archiving disabled
[JENKINS] Archiving disabled
[JENKINS] Archiving disabled
[JENKINS] Archiving disabled
[JENKINS] Archiving disabled
[JENKINS] Archiving disabled
[JENKINS] Archiving disabled
[JENKINS] Archiving disabled
[JENKINS] Archiving disabled
[JENKINS] Archiving disabled
[JENKINS] Archiving disabled
[JENKINS] Archiving disabled
[JENKINS] Archiving disabled
[JENKINS] Archiving disabled
[JENKINS] Archiving disabled
[JENKINS] Archiving disabled
[JENKINS] Archiving disabled
[JENKINS] Archiving disabled
[JENKINS] Archiving disabled
[JENKINS] Archiving disabled
[JENKINS] Archiving disabled
[JENKINS] Archiving disabled
[JENKINS] Archiving disabled
[JENKINS] Archiving disabled
[JENKINS] Archiving disabled
[JENKINS] Archiving disabled
[JENKINS] Archiving disabled
[JENKINS] Archiving disabled
[JENKINS] Archiving disabled
[JENKINS] Archiving disabled
[JENKINS] Archiving disabled
[JENKINS] Archiving disabled
[JENKINS] Archiving disabled
[JENKINS] Archiving disabled
[JENKINS] Archiving disabled
[JENKINS] Archiving disabled
[JENKINS] Archiving disabled
[JENKINS] Archiving disabled
[JENKINS] Archiving disabled
[JENKINS] Archiving disabled
[JENKINS] Archiving disabled
[JENKINS] Archiving disabled
[JENKINS] Archiving disabled
[JENKINS] Archiving disabled
[JENKINS] Archiving disabled
[JENKINS] Archiving disabled
[JENKINS] Archiving disabled
[INFO] ------------------------------------------------------------------------
[INFO] Reactor Summary:
[INFO] 
[INFO] ApacheDS ........................................... SUCCESS [  9.274 s]
[INFO] ApacheDS I18n ...................................... SUCCESS [  8.720 s]
[INFO] ApacheDS Core Constants ............................ SUCCESS [  3.943 s]
[INFO] ApacheDS Core API .................................. SUCCESS [01:24 min]
[INFO] ApacheDS Core Shared ............................... FAILURE [  1.274 s]
[INFO] ApacheDS Interceptors .............................. SKIPPED
[INFO] ApacheDS AdministrativePoint Interceptor ........... SKIPPED
[INFO] ApacheDS Authentication Interceptor ................ SKIPPED
[INFO] ApacheDS Interceptor to increment numeric attributes SKIPPED
[INFO] ApacheDS Authorization Interceptor ................. SKIPPED
[INFO] ApacheDS ChangeLog Interceptor ..................... SKIPPED
[INFO] ApacheDS Collective Attribute Interceptor .......... SKIPPED
[INFO] ApacheDS Event Interceptor ......................... SKIPPED
[INFO] ApacheDS Exception Interceptor ..................... SKIPPED
[INFO] ApacheDS Journal Interceptor ....................... SKIPPED
[INFO] ApacheDS Normalization Interceptor ................. SKIPPED
[INFO] ApacheDS Operational Attribute Interceptor ......... SKIPPED
[INFO] ApacheDS Referral Interceptor ...................... SKIPPED
[INFO] ApacheDS Schema Interceptor ........................ SKIPPED
[INFO] ApacheDS Subtree Interceptor ....................... SKIPPED
[INFO] ApacheDS Triggers Interceptor ...................... SKIPPED
[INFO] ApacheDS Core ...................................... SKIPPED
[INFO] ApacheDS Core AVL .................................. SKIPPED
[INFO] ApacheDS Generalized (X) DBM Partition ............. SKIPPED
[INFO] ApacheDS LDIF Partition ............................ SKIPPED
[INFO] ApacheDS JDBM Partition ............................ SKIPPED
[INFO] ApacheDS Mavibot Partition ......................... SKIPPED
[INFO] ApacheDS Core Annotations .......................... SKIPPED
[INFO] ApacheDS Core JNDI ................................. SKIPPED
[INFO] ApacheDS Protocol Kerberos Codec ................... SKIPPED
[INFO] ApacheDS Interceptors for Kerberos ................. SKIPPED
[INFO] ApacheDS Protocol Dhcp ............................. SKIPPED
[INFO] ApacheDS Protocol Shared ........................... SKIPPED
[INFO] ApacheDS Protocol Dns .............................. SKIPPED
[INFO] ApacheDS Protocol Kerberos ......................... SKIPPED
[INFO] ApacheDS Protocol Ldap ............................. SKIPPED
[INFO] ApacheDS Protocol Ntp .............................. SKIPPED
[INFO] Apacheds Server Annotations ........................ SKIPPED
[INFO] ApacheDS Server Config ............................. SKIPPED
[INFO] ApacheDS Server JNDI ............................... SKIPPED
[INFO] ApacheDS Test Framework ............................ SKIPPED
[INFO] ApacheDS All ....................................... SKIPPED
[INFO] ApacheDS Logger Interceptor ........................ SKIPPED
[INFO] ApacheDS Password Hashing Interceptor .............. SKIPPED
[INFO] ApacheDS Core Integration .......................... SKIPPED
[INFO] ApacheDS Protocol Kerberos Test .................... SKIPPED
[INFO] ApacheDS Server Integration ........................ SKIPPED
[INFO] ApacheDS DirectoryService-WebApp bridge ............ SKIPPED
[INFO] ApacheDS Jetty HTTP Server Integration ............. SKIPPED
[INFO] ApacheDS Service Builder ........................... SKIPPED
[INFO] Apache Directory LDAP Client API test .............. SKIPPED
[INFO] kerberos-client .................................... SKIPPED
[INFO] ApacheDS Service ................................... SKIPPED
[INFO] ApacheDS Wrapper ................................... SKIPPED
[INFO] ApacheDS Installers Maven Plugin ................... SKIPPED
[INFO] ApacheDS Installers ................................ SKIPPED
[INFO] ------------------------------------------------------------------------
[INFO] BUILD FAILURE
[INFO] ------------------------------------------------------------------------
[INFO] Total time: 02:33 min
[INFO] Finished at: 2017-06-12T09:42:59+00:00
[INFO] Final Memory: 70M/373M
[INFO] ------------------------------------------------------------------------
[ERROR] Failed to execute goal org.apache.maven.plugins:maven-checkstyle-plugin:2.17:check
(validate) on project apacheds-core-shared: You have 2 Checkstyle violations. -> [Help
1]
[ERROR] 
[ERROR] To see the full stack trace of the errors, re-run Maven with the -e switch.
[ERROR] Re-run Maven using the -X switch to enable full debug logging.
[ERROR] 
[ERROR] For more information about the errors and possible solutions, please read the following
articles:
[ERROR] [Help 1] http://cwiki.apache.org/confluence/display/MAVEN/MojoFailureException
[ERROR] 
[ERROR] After correcting the problems, you can resume the build with the command
[ERROR]   mvn <goals> -rf :apacheds-core-shared
channel stopped
Java HotSpot(TM) 64-Bit Server VM warning: ignoring option MaxPermSize=128m; support was removed
in 8.0

Mime
View raw message