directory-notifications mailing list archives

Site index · List index
Message view « Date » · « Thread »
Top « Date » · « Thread »
From Apache Jenkins Server <jenk...@builds.apache.org>
Subject Build failed in Jenkins: dir-studio-ui-tests-in-docker #49
Date Wed, 07 Jun 2017 14:31:38 GMT
See <https://builds.apache.org/job/dir-studio-ui-tests-in-docker/49/display/redirect>

------------------------------------------
[...truncated 2.36 MB...]
testGetDisplayValue[TextValueEditor - bytearray UTF8](org.apache.directory.studio.test.integration.ui.ValueEditorTest)
 Time elapsed: 0 sec
testGetStringOrBinaryValue[TextValueEditor - bytearray UTF8](org.apache.directory.studio.test.integration.ui.ValueEditorTest)
 Time elapsed: 0 sec
testHasValue[TextValueEditor - bytearray UTF8](org.apache.directory.studio.test.integration.ui.ValueEditorTest)
 Time elapsed: 0 sec
testGetRawValue[TextValueEditor - bytearray UTF8](org.apache.directory.studio.test.integration.ui.ValueEditorTest)
 Time elapsed: 0 sec
testGetDisplayValue[TextValueEditor - bytearray ISO-8859-1](org.apache.directory.studio.test.integration.ui.ValueEditorTest)
 Time elapsed: 0 sec
testGetStringOrBinaryValue[TextValueEditor - bytearray ISO-8859-1](org.apache.directory.studio.test.integration.ui.ValueEditorTest)
 Time elapsed: 0 sec
testHasValue[TextValueEditor - bytearray ISO-8859-1](org.apache.directory.studio.test.integration.ui.ValueEditorTest)
 Time elapsed: 0 sec
testGetRawValue[TextValueEditor - bytearray ISO-8859-1](org.apache.directory.studio.test.integration.ui.ValueEditorTest)
 Time elapsed: 0 sec
testGetDisplayValue[TextValueEditor - bytearray PNG](org.apache.directory.studio.test.integration.ui.ValueEditorTest)
 Time elapsed: 0 sec
testGetStringOrBinaryValue[TextValueEditor - bytearray PNG](org.apache.directory.studio.test.integration.ui.ValueEditorTest)
 Time elapsed: 0 sec
testHasValue[TextValueEditor - bytearray PNG](org.apache.directory.studio.test.integration.ui.ValueEditorTest)
 Time elapsed: 0 sec
testGetRawValue[TextValueEditor - bytearray PNG](org.apache.directory.studio.test.integration.ui.ValueEditorTest)
 Time elapsed: 0.001 sec
testGetDisplayValue[HexValueEditor - empty string value](org.apache.directory.studio.test.integration.ui.ValueEditorTest)
 Time elapsed: 0 sec
testGetStringOrBinaryValue[HexValueEditor - empty string value](org.apache.directory.studio.test.integration.ui.ValueEditorTest)
 Time elapsed: 0.001 sec
testHasValue[HexValueEditor - empty string value](org.apache.directory.studio.test.integration.ui.ValueEditorTest)
 Time elapsed: 0 sec
testGetRawValue[HexValueEditor - empty string value](org.apache.directory.studio.test.integration.ui.ValueEditorTest)
 Time elapsed: 0 sec
testGetDisplayValue[HexValueEditor - empty string](org.apache.directory.studio.test.integration.ui.ValueEditorTest)
 Time elapsed: 0 sec
testGetStringOrBinaryValue[HexValueEditor - empty string](org.apache.directory.studio.test.integration.ui.ValueEditorTest)
 Time elapsed: 0 sec
testHasValue[HexValueEditor - empty string](org.apache.directory.studio.test.integration.ui.ValueEditorTest)
 Time elapsed: 0 sec
testGetRawValue[HexValueEditor - empty string](org.apache.directory.studio.test.integration.ui.ValueEditorTest)
 Time elapsed: 0 sec
testGetDisplayValue[HexValueEditor - ascii](org.apache.directory.studio.test.integration.ui.ValueEditorTest)
 Time elapsed: 0 sec
testGetStringOrBinaryValue[HexValueEditor - ascii](org.apache.directory.studio.test.integration.ui.ValueEditorTest)
 Time elapsed: 0 sec
testHasValue[HexValueEditor - ascii](org.apache.directory.studio.test.integration.ui.ValueEditorTest)
 Time elapsed: 0 sec
testGetRawValue[HexValueEditor - ascii](org.apache.directory.studio.test.integration.ui.ValueEditorTest)
 Time elapsed: 0 sec
testGetDisplayValue[HexValueEditor - empty binary value](org.apache.directory.studio.test.integration.ui.ValueEditorTest)
 Time elapsed: 0 sec
testGetStringOrBinaryValue[HexValueEditor - empty binary value](org.apache.directory.studio.test.integration.ui.ValueEditorTest)
 Time elapsed: 0 sec
testHasValue[HexValueEditor - empty binary value](org.apache.directory.studio.test.integration.ui.ValueEditorTest)
 Time elapsed: 0 sec
testGetRawValue[HexValueEditor - empty binary value](org.apache.directory.studio.test.integration.ui.ValueEditorTest)
 Time elapsed: 0 sec
testGetDisplayValue[HexValueEditor - empty bytearray](org.apache.directory.studio.test.integration.ui.ValueEditorTest)
 Time elapsed: 0 sec
testGetStringOrBinaryValue[HexValueEditor - empty bytearray](org.apache.directory.studio.test.integration.ui.ValueEditorTest)
 Time elapsed: 0 sec
testHasValue[HexValueEditor - empty bytearray](org.apache.directory.studio.test.integration.ui.ValueEditorTest)
 Time elapsed: 0 sec
testGetRawValue[HexValueEditor - empty bytearray](org.apache.directory.studio.test.integration.ui.ValueEditorTest)
 Time elapsed: 0 sec
testGetDisplayValue[HexValueEditor - bytearray UTF8](org.apache.directory.studio.test.integration.ui.ValueEditorTest)
 Time elapsed: 0 sec
testGetStringOrBinaryValue[HexValueEditor - bytearray UTF8](org.apache.directory.studio.test.integration.ui.ValueEditorTest)
 Time elapsed: 0 sec
testHasValue[HexValueEditor - bytearray UTF8](org.apache.directory.studio.test.integration.ui.ValueEditorTest)
 Time elapsed: 0 sec
testGetRawValue[HexValueEditor - bytearray UTF8](org.apache.directory.studio.test.integration.ui.ValueEditorTest)
 Time elapsed: 0 sec
testGetDisplayValue[HexValueEditor - bytearray ISO-8859-1](org.apache.directory.studio.test.integration.ui.ValueEditorTest)
 Time elapsed: 0 sec
testGetStringOrBinaryValue[HexValueEditor - bytearray ISO-8859-1](org.apache.directory.studio.test.integration.ui.ValueEditorTest)
 Time elapsed: 0 sec
testHasValue[HexValueEditor - bytearray ISO-8859-1](org.apache.directory.studio.test.integration.ui.ValueEditorTest)
 Time elapsed: 0 sec
testGetRawValue[HexValueEditor - bytearray ISO-8859-1](org.apache.directory.studio.test.integration.ui.ValueEditorTest)
 Time elapsed: 0 sec
testGetDisplayValue[HexValueEditor - bytearray PNG](org.apache.directory.studio.test.integration.ui.ValueEditorTest)
 Time elapsed: 0 sec
testGetStringOrBinaryValue[HexValueEditor - bytearray PNG](org.apache.directory.studio.test.integration.ui.ValueEditorTest)
 Time elapsed: 0 sec
testHasValue[HexValueEditor - bytearray PNG](org.apache.directory.studio.test.integration.ui.ValueEditorTest)
 Time elapsed: 0 sec
testGetRawValue[HexValueEditor - bytearray PNG](org.apache.directory.studio.test.integration.ui.ValueEditorTest)
 Time elapsed: 0 sec
Running org.apache.directory.studio.test.integration.ui.NewConnectionWizardTest
The connection failed
 - qwertzuiop.asdfghjkl.yxcvbnm:45323
Tests run: 6, Failures: 0, Errors: 0, Skipped: 0, Time elapsed: 9.18 sec - in org.apache.directory.studio.test.integration.ui.NewConnectionWizardTest
testCheckAuthenticationButtonNotOK(org.apache.directory.studio.test.integration.ui.NewConnectionWizardTest)
 Time elapsed: 1.212 sec
testCreateConnection(org.apache.directory.studio.test.integration.ui.NewConnectionWizardTest)
 Time elapsed: 3.476 sec
testCheckNetworkParameterButtonNotOK(org.apache.directory.studio.test.integration.ui.NewConnectionWizardTest)
 Time elapsed: 1.117 sec
testCheckAuthenticationButtonOK(org.apache.directory.studio.test.integration.ui.NewConnectionWizardTest)
 Time elapsed: 0.662 sec
testCheckNetworkParameterButtonOK(org.apache.directory.studio.test.integration.ui.NewConnectionWizardTest)
 Time elapsed: 0.613 sec
testEnabledDisabledWidgets(org.apache.directory.studio.test.integration.ui.NewConnectionWizardTest)
 Time elapsed: 0.938 sec
Running org.apache.directory.studio.test.integration.ui.BrowserTest
Tests run: 12, Failures: 0, Errors: 0, Skipped: 0, Time elapsed: 91.368 sec - in org.apache.directory.studio.test.integration.ui.BrowserTest
testBookmark(org.apache.directory.studio.test.integration.ui.BrowserTest)  Time elapsed: 3.679
sec
testRefreshRootDSE(org.apache.directory.studio.test.integration.ui.BrowserTest)  Time elapsed:
11.155 sec
TestSetInputOnlyOnce(org.apache.directory.studio.test.integration.ui.BrowserTest)  Time elapsed:
9.668 sec
testBrowseDnWithIpHostNumber(org.apache.directory.studio.test.integration.ui.BrowserTest)
 Time elapsed: 5.177 sec
testRefreshParent(org.apache.directory.studio.test.integration.ui.BrowserTest)  Time elapsed:
7.035 sec
testCopyPasteValueToBookmark(org.apache.directory.studio.test.integration.ui.BrowserTest)
 Time elapsed: 6.298 sec
testRefreshSearchContinuation(org.apache.directory.studio.test.integration.ui.BrowserTest)
 Time elapsed: 8.899 sec
testDeleteDontUpdateUI(org.apache.directory.studio.test.integration.ui.BrowserTest)  Time
elapsed: 5.545 sec
testBrowseDnWithSharpAndHexSequence(org.apache.directory.studio.test.integration.ui.BrowserTest)
 Time elapsed: 4.86 sec
testNoModificationWhileBrowsingAndRefreshing(org.apache.directory.studio.test.integration.ui.BrowserTest)
 Time elapsed: 15.05 sec
testRefreshContextEntry(org.apache.directory.studio.test.integration.ui.BrowserTest)  Time
elapsed: 7.85 sec
testOnlyOneSearchRequestWhenExpandingEntry(org.apache.directory.studio.test.integration.ui.BrowserTest)
 Time elapsed: 4.542 sec
Running org.apache.directory.studio.test.integration.ui.GssApiTest
Tests run: 2, Failures: 0, Errors: 0, Skipped: 0, Time elapsed: 29.28 sec - in org.apache.directory.studio.test.integration.ui.GssApiTest
testGssApiObtainTgtAndUseManualConfigurationAndObtainServiceTicket(org.apache.directory.studio.test.integration.ui.GssApiTest)
 Time elapsed: 14.679 sec
testGssApiUseNativeTgtAndNativeConfigurationAndObtainServiceTicket(org.apache.directory.studio.test.integration.ui.GssApiTest)
 Time elapsed: 13.191 sec
Running org.apache.directory.studio.test.integration.ui.ApacheDSPluginTest
Tests run: 4, Failures: 2, Errors: 1, Skipped: 0, Time elapsed: 77.352 sec <<< FAILURE!
- in org.apache.directory.studio.test.integration.ui.ApacheDSPluginTest
editRemoteConfig(org.apache.directory.studio.test.integration.ui.ApacheDSPluginTest)  Time
elapsed: 12.874 sec
repairAndStartAndStop(org.apache.directory.studio.test.integration.ui.ApacheDSPluginTest)
 Time elapsed: 62.014 sec  <<< ERROR!
org.eclipse.swtbot.swt.finder.widgets.TimeoutException: Timeout after: 60000 ms.: Server Repair
not started in servers view.
	at org.eclipse.swtbot.swt.finder.SWTBotFactory.waitUntil(SWTBotFactory.java:522)
	at org.eclipse.swtbot.swt.finder.SWTBotFactory.waitUntil(SWTBotFactory.java:496)
	at org.apache.directory.studio.test.integration.ui.bots.ApacheDSServersViewBot.waitForServerStart(ApacheDSServersViewBot.java:209)
	at org.apache.directory.studio.test.integration.ui.ApacheDSPluginTest.repairAndStartAndStop(ApacheDSPluginTest.java:411)

verifyServerNameCollisionInNewWizard(org.apache.directory.studio.test.integration.ui.ApacheDSPluginTest)
 Time elapsed: 0.505 sec  <<< FAILURE!
java.lang.AssertionError: expected:<0> but was:<1>
	at org.junit.Assert.fail(Assert.java:88)
	at org.junit.Assert.failNotEquals(Assert.java:834)
	at org.junit.Assert.assertEquals(Assert.java:645)
	at org.junit.Assert.assertEquals(Assert.java:631)
	at org.apache.directory.studio.test.integration.ui.ApacheDSPluginTest.verifyServerNameCollisionInNewWizard(ApacheDSPluginTest.java:190)

serverCreationStartCreateConnectionStopAndDeletion(org.apache.directory.studio.test.integration.ui.ApacheDSPluginTest)
 Time elapsed: 0.431 sec  <<< FAILURE!
java.lang.AssertionError: expected:<0> but was:<1>
	at org.junit.Assert.fail(Assert.java:88)
	at org.junit.Assert.failNotEquals(Assert.java:834)
	at org.junit.Assert.assertEquals(Assert.java:645)
	at org.junit.Assert.assertEquals(Assert.java:631)
	at org.apache.directory.studio.test.integration.ui.ApacheDSPluginTest.createServer(ApacheDSPluginTest.java:153)
	at org.apache.directory.studio.test.integration.ui.ApacheDSPluginTest.serverCreationStartCreateConnectionStopAndDeletion(ApacheDSPluginTest.java:91)

Running org.apache.directory.studio.test.integration.ui.NewEntryWizardTest
Tests run: 8, Failures: 0, Errors: 0, Skipped: 0, Time elapsed: 51.545 sec - in org.apache.directory.studio.test.integration.ui.NewEntryWizardTest
testCreatePersonEntry(org.apache.directory.studio.test.integration.ui.NewEntryWizardTest)
 Time elapsed: 5.259 sec
testCreateEntryBelowReferralObjectCancel(org.apache.directory.studio.test.integration.ui.NewEntryWizardTest)
 Time elapsed: 7.161 sec
testCreateEntryBelowReferralObjectFollow(org.apache.directory.studio.test.integration.ui.NewEntryWizardTest)
 Time elapsed: 7.481 sec
testCreateOrganizationEntry(org.apache.directory.studio.test.integration.ui.NewEntryWizardTest)
 Time elapsed: 5.634 sec
testCreateEntryWithSharp(org.apache.directory.studio.test.integration.ui.NewEntryWizardTest)
 Time elapsed: 5.269 sec
testCreateEntryWithSlash(org.apache.directory.studio.test.integration.ui.NewEntryWizardTest)
 Time elapsed: 5.699 sec
testCreateUpperCaseOrganizationEntries(org.apache.directory.studio.test.integration.ui.NewEntryWizardTest)
 Time elapsed: 6.95 sec
testCreateMvRdnWithNumericOid(org.apache.directory.studio.test.integration.ui.NewEntryWizardTest)
 Time elapsed: 5.574 sec
Running org.apache.directory.studio.test.integration.ui.PreferencesTest
Tests run: 2, Failures: 0, Errors: 0, Skipped: 0, Time elapsed: 2.527 sec - in org.apache.directory.studio.test.integration.ui.PreferencesTest
testCertificatValidationSettingsSaved(org.apache.directory.studio.test.integration.ui.PreferencesTest)
 Time elapsed: 0.675 sec
testCertificatValidationPage(org.apache.directory.studio.test.integration.ui.PreferencesTest)
 Time elapsed: 0.748 sec
Running org.apache.directory.studio.test.integration.ui.SearchTest
Tests run: 3, Failures: 0, Errors: 0, Skipped: 0, Time elapsed: 25.052 sec - in org.apache.directory.studio.test.integration.ui.SearchTest
testOnlyOneUiUpdateOnQuickSearch(org.apache.directory.studio.test.integration.ui.SearchTest)
 Time elapsed: 7.289 sec
testRefresh(org.apache.directory.studio.test.integration.ui.SearchTest)  Time elapsed: 8.716
sec
testCopyPasteSearchBetweenConnections(org.apache.directory.studio.test.integration.ui.SearchTest)
 Time elapsed: 7.853 sec
Running org.apache.directory.studio.test.integration.ui.ImportExportTest
/home/hnelson/studio/tests/test.integration.ui/target/work/data/ImportExportTest.csv
Tests run: 5, Failures: 0, Errors: 0, Skipped: 0, Time elapsed: 34.573 sec - in org.apache.directory.studio.test.integration.ui.ImportExportTest
testExportCsvShouldPrefixFormulaWithApostrophe(org.apache.directory.studio.test.integration.ui.ImportExportTest)
 Time elapsed: 5.045 sec
testImportContextEntryRefreshesRootDSE(org.apache.directory.studio.test.integration.ui.ImportExportTest)
 Time elapsed: 8.245 sec
testExportImportDsmlWithGermanUmlautInDN(org.apache.directory.studio.test.integration.ui.ImportExportTest)
 Time elapsed: 7.298 sec
testExportImportLdifWithGermanUmlautInDN(org.apache.directory.studio.test.integration.ui.ImportExportTest)
 Time elapsed: 6.656 sec
testImportDoesNotUpdateUI(org.apache.directory.studio.test.integration.ui.ImportExportTest)
 Time elapsed: 5.949 sec
Running org.apache.directory.studio.test.integration.ui.RcpAppTest
Tests run: 12, Failures: 0, Errors: 0, Skipped: 0, Time elapsed: 5.635 sec - in org.apache.directory.studio.test.integration.ui.RcpAppTest
testLdapPerspectiveViews(org.apache.directory.studio.test.integration.ui.RcpAppTest)  Time
elapsed: 0.506 sec
testHiddenItemsInExportWizard(org.apache.directory.studio.test.integration.ui.RcpAppTest)
 Time elapsed: 0.34 sec
testHiddenPreferencePages(org.apache.directory.studio.test.integration.ui.RcpAppTest)  Time
elapsed: 0.302 sec
testHiddenItemsInNewWizard(org.apache.directory.studio.test.integration.ui.RcpAppTest)  Time
elapsed: 0.314 sec
testVisibleItemsInImportWizard(org.apache.directory.studio.test.integration.ui.RcpAppTest)
 Time elapsed: 0.321 sec
testVisibleItemsInExportWizard(org.apache.directory.studio.test.integration.ui.RcpAppTest)
 Time elapsed: 0.321 sec
testSchemaEditorPerspectiveViews(org.apache.directory.studio.test.integration.ui.RcpAppTest)
 Time elapsed: 0.494 sec
testVisibleItemsInOpenViewsDialog(org.apache.directory.studio.test.integration.ui.RcpAppTest)
 Time elapsed: 0.458 sec
testHiddenItemsInImportWizard(org.apache.directory.studio.test.integration.ui.RcpAppTest)
 Time elapsed: 0.319 sec
testHiddenItemsInOpenViewsDialog(org.apache.directory.studio.test.integration.ui.RcpAppTest)
 Time elapsed: 0.3 sec
testVisibleItemsInNewWizard(org.apache.directory.studio.test.integration.ui.RcpAppTest)  Time
elapsed: 0.343 sec
testVisiblePreferencePages(org.apache.directory.studio.test.integration.ui.RcpAppTest)  Time
elapsed: 0.376 sec
Running org.apache.directory.studio.test.integration.ui.ReferralDialogTest
Tests run: 5, Failures: 0, Errors: 0, Skipped: 0, Time elapsed: 25.59 sec - in org.apache.directory.studio.test.integration.ui.ReferralDialogTest
testBrowseAndFollowManuallyContinuationReference(org.apache.directory.studio.test.integration.ui.ReferralDialogTest)
 Time elapsed: 4.665 sec
testBrowseAndFollowContinuationReference(org.apache.directory.studio.test.integration.ui.ReferralDialogTest)
 Time elapsed: 5.112 sec
testBrowseAndCancelFollowingContinuationReference(org.apache.directory.studio.test.integration.ui.ReferralDialogTest)
 Time elapsed: 4.282 sec
testBrowseAndIgnoreReferral(org.apache.directory.studio.test.integration.ui.ReferralDialogTest)
 Time elapsed: 3.971 sec
testBrowseAndManageReferralEntry(org.apache.directory.studio.test.integration.ui.ReferralDialogTest)
 Time elapsed: 4.294 sec
Running org.apache.directory.studio.test.integration.ui.CertificateValidationTest
Tests run: 12, Failures: 0, Errors: 0, Skipped: 0, Time elapsed: 89.031 sec - in org.apache.directory.studio.test.integration.ui.CertificateValidationTest
testStartTlsCertificateTrustTemporary(org.apache.directory.studio.test.integration.ui.CertificateValidationTest)
 Time elapsed: 9.875 sec
testLdapsCertificateTrustPermanent(org.apache.directory.studio.test.integration.ui.CertificateValidationTest)
 Time elapsed: 7.06 sec
testStartTlsCertificateValidationNotYetValid(org.apache.directory.studio.test.integration.ui.CertificateValidationTest)
 Time elapsed: 6.561 sec
testLdapsCertificateTrustTemporary(org.apache.directory.studio.test.integration.ui.CertificateValidationTest)
 Time elapsed: 8.044 sec
testLdapsCertificateDoNotTrust(org.apache.directory.studio.test.integration.ui.CertificateValidationTest)
 Time elapsed: 8.653 sec
testStartTlsCertificateValidationExpired(org.apache.directory.studio.test.integration.ui.CertificateValidationTest)
 Time elapsed: 6.65 sec
testLdapsCertificateValidationNotOK(org.apache.directory.studio.test.integration.ui.CertificateValidationTest)
 Time elapsed: 6.568 sec
testStartTlsCertificateTrustPermanent(org.apache.directory.studio.test.integration.ui.CertificateValidationTest)
 Time elapsed: 6.857 sec
testStartTlsCertificateValidationOK(org.apache.directory.studio.test.integration.ui.CertificateValidationTest)
 Time elapsed: 6.451 sec
testStartTlsCertificateValidationHostnameMismatch(org.apache.directory.studio.test.integration.ui.CertificateValidationTest)
 Time elapsed: 5.939 sec
testLdapsCertificateValidationOK(org.apache.directory.studio.test.integration.ui.CertificateValidationTest)
 Time elapsed: 5.95 sec
testStartTlsCertificateDoNotTrust(org.apache.directory.studio.test.integration.ui.CertificateValidationTest)
 Time elapsed: 7.296 sec
Running org.apache.directory.studio.test.integration.ui.SchemaEditorSearchTest
Tests run: 1, Failures: 0, Errors: 0, Skipped: 0, Time elapsed: 2.016 sec - in org.apache.directory.studio.test.integration.ui.SchemaEditorSearchTest
testSearchForAliases(org.apache.directory.studio.test.integration.ui.SchemaEditorSearchTest)
 Time elapsed: 0.84 sec

Results :

Failed tests: 
  ApacheDSPluginTest.verifyServerNameCollisionInNewWizard:190 expected:<0> but was:<1>
  ApacheDSPluginTest.serverCreationStartCreateConnectionStopAndDeletion:91->createServer:153
expected:<0> but was:<1>

Tests in error: 
  ApacheDSPluginTest.repairAndStartAndStop:411 » Timeout Timeout after: 60000 ms...

Tests run: 226, Failures: 2, Errors: 1, Skipped: 0

[INFO] ------------------------------------------------------------------------
[INFO] Reactor Summary:
[INFO] 
[INFO] Apache Directory Studio Parent ..................... SUCCESS [  1.351 s]
[INFO] Apache Directory Studio Target Platform for Eclipse  SUCCESS [  0.201 s]
[INFO] Apache Directory Studio Plugins .................... SUCCESS [  0.958 s]
[INFO] Apache Directory Studio Common UI .................. SUCCESS [  3.894 s]
[INFO] Apache Directory Studio Common Core ................ SUCCESS [  0.427 s]
[INFO] Apache Directory Studio LDIF Parser ................ SUCCESS [  2.638 s]
[INFO] Apache Directory Studio Connection Core ............ SUCCESS [  1.486 s]
[INFO] Apache Directory Studio Connection UI .............. SUCCESS [  1.293 s]
[INFO] Apache Directory Studio LDAP Browser Core .......... SUCCESS [  4.008 s]
[INFO] Apache Directory Studio LDAP Browser Common ........ SUCCESS [  3.952 s]
[INFO] Apache Directory Studio Value Editors .............. SUCCESS [  2.019 s]
[INFO] Apache Directory Studio ACI Item Editor ............ SUCCESS [  0.773 s]
[INFO] Apache Directory Studio ApacheDS Configuration ..... SUCCESS [  1.106 s]
[INFO] Apache Directory Studio LDIF Editor ................ SUCCESS [  0.697 s]
[INFO] Apache Directory Studio LDAP Browser UI ............ SUCCESS [  1.808 s]
[INFO] Apache Directory Studio LDAP Servers ............... SUCCESS [  0.624 s]
[INFO] Apache Directory Studio ApacheDS LDAP Server Adapter SUCCESS [  6.042 s]
[INFO] Apache Directory Studio RCP ........................ SUCCESS [  0.426 s]
[INFO] Apache Directory Studio Schema Editor .............. SUCCESS [  3.536 s]
[INFO] Apache Directory Studio OpenLDAP Common UI ......... SUCCESS [  1.531 s]
[INFO] Apache Directory Studio OpenLDAP Syncrepl .......... SUCCESS [  1.355 s]
[INFO] Apache Directory Studio OpenLDAP Configuration Editor SUCCESS [  2.939 s]
[INFO] Apache Directory Studio OpenLDAP ACL Configuration Editor SUCCESS [  3.057 s]
[INFO] Apache Directory Studio Template Editor ............ SUCCESS [  2.220 s]
[INFO] Apache Directory Studio Combined Editor ............ SUCCESS [  0.415 s]
[INFO] Apache Directory Studio SLF4J to Eclipse Log Binding SUCCESS [  0.102 s]
[INFO] Apache Directory Studio Help Plugins ............... SUCCESS [  0.022 s]
[INFO] Apache Directory Studio Apache DS Help ............. SUCCESS [  5.596 s]
[INFO] Apache Directory Studio LDAP Browser Help .......... SUCCESS [ 10.447 s]
[INFO] Apache Directory Studio LDIF Editor Help ........... SUCCESS [  1.930 s]
[INFO] Apache Directory Studio RCP Help ................... SUCCESS [  2.124 s]
[INFO] Apache Directory Studio Schema Editor Help ......... SUCCESS [  2.610 s]
[INFO] Apache Directory Studio Feature Plugins ............ SUCCESS [  0.019 s]
[INFO] Apache Directory Studio ApacheDS Feature ........... SUCCESS [  0.195 s]
[INFO] Apache Directory Studio LDAP Browser Feature ....... SUCCESS [  0.162 s]
[INFO] Apache Directory Studio LDIF Editor Feature ........ SUCCESS [  0.118 s]
[INFO] Apache Directory Studio RCP Feature ................ SUCCESS [  0.205 s]
[INFO] Apache Directory Studio Schema Editor Feature ...... SUCCESS [  0.138 s]
[INFO] Apache Directory Studio OpenLDAP Feature ........... SUCCESS [  0.107 s]
[INFO] Apache Directory Studio National Language Support Feature SUCCESS [  0.451 s]
[INFO] Apache Directory Studio Test Plugins ............... SUCCESS [  0.015 s]
[INFO] Apache Directory Studio Core Integration Tests ..... SUCCESS [ 36.262 s]
[INFO] Apache Directory Studio UI Integration Tests ....... FAILURE [10:03 min]
[INFO] Apache Directory Studio P2 Repositories ............ SKIPPED
[INFO] Apache Directory Studio P2 Repository Dependencies . SKIPPED
[INFO] Apache Directory Studio P2 Repository Eclipse ...... SKIPPED
[INFO] Apache Directory Studio Product .................... SKIPPED
[INFO] Apache Directory Studio Installers ................. SKIPPED
[INFO] ------------------------------------------------------------------------
[INFO] BUILD FAILURE
[INFO] ------------------------------------------------------------------------
[INFO] Total time: 17:26 min
[INFO] Finished at: 2017-06-07T14:31:33+00:00
[INFO] Final Memory: 282M/2569M
[INFO] ------------------------------------------------------------------------
[ERROR] Failed to execute goal org.eclipse.tycho:tycho-surefire-plugin:0.24.0:test (default-test)
on project org.apache.directory.studio.test.integration.ui: There are test failures.
[ERROR] 
[ERROR] Please refer to /home/hnelson/studio/tests/test.integration.ui/target/surefire-reports
for the individual test results.
[ERROR] -> [Help 1]
[ERROR] 
[ERROR] To see the full stack trace of the errors, re-run Maven with the -e switch.
[ERROR] Re-run Maven using the -X switch to enable full debug logging.
[ERROR] 
[ERROR] For more information about the errors and possible solutions, please read the following
articles:
[ERROR] [Help 1] http://cwiki.apache.org/confluence/display/MAVEN/MojoFailureException
[ERROR] 
[ERROR] After correcting the problems, you can resume the build with the command
[ERROR]   mvn <goals> -rf :org.apache.directory.studio.test.integration.ui
Build step 'Execute shell' marked build as failure
Recording test results

Mime
View raw message