directory-notifications mailing list archives

Site index · List index
Message view « Date » · « Thread »
Top « Date » · « Thread »
From Apache Jenkins Server <jenk...@builds.apache.org>
Subject Build failed in Jenkins: dir-apacheds-ubuntu-deploy #2001
Date Mon, 12 Jun 2017 12:28:47 GMT
See <https://builds.apache.org/job/dir-apacheds-ubuntu-deploy/2001/display/redirect>

------------------------------------------
[...truncated 27.59 KB...]
[INFO] Copying 1 resource
[INFO] Copying 3 resources
[INFO] 
[INFO] --- maven-compiler-plugin:3.6.1:compile (default-compile) @ apacheds-core-api ---
[INFO] Changes detected - recompiling the module!
[INFO] Compiling 132 source files to <https://builds.apache.org/job/dir-apacheds-ubuntu-deploy/ws/trunk/core-api/target/classes>
[INFO] <https://builds.apache.org/job/dir-apacheds-ubuntu-deploy/ws/trunk/core-api/src/main/java/org/apache/directory/server/core/api/LdapCoreSessionConnection.java>:
<https://builds.apache.org/job/dir-apacheds-ubuntu-deploy/ws/trunk/core-api/src/main/java/org/apache/directory/server/core/api/LdapCoreSessionConnection.java>
uses or overrides a deprecated API.
[INFO] <https://builds.apache.org/job/dir-apacheds-ubuntu-deploy/ws/trunk/core-api/src/main/java/org/apache/directory/server/core/api/LdapCoreSessionConnection.java>:
Recompile with -Xlint:deprecation for details.
[INFO] <https://builds.apache.org/job/dir-apacheds-ubuntu-deploy/ws/trunk/core-api/src/main/java/org/apache/directory/server/core/api/schema/registries/synchronizers/AbstractRegistrySynchronizer.java>:
Some input files use unchecked or unsafe operations.
[INFO] <https://builds.apache.org/job/dir-apacheds-ubuntu-deploy/ws/trunk/core-api/src/main/java/org/apache/directory/server/core/api/schema/registries/synchronizers/AbstractRegistrySynchronizer.java>:
Recompile with -Xlint:unchecked for details.
[INFO] 
[INFO] --- maven-resources-plugin:3.0.2:testResources (default-testResources) @ apacheds-core-api
---
[INFO] Using 'UTF-8' encoding to copy filtered resources.
[INFO] Copying 1 resource
[INFO] Copying 3 resources
[INFO] 
[INFO] --- maven-compiler-plugin:3.6.1:testCompile (default-testCompile) @ apacheds-core-api
---
[INFO] Changes detected - recompiling the module!
[INFO] Compiling 12 source files to <https://builds.apache.org/job/dir-apacheds-ubuntu-deploy/ws/trunk/core-api/target/test-classes>
[INFO] <https://builds.apache.org/job/dir-apacheds-ubuntu-deploy/ws/trunk/core-api/src/test/java/org/apache/directory/server/core/api/MockDirectoryService.java>:
<https://builds.apache.org/job/dir-apacheds-ubuntu-deploy/ws/trunk/core-api/src/test/java/org/apache/directory/server/core/api/MockDirectoryService.java>
uses unchecked or unsafe operations.
[INFO] <https://builds.apache.org/job/dir-apacheds-ubuntu-deploy/ws/trunk/core-api/src/test/java/org/apache/directory/server/core/api/MockDirectoryService.java>:
Recompile with -Xlint:unchecked for details.
[INFO] 
[INFO] --- maven-surefire-plugin:2.19.1:test (default-test) @ apacheds-core-api ---

-------------------------------------------------------
 T E S T S
-------------------------------------------------------
Running org.apache.directory.server.core.api.entry.ClonedServerEntryTest
Tests run: 8, Failures: 0, Errors: 0, Skipped: 0, Time elapsed: 0.162 sec - in org.apache.directory.server.core.api.entry.ClonedServerEntryTest
Running org.apache.directory.server.core.api.entry.SchemaAwareEntryTest
Tests run: 81, Failures: 0, Errors: 0, Skipped: 0, Time elapsed: 1.037 sec - in org.apache.directory.server.core.api.entry.SchemaAwareEntryTest
Running org.apache.directory.server.core.api.entry.SchemaAwareModificationTest
Tests run: 7, Failures: 0, Errors: 0, Skipped: 0, Time elapsed: 0.441 sec - in org.apache.directory.server.core.api.entry.SchemaAwareModificationTest
Running org.apache.directory.server.core.api.normalization.FilterNormalizingVisitorTest
Tests run: 1, Failures: 0, Errors: 0, Skipped: 0, Time elapsed: 0.255 sec - in org.apache.directory.server.core.api.normalization.FilterNormalizingVisitorTest
Running org.apache.directory.server.core.api.sp.StoredProcUtilsTest
Tests run: 1, Failures: 0, Errors: 0, Skipped: 0, Time elapsed: 0.001 sec - in org.apache.directory.server.core.api.sp.StoredProcUtilsTest
Running org.apache.directory.server.core.api.changelog.TagTest
Tests run: 8, Failures: 0, Errors: 0, Skipped: 0, Time elapsed: 0.007 sec - in org.apache.directory.server.core.api.changelog.TagTest

Results :

Tests run: 106, Failures: 0, Errors: 0, Skipped: 0

[JENKINS] Recording test results
[INFO] 
[INFO] --- maven-bundle-plugin:3.3.0:bundle (default-bundle) @ apacheds-core-api ---
[INFO] 
[INFO] --- maven-site-plugin:3.6:attach-descriptor (attach-descriptor) @ apacheds-core-api
---
[INFO] Skipping because packaging 'bundle' is not pom.
[INFO] 
[INFO] --- maven-jar-plugin:3.0.2:test-jar (attach-tests) @ apacheds-core-api ---
[INFO] Building jar: <https://builds.apache.org/job/dir-apacheds-ubuntu-deploy/ws/trunk/core-api/target/apacheds-core-api-2.0.0-M25-SNAPSHOT-tests.jar>
[INFO] 
[INFO] --- tools-maven-plugin:1.4:verify-legal-files (verify-legal-files) @ apacheds-core-api
---
[INFO] Checking legal files in: apacheds-core-api-2.0.0-M25-SNAPSHOT.jar
[INFO] Checking legal files in: apacheds-core-api-2.0.0-M25-SNAPSHOT-tests.jar
[INFO] 
[INFO] >>> maven-source-plugin:3.0.1:jar (attach-sources) > generate-sources @
apacheds-core-api >>>
[INFO] 
[INFO] --- maven-checkstyle-plugin:2.17:check (validate) @ apacheds-core-api ---
[WARNING] Failed to getClass for org.apache.maven.plugins.source.SourceJarMojo
[INFO] 
[INFO] <<< maven-source-plugin:3.0.1:jar (attach-sources) < generate-sources @
apacheds-core-api <<<
[INFO] 
[INFO] --- maven-source-plugin:3.0.1:jar (attach-sources) @ apacheds-core-api ---
[INFO] Building jar: <https://builds.apache.org/job/dir-apacheds-ubuntu-deploy/ws/trunk/core-api/target/apacheds-core-api-2.0.0-M25-SNAPSHOT-sources.jar>
[INFO] 
[INFO] --- maven-install-plugin:2.5.2:install (default-install) @ apacheds-core-api ---
[INFO] Installing <https://builds.apache.org/job/dir-apacheds-ubuntu-deploy/ws/trunk/core-api/target/apacheds-core-api-2.0.0-M25-SNAPSHOT.jar>
to /home/jenkins/jenkins-slave/maven-repositories/1/org/apache/directory/server/apacheds-core-api/2.0.0-M25-SNAPSHOT/apacheds-core-api-2.0.0-M25-SNAPSHOT.jar
[INFO] Installing <https://builds.apache.org/job/dir-apacheds-ubuntu-deploy/ws/trunk/core-api/pom.xml>
to /home/jenkins/jenkins-slave/maven-repositories/1/org/apache/directory/server/apacheds-core-api/2.0.0-M25-SNAPSHOT/apacheds-core-api-2.0.0-M25-SNAPSHOT.pom
[INFO] Installing <https://builds.apache.org/job/dir-apacheds-ubuntu-deploy/ws/trunk/core-api/target/apacheds-core-api-2.0.0-M25-SNAPSHOT-tests.jar>
to /home/jenkins/jenkins-slave/maven-repositories/1/org/apache/directory/server/apacheds-core-api/2.0.0-M25-SNAPSHOT/apacheds-core-api-2.0.0-M25-SNAPSHOT-tests.jar
[INFO] Installing <https://builds.apache.org/job/dir-apacheds-ubuntu-deploy/ws/trunk/core-api/target/apacheds-core-api-2.0.0-M25-SNAPSHOT-sources.jar>
to /home/jenkins/jenkins-slave/maven-repositories/1/org/apache/directory/server/apacheds-core-api/2.0.0-M25-SNAPSHOT/apacheds-core-api-2.0.0-M25-SNAPSHOT-sources.jar
[INFO] 
[INFO] --- maven-bundle-plugin:3.3.0:install (default-install) @ apacheds-core-api ---
[INFO] Installing org/apache/directory/server/apacheds-core-api/2.0.0-M25-SNAPSHOT/apacheds-core-api-2.0.0-M25-SNAPSHOT.jar
[INFO] Writing OBR metadata
[INFO] 
[INFO] --- maven-deploy-plugin:2.8.2:deploy (default-deploy) @ apacheds-core-api ---
[INFO] Downloading: https://repository.apache.org/content/repositories/snapshots/org/apache/directory/server/apacheds-core-api/2.0.0-M25-SNAPSHOT/maven-metadata.xml
[INFO] Downloaded: https://repository.apache.org/content/repositories/snapshots/org/apache/directory/server/apacheds-core-api/2.0.0-M25-SNAPSHOT/maven-metadata.xml
(2 KB at 2.2 KB/sec)
[INFO] Uploading: https://repository.apache.org/content/repositories/snapshots/org/apache/directory/server/apacheds-core-api/2.0.0-M25-SNAPSHOT/apacheds-core-api-2.0.0-M25-20170612.122820-4.jar
[INFO] Uploaded: https://repository.apache.org/content/repositories/snapshots/org/apache/directory/server/apacheds-core-api/2.0.0-M25-SNAPSHOT/apacheds-core-api-2.0.0-M25-20170612.122820-4.jar
(249 KB at 217.8 KB/sec)
[INFO] Uploading: https://repository.apache.org/content/repositories/snapshots/org/apache/directory/server/apacheds-core-api/2.0.0-M25-SNAPSHOT/apacheds-core-api-2.0.0-M25-20170612.122820-4.pom
[INFO] Uploaded: https://repository.apache.org/content/repositories/snapshots/org/apache/directory/server/apacheds-core-api/2.0.0-M25-SNAPSHOT/apacheds-core-api-2.0.0-M25-20170612.122820-4.pom
(5 KB at 6.0 KB/sec)
[INFO] Downloading: https://repository.apache.org/content/repositories/snapshots/org/apache/directory/server/apacheds-core-api/maven-metadata.xml
[INFO] Downloaded: https://repository.apache.org/content/repositories/snapshots/org/apache/directory/server/apacheds-core-api/maven-metadata.xml
(408 B at 0.8 KB/sec)
[INFO] Uploading: https://repository.apache.org/content/repositories/snapshots/org/apache/directory/server/apacheds-core-api/2.0.0-M25-SNAPSHOT/maven-metadata.xml
[INFO] Uploaded: https://repository.apache.org/content/repositories/snapshots/org/apache/directory/server/apacheds-core-api/2.0.0-M25-SNAPSHOT/maven-metadata.xml
(2 KB at 1.5 KB/sec)
[INFO] Uploading: https://repository.apache.org/content/repositories/snapshots/org/apache/directory/server/apacheds-core-api/maven-metadata.xml
[INFO] Uploaded: https://repository.apache.org/content/repositories/snapshots/org/apache/directory/server/apacheds-core-api/maven-metadata.xml
(408 B at 0.5 KB/sec)
[INFO] Uploading: https://repository.apache.org/content/repositories/snapshots/org/apache/directory/server/apacheds-core-api/2.0.0-M25-SNAPSHOT/apacheds-core-api-2.0.0-M25-20170612.122820-4-tests.jar
[INFO] Uploaded: https://repository.apache.org/content/repositories/snapshots/org/apache/directory/server/apacheds-core-api/2.0.0-M25-SNAPSHOT/apacheds-core-api-2.0.0-M25-20170612.122820-4-tests.jar
(60 KB at 61.3 KB/sec)
[INFO] Uploading: https://repository.apache.org/content/repositories/snapshots/org/apache/directory/server/apacheds-core-api/2.0.0-M25-SNAPSHOT/maven-metadata.xml
[INFO] Uploaded: https://repository.apache.org/content/repositories/snapshots/org/apache/directory/server/apacheds-core-api/2.0.0-M25-SNAPSHOT/maven-metadata.xml
(2 KB at 1.5 KB/sec)
[INFO] Uploading: https://repository.apache.org/content/repositories/snapshots/org/apache/directory/server/apacheds-core-api/2.0.0-M25-SNAPSHOT/apacheds-core-api-2.0.0-M25-20170612.122820-4-sources.jar
[INFO] Uploaded: https://repository.apache.org/content/repositories/snapshots/org/apache/directory/server/apacheds-core-api/2.0.0-M25-SNAPSHOT/apacheds-core-api-2.0.0-M25-20170612.122820-4-sources.jar
(258 KB at 225.2 KB/sec)
[INFO] Uploading: https://repository.apache.org/content/repositories/snapshots/org/apache/directory/server/apacheds-core-api/2.0.0-M25-SNAPSHOT/maven-metadata.xml
[INFO] Uploaded: https://repository.apache.org/content/repositories/snapshots/org/apache/directory/server/apacheds-core-api/2.0.0-M25-SNAPSHOT/maven-metadata.xml
(2 KB at 1.5 KB/sec)
[INFO] 
[INFO] --- maven-bundle-plugin:3.3.0:deploy (default-deploy) @ apacheds-core-api ---
[INFO] Remote OBR update disabled (enable with -DremoteOBR)
[JENKINS] Archiving disabled
[INFO]                                                                         
[INFO] ------------------------------------------------------------------------
[INFO] Building ApacheDS Core Shared 2.0.0-M25-SNAPSHOT
[INFO] ------------------------------------------------------------------------
[INFO] 
[INFO] --- maven-clean-plugin:3.0.0:clean (default-clean) @ apacheds-core-shared ---
[INFO] Deleting <https://builds.apache.org/job/dir-apacheds-ubuntu-deploy/ws/trunk/core-shared/target>
[INFO] 
[INFO] --- maven-checkstyle-plugin:2.17:check (validate) @ apacheds-core-shared ---
[INFO] There are 2 errors reported by Checkstyle 7.8 with directory-checks.xml ruleset.
[ERROR] src/main/java/org/apache/directory/server/core/shared/DefaultCoreSession.java:[1346,23]
(whitespace) ParenPad: '(' is not followed by whitespace.
[ERROR] src/main/java/org/apache/directory/server/core/shared/DefaultCoreSession.java:[1346,142]
(whitespace) ParenPad: ')' is not preceded with whitespace.
[JENKINS] Archiving disabled
[JENKINS] Archiving disabled
[JENKINS] Archiving disabled
[JENKINS] Archiving disabled
[JENKINS] Archiving disabled
[JENKINS] Archiving disabled
[JENKINS] Archiving disabled
[JENKINS] Archiving disabled
[JENKINS] Archiving disabled
[JENKINS] Archiving disabled
[JENKINS] Archiving disabled
[JENKINS] Archiving disabled
[JENKINS] Archiving disabled
[JENKINS] Archiving disabled
[JENKINS] Archiving disabled
[JENKINS] Archiving disabled
[JENKINS] Archiving disabled
[JENKINS] Archiving disabled
[JENKINS] Archiving disabled
[JENKINS] Archiving disabled
[JENKINS] Archiving disabled
[JENKINS] Archiving disabled
[JENKINS] Archiving disabled
[JENKINS] Archiving disabled
[JENKINS] Archiving disabled
[JENKINS] Archiving disabled
[JENKINS] Archiving disabled
[JENKINS] Archiving disabled
[JENKINS] Archiving disabled
[JENKINS] Archiving disabled
[JENKINS] Archiving disabled
[JENKINS] Archiving disabled
[JENKINS] Archiving disabled
[JENKINS] Archiving disabled
[JENKINS] Archiving disabled
[JENKINS] Archiving disabled
[JENKINS] Archiving disabled
[JENKINS] Archiving disabled
[JENKINS] Archiving disabled
[JENKINS] Archiving disabled
[JENKINS] Archiving disabled
[JENKINS] Archiving disabled
[JENKINS] Archiving disabled
[JENKINS] Archiving disabled
[JENKINS] Archiving disabled
[JENKINS] Archiving disabled
[JENKINS] Archiving disabled
[JENKINS] Archiving disabled
[JENKINS] Archiving disabled
[JENKINS] Archiving disabled
[JENKINS] Archiving disabled
[JENKINS] Archiving disabled
[JENKINS] Archiving disabled
[JENKINS] Archiving disabled
[JENKINS] Archiving disabled
[JENKINS] Archiving disabled
[JENKINS] Archiving disabled[INFO] ------------------------------------------------------------------------
[INFO] Reactor Summary:
[INFO] 
[INFO] ApacheDS ........................................... SUCCESS [ 10.202 s]
[INFO] ApacheDS I18n ...................................... SUCCESS [  9.561 s]
[INFO] ApacheDS Core Constants ............................ SUCCESS [  6.972 s]
[INFO] ApacheDS Core API .................................. SUCCESS [ 29.938 s]
[INFO] ApacheDS Core Shared ............................... FAILURE [  0.641 s]
[INFO] ApacheDS Interceptors .............................. SKIPPED
[INFO] ApacheDS AdministrativePoint Interceptor ........... SKIPPED
[INFO] ApacheDS Authentication Interceptor ................ SKIPPED
[INFO] ApacheDS Interceptor to increment numeric attributes SKIPPED
[INFO] ApacheDS Authorization Interceptor ................. SKIPPED
[INFO] ApacheDS ChangeLog Interceptor ..................... SKIPPED
[INFO] ApacheDS Collective Attribute Interceptor .......... SKIPPED
[INFO] ApacheDS Event Interceptor ......................... SKIPPED
[INFO] ApacheDS Exception Interceptor ..................... SKIPPED
[INFO] ApacheDS Journal Interceptor ....................... SKIPPED
[INFO] ApacheDS Normalization Interceptor ................. SKIPPED
[INFO] ApacheDS Operational Attribute Interceptor ......... SKIPPED
[INFO] ApacheDS Referral Interceptor ...................... SKIPPED
[INFO] ApacheDS Schema Interceptor ........................ SKIPPED
[INFO] ApacheDS Subtree Interceptor ....................... SKIPPED
[INFO] ApacheDS Triggers Interceptor ...................... SKIPPED
[INFO] ApacheDS Core ...................................... SKIPPED
[INFO] ApacheDS Core AVL .................................. SKIPPED
[INFO] ApacheDS Generalized (X) DBM Partition ............. SKIPPED
[INFO] ApacheDS LDIF Partition ............................ SKIPPED
[INFO] ApacheDS JDBM Partition ............................ SKIPPED
[INFO] ApacheDS Mavibot Partition ......................... SKIPPED
[INFO] ApacheDS Core Annotations .......................... SKIPPED
[INFO] ApacheDS Core JNDI ................................. SKIPPED
[INFO] ApacheDS Protocol Kerberos Codec ................... SKIPPED
[INFO] ApacheDS Interceptors for Kerberos ................. SKIPPED
[INFO] ApacheDS Protocol Dhcp ............................. SKIPPED
[INFO] ApacheDS Protocol Shared ........................... SKIPPED
[INFO] ApacheDS Protocol Dns .............................. SKIPPED
[INFO] ApacheDS Protocol Kerberos ......................... SKIPPED
[INFO] ApacheDS Protocol Ldap ............................. SKIPPED
[INFO] ApacheDS Protocol Ntp .............................. SKIPPED
[INFO] Apacheds Server Annotations ........................ SKIPPED
[INFO] ApacheDS Server Config ............................. SKIPPED
[INFO] ApacheDS Server JNDI ............................... SKIPPED
[INFO] ApacheDS Test Framework ............................ SKIPPED
[INFO] ApacheDS All ....................................... SKIPPED
[INFO] ApacheDS Logger Interceptor ........................ SKIPPED
[INFO] ApacheDS Password Hashing Interceptor .............. SKIPPED
[INFO] ApacheDS Core Integration .......................... SKIPPED
[INFO] ApacheDS Protocol Kerberos Test .................... SKIPPED
[INFO] ApacheDS Server Integration ........................ SKIPPED
[INFO] ApacheDS DirectoryService-WebApp bridge ............ SKIPPED
[INFO] ApacheDS Jetty HTTP Server Integration ............. SKIPPED
[INFO] ApacheDS Service Builder ........................... SKIPPED
[INFO] Apache Directory LDAP Client API test .............. SKIPPED
[INFO] kerberos-client .................................... SKIPPED
[INFO] ApacheDS Service ................................... SKIPPED
[INFO] ApacheDS Wrapper ................................... SKIPPED
[INFO] ApacheDS Installers Maven Plugin ................... SKIPPED
[INFO] ApacheDS Installers ................................ SKIPPED
[INFO] ------------------------------------------------------------------------
[INFO] BUILD FAILURE
[INFO] ------------------------------------------------------------------------
[INFO] Total time: 01:10 min
[INFO] Finished at: 2017-06-12T12:28:37+00:00

[INFO] Final Memory: 70M/435M
[INFO] ------------------------------------------------------------------------
[ERROR] Failed to execute goal org.apache.maven.plugins:maven-checkstyle-plugin:2.17:check
(validate) on project apacheds-core-shared: You have 2 Checkstyle violations. -> [Help
1]
[ERROR] 
[ERROR] To see the full stack trace of the errors, re-run Maven with the -e switch.
[ERROR] Re-run Maven using the -X switch to enable full debug logging.
[ERROR] 
[ERROR] For more information about the errors and possible solutions, please read the following
articles:
[ERROR] [Help 1] http://cwiki.apache.org/confluence/display/MAVEN/MojoFailureException
[ERROR] 
[ERROR] After correcting the problems, you can resume the build with the command
[ERROR]   mvn <goals> -rf :apacheds-core-shared
channel stopped

Mime
View raw message