directory-notifications mailing list archives

Site index · List index
Message view « Date » · « Thread »
Top « Date » · « Thread »
From Apache Jenkins Server <jenk...@builds.apache.org>
Subject Build failed in Jenkins: dir-kerby-openjdk #197
Date Mon, 19 Jun 2017 12:42:14 GMT
See <https://builds.apache.org/job/dir-kerby-openjdk/197/display/redirect?page=changes>

Changes:

[coheigea] Change the TokenCache to write to a specified file name instead of a

------------------------------------------
[...truncated 449.31 KB...]
[JENKINS] Archiving disabled
[INFO]                                                                         
[INFO] ------------------------------------------------------------------------
[INFO] Building Token provider 1.0.1-SNAPSHOT
[INFO] ------------------------------------------------------------------------
[INFO] 
[INFO] --- maven-clean-plugin:3.0.0:clean (default-clean) @ token-provider ---
[INFO] Deleting <https://builds.apache.org/job/dir-kerby-openjdk/ws/kerby-provider/token-provider/target>
[INFO] 
[INFO] >>> maven-pmd-plugin:3.7:check (validate) > :pmd @ token-provider >>>
[INFO] 
[INFO] --- maven-pmd-plugin:3.7:pmd (pmd) @ token-provider ---
[INFO] 
[INFO] <<< maven-pmd-plugin:3.7:check (validate) < :pmd @ token-provider <<<
[INFO] 
[INFO] --- maven-pmd-plugin:3.7:check (validate) @ token-provider ---
[INFO] 
[INFO] 
[INFO] --- maven-checkstyle-plugin:2.17:check (validate) @ token-provider ---
[INFO] 
[INFO] --- maven-remote-resources-plugin:1.5:process (process-resource-bundles) @ token-provider
---
[INFO] 
[INFO] --- maven-resources-plugin:2.7:resources (default-resources) @ token-provider ---
[INFO] Using 'UTF-8' encoding to copy filtered resources.
[INFO] skip non existing resourceDirectory <https://builds.apache.org/job/dir-kerby-openjdk/ws/kerby-provider/token-provider/src/main/resources>
[INFO] Copying 3 resources
[INFO] 
[INFO] --- maven-compiler-plugin:3.6.1:compile (default-compile) @ token-provider ---
[INFO] Changes detected - recompiling the module!
[INFO] Compiling 5 source files to <https://builds.apache.org/job/dir-kerby-openjdk/ws/kerby-provider/token-provider/target/classes>
[INFO] 
[INFO] --- maven-resources-plugin:2.7:testResources (default-testResources) @ token-provider
---
[INFO] Using 'UTF-8' encoding to copy filtered resources.
[INFO] skip non existing resourceDirectory <https://builds.apache.org/job/dir-kerby-openjdk/ws/kerby-provider/token-provider/src/test/resources>
[INFO] Copying 3 resources
[INFO] 
[INFO] --- maven-compiler-plugin:3.6.1:testCompile (default-testCompile) @ token-provider
---
[INFO] Changes detected - recompiling the module!
[INFO] Compiling 1 source file to <https://builds.apache.org/job/dir-kerby-openjdk/ws/kerby-provider/token-provider/target/test-classes>
[INFO] 
[INFO] --- maven-surefire-plugin:2.20:test (default-test) @ token-provider ---
[INFO] 
[INFO] -------------------------------------------------------
[INFO]  T E S T S
[INFO] -------------------------------------------------------
[INFO] Running org.apache.kerby.kerberos.provider.token.TokenTest
[WARNING] Tests run: 11, Failures: 0, Errors: 0, Skipped: 1, Time elapsed: 1.587 s - in org.apache.kerby.kerberos.provider.token.TokenTest
[INFO] 
[INFO] Results:
[INFO] 
[WARNING] Tests run: 11, Failures: 0, Errors: 0, Skipped: 1
[INFO] 
[JENKINS] Recording test results
[INFO] 
[INFO] --- maven-surefire-plugin:2.20:test (default) @ token-provider ---
[INFO] Skipping execution of surefire because it has already been run for this configuration
[JENKINS] Recording test results
[INFO] 
[INFO] --- maven-jar-plugin:3.0.0:jar (default-jar) @ token-provider ---
[INFO] Building jar: <https://builds.apache.org/job/dir-kerby-openjdk/ws/kerby-provider/token-provider/target/token-provider-1.0.1-SNAPSHOT.jar>
[INFO] 
[INFO] --- maven-site-plugin:3.5.1:attach-descriptor (attach-descriptor) @ token-provider
---
[INFO] 
[INFO] >>> maven-source-plugin:3.0.0:jar (attach-sources) > generate-sources @
token-provider >>>
[INFO] 
[INFO] >>> maven-pmd-plugin:3.7:check (validate) > :pmd @ token-provider >>>
[INFO] 
[INFO] --- maven-pmd-plugin:3.7:pmd (pmd) @ token-provider ---
[INFO] 
[INFO] <<< maven-pmd-plugin:3.7:check (validate) < :pmd @ token-provider <<<
[INFO] 
[INFO] --- maven-pmd-plugin:3.7:check (validate) @ token-provider ---
[INFO] 
[INFO] 
[INFO] --- maven-checkstyle-plugin:2.17:check (validate) @ token-provider ---
[WARNING] Failed to getClass for org.apache.maven.plugins.source.SourceJarMojo
[INFO] 
[INFO] <<< maven-source-plugin:3.0.0:jar (attach-sources) < generate-sources @
token-provider <<<
[INFO] 
[INFO] --- maven-source-plugin:3.0.0:jar (attach-sources) @ token-provider ---
[INFO] Building jar: <https://builds.apache.org/job/dir-kerby-openjdk/ws/kerby-provider/token-provider/target/token-provider-1.0.1-SNAPSHOT-sources.jar>
[INFO] 
[INFO] --- maven-install-plugin:2.5.2:install (default-install) @ token-provider ---
[INFO] Installing <https://builds.apache.org/job/dir-kerby-openjdk/ws/kerby-provider/token-provider/target/token-provider-1.0.1-SNAPSHOT.jar>
to /home/jenkins/jenkins-slave/maven-repositories/0/org/apache/kerby/token-provider/1.0.1-SNAPSHOT/token-provider-1.0.1-SNAPSHOT.jar
[INFO] Installing <https://builds.apache.org/job/dir-kerby-openjdk/ws/kerby-provider/token-provider/pom.xml>
to /home/jenkins/jenkins-slave/maven-repositories/0/org/apache/kerby/token-provider/1.0.1-SNAPSHOT/token-provider-1.0.1-SNAPSHOT.pom
[INFO] Installing <https://builds.apache.org/job/dir-kerby-openjdk/ws/kerby-provider/token-provider/target/token-provider-1.0.1-SNAPSHOT-sources.jar>
to /home/jenkins/jenkins-slave/maven-repositories/0/org/apache/kerby/token-provider/1.0.1-SNAPSHOT/token-provider-1.0.1-SNAPSHOT-sources.jar
[INFO] 
[INFO] --- maven-deploy-plugin:2.8.2:deploy (default-deploy) @ token-provider ---
[INFO] Downloading: https://repository.apache.org/content/repositories/snapshots/org/apache/kerby/token-provider/1.0.1-SNAPSHOT/maven-metadata.xml
[INFO] Downloaded: https://repository.apache.org/content/repositories/snapshots/org/apache/kerby/token-provider/1.0.1-SNAPSHOT/maven-metadata.xml
(998 B at 1.7 KB/sec)
[INFO] Uploading: https://repository.apache.org/content/repositories/snapshots/org/apache/kerby/token-provider/1.0.1-SNAPSHOT/token-provider-1.0.1-20170619.124118-74.jar
[INFO] Uploaded: https://repository.apache.org/content/repositories/snapshots/org/apache/kerby/token-provider/1.0.1-SNAPSHOT/token-provider-1.0.1-20170619.124118-74.jar
(19 KB at 20.0 KB/sec)
[INFO] Uploading: https://repository.apache.org/content/repositories/snapshots/org/apache/kerby/token-provider/1.0.1-SNAPSHOT/token-provider-1.0.1-20170619.124118-74.pom
[INFO] Uploaded: https://repository.apache.org/content/repositories/snapshots/org/apache/kerby/token-provider/1.0.1-SNAPSHOT/token-provider-1.0.1-20170619.124118-74.pom
(2 KB at 1.8 KB/sec)
[INFO] Downloading: https://repository.apache.org/content/repositories/snapshots/org/apache/kerby/token-provider/maven-metadata.xml
[INFO] Downloaded: https://repository.apache.org/content/repositories/snapshots/org/apache/kerby/token-provider/maven-metadata.xml
(394 B at 0.7 KB/sec)
[INFO] Uploading: https://repository.apache.org/content/repositories/snapshots/org/apache/kerby/token-provider/1.0.1-SNAPSHOT/maven-metadata.xml
[INFO] Uploaded: https://repository.apache.org/content/repositories/snapshots/org/apache/kerby/token-provider/1.0.1-SNAPSHOT/maven-metadata.xml
(998 B at 1.1 KB/sec)
[INFO] Uploading: https://repository.apache.org/content/repositories/snapshots/org/apache/kerby/token-provider/maven-metadata.xml
[INFO] Uploaded: https://repository.apache.org/content/repositories/snapshots/org/apache/kerby/token-provider/maven-metadata.xml
(394 B at 0.5 KB/sec)
[INFO] Uploading: https://repository.apache.org/content/repositories/snapshots/org/apache/kerby/token-provider/1.0.1-SNAPSHOT/token-provider-1.0.1-20170619.124118-74-sources.jar
[INFO] Uploaded: https://repository.apache.org/content/repositories/snapshots/org/apache/kerby/token-provider/1.0.1-SNAPSHOT/token-provider-1.0.1-20170619.124118-74-sources.jar
(16 KB at 16.3 KB/sec)
[INFO] Uploading: https://repository.apache.org/content/repositories/snapshots/org/apache/kerby/token-provider/1.0.1-SNAPSHOT/maven-metadata.xml
[INFO] Uploaded: https://repository.apache.org/content/repositories/snapshots/org/apache/kerby/token-provider/1.0.1-SNAPSHOT/maven-metadata.xml
(998 B at 1.2 KB/sec)
[JENKINS] Archiving disabled
[INFO]                                                                         
[INFO] ------------------------------------------------------------------------
[INFO] Building Kerb Integration Test 1.0.1-SNAPSHOT
[INFO] ------------------------------------------------------------------------
[INFO] 
[INFO] --- maven-clean-plugin:3.0.0:clean (default-clean) @ integration-test ---
[INFO] Deleting <https://builds.apache.org/job/dir-kerby-openjdk/ws/kerby-kerb/integration-test/target>
[INFO] 
[INFO] >>> maven-pmd-plugin:3.7:check (validate) > :pmd @ integration-test >>>
[INFO] 
[INFO] --- maven-pmd-plugin:3.7:pmd (pmd) @ integration-test ---
[INFO] 
[INFO] <<< maven-pmd-plugin:3.7:check (validate) < :pmd @ integration-test <<<
[INFO] 
[INFO] --- maven-pmd-plugin:3.7:check (validate) @ integration-test ---
[INFO] 
[INFO] 
[INFO] --- maven-checkstyle-plugin:2.17:check (validate) @ integration-test ---
[INFO] 
[INFO] --- maven-remote-resources-plugin:1.5:process (process-resource-bundles) @ integration-test
---
[INFO] 
[INFO] --- maven-resources-plugin:2.7:resources (default-resources) @ integration-test ---
[INFO] Using 'UTF-8' encoding to copy filtered resources.
[INFO] skip non existing resourceDirectory <https://builds.apache.org/job/dir-kerby-openjdk/ws/kerby-kerb/integration-test/src/main/resources>
[INFO] Copying 3 resources
[INFO] 
[INFO] --- maven-compiler-plugin:3.6.1:compile (default-compile) @ integration-test ---
[INFO] Changes detected - recompiling the module!
[INFO] Compiling 11 source files to <https://builds.apache.org/job/dir-kerby-openjdk/ws/kerby-kerb/integration-test/target/classes>
[INFO] -------------------------------------------------------------
[ERROR] COMPILATION ERROR : 
[INFO] -------------------------------------------------------------
[ERROR] <https://builds.apache.org/job/dir-kerby-openjdk/ws/kerby-kerb/integration-test/src/main/java/org/apache/kerby/kerberos/kerb/integration/test/jaas/TokenCache.java>:[68,39]
method readAllLines in class java.nio.file.Files cannot be applied to given types;
  required: java.nio.file.Path,java.nio.charset.Charset
  found: java.nio.file.Path
  reason: actual and formal argument lists differ in length
[INFO] 1 error
[INFO] -------------------------------------------------------------
[JENKINS] Archiving disabled
[JENKINS] Archiving disabled
[JENKINS] Archiving disabled
[JENKINS] Archiving disabled
[JENKINS] Archiving disabled
[JENKINS] Archiving disabled
[JENKINS] Archiving disabled
[JENKINS] Archiving disabled
[JENKINS] Archiving disabled
[JENKINS] Archiving disabled
[JENKINS] Archiving disabled
[JENKINS] Archiving disabled
[JENKINS] Archiving disabled
[JENKINS] Archiving disabled
[JENKINS] Archiving disabled
[JENKINS] Archiving disabled
[JENKINS] Archiving disabled
[JENKINS] Archiving disabled
[JENKINS] Archiving disabled
[JENKINS] Archiving disabled
[JENKINS] Archiving disabled
[JENKINS] Archiving disabled
[JENKINS] Archiving disabled
[JENKINS] Archiving disabled
[JENKINS] Archiving disabled
[JENKINS] Archiving disabled
[JENKINS] Archiving disabled
[JENKINS] Archiving disabled
[JENKINS] Archiving disabled
[JENKINS] Archiving disabled
[JENKINS] Archiving disabled
[JENKINS] Archiving disabled
[JENKINS] Archiving disabled
[JENKINS] Archiving disabled
[JENKINS] Archiving disabled
[JENKINS] Archiving disabled
[JENKINS] Archiving disabled
[JENKINS] Archiving disabled
[JENKINS] Archiving disabled
[JENKINS] Archiving disabled[INFO] ------------------------------------------------------------------------
[INFO] Reactor Summary:
[INFO] 
[INFO] Apache Kerby Project ............................... SUCCESS [ 30.990 s]
[INFO] Kerby-common Project ............................... SUCCESS [ 11.224 s]
[INFO] Kerby ASN1 Project ................................. SUCCESS [ 51.921 s]
[INFO] Kerby Config ....................................... SUCCESS [ 20.832 s]
[INFO] Kerby Util ......................................... SUCCESS [ 27.470 s]
[INFO] Kerby XDR Project .................................. SUCCESS [ 22.583 s]
[INFO] Kerby PKIX Project ................................. SUCCESS [ 25.535 s]
[INFO] Kerby-kerb Project ................................. SUCCESS [ 20.399 s]
[INFO] Kerby-kerb core .................................... SUCCESS [ 31.939 s]
[INFO] Kerby-kerb Crypto .................................. SUCCESS [ 34.720 s]
[INFO] Kerby-kerb Common .................................. SUCCESS [ 14.698 s]
[INFO] Kerby-kerb Util .................................... SUCCESS [ 25.192 s]
[INFO] Kerby-kerb Identity ................................ SUCCESS [ 17.272 s]
[INFO] Kerby-kerb Identity Test ........................... SUCCESS [ 14.882 s]
[INFO] Kerby-kerb Client .................................. SUCCESS [ 14.416 s]
[INFO] Kerby-kerb Server .................................. SUCCESS [ 14.250 s]
[INFO] Kerby-kerb Admin ................................... SUCCESS [ 16.123 s]
[INFO] Kerb Simple Kdc .................................... SUCCESS [ 12.953 s]
[INFO] Kerby-kerb server all .............................. SUCCESS [ 14.639 s]
[INFO] Kerby KDC Server ................................... SUCCESS [ 15.399 s]
[INFO] Kerb Kdc Test ...................................... SUCCESS [ 50.961 s]
[INFO] Kerby providers .................................... SUCCESS [ 10.227 s]
[INFO] Token provider ..................................... SUCCESS [ 16.878 s]
[INFO] Kerb Integration Test .............................. FAILURE [  4.418 s]
[INFO] Kerby-kerb Admin Server ............................ SKIPPED
[INFO] Kerby-kerb client api all .......................... SKIPPED
[INFO] Kdc Tool Project ................................... SKIPPED
[INFO] Client Tool ........................................ SKIPPED
[INFO] KDC Tool ........................................... SKIPPED
[INFO] Kerby Backend ...................................... SKIPPED
[INFO] Json identity backend .............................. SKIPPED
[INFO] Kerby Kdc Test ..................................... SKIPPED
[INFO] Ldap identity backend .............................. SKIPPED
[INFO] Mavibot based backend .............................. SKIPPED
[INFO] Zookeeper identity backend ......................... SKIPPED
[INFO] Kerby Distribution ................................. SKIPPED
[INFO] KDC Dist ........................................... SKIPPED
[INFO] Tool Dist .......................................... SKIPPED
[INFO] Kerby benchmark .................................... SKIPPED
[INFO] ------------------------------------------------------------------------
[INFO] BUILD FAILURE
[INFO] ------------------------------------------------------------------------
[INFO] Total time: 10:36 min
[INFO] Finished at: 2017-06-19T12:41:42+00:00

[INFO] Final Memory: 63M/455M
[INFO] ------------------------------------------------------------------------
Waiting for Jenkins to finish collecting data
[ERROR] Failed to execute goal org.apache.maven.plugins:maven-compiler-plugin:3.6.1:compile
(default-compile) on project integration-test: Compilation failure
[ERROR] <https://builds.apache.org/job/dir-kerby-openjdk/ws/kerby-kerb/integration-test/src/main/java/org/apache/kerby/kerberos/kerb/integration/test/jaas/TokenCache.java>:[68,39]
method readAllLines in class java.nio.file.Files cannot be applied to given types;
[ERROR] required: java.nio.file.Path,java.nio.charset.Charset
[ERROR] found: java.nio.file.Path
[ERROR] reason: actual and formal argument lists differ in length
[ERROR] -> [Help 1]
[ERROR] 
[ERROR] To see the full stack trace of the errors, re-run Maven with the -e switch.
[ERROR] Re-run Maven using the -X switch to enable full debug logging.
[ERROR] 
[ERROR] For more information about the errors and possible solutions, please read the following
articles:
[ERROR] [Help 1] http://cwiki.apache.org/confluence/display/MAVEN/MojoFailureException
[ERROR] 
[ERROR] After correcting the problems, you can resume the build with the command
[ERROR]   mvn <goals> -rf :integration-test
channel stopped

Mime
View raw message