directory-notifications mailing list archives

Site index · List index
Message view « Date » · « Thread »
Top « Date » · « Thread »
From Apache Jenkins Server <jenk...@builds.apache.org>
Subject Build failed in Jenkins: dir-fortress-core-docker-test #336
Date Wed, 03 May 2017 23:44:20 GMT
See <https://builds.apache.org/job/dir-fortress-core-docker-test/336/display/redirect?page=changes>

Changes:

[smckinney] 2.0.0-RC2-SNAPSHOT release preps

------------------------------------------
Started by an SCM change
[EnvInject] - Loading node environment variables.
Building remotely on qnode3 (ubuntu) in workspace <https://builds.apache.org/job/dir-fortress-core-docker-test/ws/>
 > git rev-parse --is-inside-work-tree # timeout=10
Fetching changes from the remote Git repository
 > git config remote.origin.url https://git-wip-us.apache.org/repos/asf/directory-fortress-core.git
# timeout=10
Fetching upstream changes from https://git-wip-us.apache.org/repos/asf/directory-fortress-core.git
 > git --version # timeout=10
 > git fetch --tags --progress https://git-wip-us.apache.org/repos/asf/directory-fortress-core.git
+refs/heads/*:refs/remotes/origin/*
 > git rev-parse refs/remotes/origin/master^{commit} # timeout=10
 > git rev-parse refs/remotes/origin/origin/master^{commit} # timeout=10
Checking out Revision 1453608d85347c591a2e82247311378cf0d9af9c (refs/remotes/origin/master)
 > git config core.sparsecheckout # timeout=10
 > git checkout -f 1453608d85347c591a2e82247311378cf0d9af9c
 > git rev-list 2f72e8fd90cc5c625570f6af1bf39adb011e1ad4 # timeout=10
[dir-fortress-core-docker-test] $ /bin/bash /tmp/hudson8291752705498530248.sh
Error response from daemon: No such container: dir-fortress-core-test-ubuntu-openldap
Error response from daemon: No such container: dir-fortress-core-test-ubuntu-openldap
Docker version 17.03.0-ce, build 60ccb22
Using default tag: latest
latest: Pulling from apachedirectory/openldap-for-apache-fortress-tests
386a066cd84a: Already exists
a3ed95caeb02: Already exists
a3ed95caeb02: Already exists
fd3e0a2dc575: Already exists
46ac59bf7525: Already exists
eacabfc9d093: Already exists
0299602c4762: Already exists
0379e1b67a9d: Already exists
df7e5215927b: Already exists
caa5737d15ef: Already exists
89594c9aadba: Already exists
8efed4e7cea8: Already exists
0b6f7c352ee2: Already exists
a3ed95caeb02: Already exists
a3ed95caeb02: Already exists
Digest: sha256:03f757f5b2bcc5c7a86063ca343b0ad75201cb4e3f6d73accaf876190d800a7f
Status: Image is up to date for apachedirectory/openldap-for-apache-fortress-tests:latest
REPOSITORY                                           TAG                 IMAGE ID        
   CREATED             SIZE
apachedirectory/openldap-for-apache-fortress-tests   latest              d8d6052bc510    
   5 months ago        185 MB
beae1de95dc39b3992f6bd3d8989436a9dfbf32d10d79107fa90e129b4031850
[dir-fortress-core-docker-test] $ /home/jenkins/tools/maven/latest3/bin/mvn -Dmaven.repo.local=<https://builds.apache.org/job/dir-fortress-core-docker-test/ws/.repository>
-U -V clean install
Apache Maven 3.3.9 (bb52d8502b132ec0a5a3f4c09453c07478323dc5; 2015-11-10T16:41:47+00:00)
Maven home: /home/jenkins/tools/maven/latest3
Java version: 1.7.0_80, vendor: Oracle Corporation
Java home: /usr/local/asfpackages/java/jdk1.7.0_80/jre
Default locale: en_US, platform encoding: UTF-8
OS name: "linux", version: "4.8.3-std-1", arch: "amd64", family: "unix"
[INFO] Scanning for projects...
[INFO]                                                                         
[INFO] ------------------------------------------------------------------------
[INFO] Building Apache Fortress Core 2.0.0-RC2-SNAPSHOT
[INFO] ------------------------------------------------------------------------
[INFO] 
[INFO] --- maven-clean-plugin:2.6.1:clean (default-clean) @ fortress-core ---
[INFO] Deleting <https://builds.apache.org/job/dir-fortress-core-docker-test/ws/target>
[INFO] 
[INFO] --- maven-resources-plugin:2.7:copy-resources (copy-resources) @ fortress-core ---
[INFO] Using 'UTF-8' encoding to copy filtered resources.
[INFO] Copying 8 resources
[INFO] 
[INFO] --- maven-remote-resources-plugin:1.5:process (default) @ fortress-core ---
[INFO] 
[INFO] --- maven-resources-plugin:2.7:resources (default-resources) @ fortress-core ---
[INFO] Using 'UTF-8' encoding to copy filtered resources.
[INFO] Copying 8 resources
[INFO] Copying 3 resources
[INFO] 
[INFO] --- maven-compiler-plugin:3.3:compile (default-compile) @ fortress-core ---
[INFO] Changes detected - recompiling the module!
[INFO] Compiling 236 source files to <https://builds.apache.org/job/dir-fortress-core-docker-test/ws/target/classes>
[INFO] ------------------------------------------------------------------------
[INFO] BUILD FAILURE
[INFO] ------------------------------------------------------------------------
[INFO] Total time: 17.128 s
[INFO] Finished at: 2017-05-03T23:44:17+00:00
[INFO] Final Memory: 21M/476M
[INFO] ------------------------------------------------------------------------
[ERROR] Failed to execute goal org.apache.maven.plugins:maven-compiler-plugin:3.3:compile
(default-compile) on project fortress-core: Fatal error compiling: invalid target release:
1.8 -> [Help 1]
[ERROR] 
[ERROR] To see the full stack trace of the errors, re-run Maven with the -e switch.
[ERROR] Re-run Maven using the -X switch to enable full debug logging.
[ERROR] 
[ERROR] For more information about the errors and possible solutions, please read the following
articles:
[ERROR] [Help 1] http://cwiki.apache.org/confluence/display/MAVEN/MojoExecutionException
Build step 'Invoke top-level Maven targets' marked build as failure
[dir-fortress-core-docker-test] $ /bin/bash /tmp/hudson2214324090690588144.sh
dir-fortress-core-test-ubuntu-openldap
dir-fortress-core-test-ubuntu-openldap
CONTAINER ID        IMAGE                         COMMAND                  CREATED       
     STATUS              PORTS               NAMES
ff7558c0ef47        madlib/postgres_9.6:jenkins   "docker-entrypoint..."   12 days ago   
     Up 12 days          5432/tcp            madlib

Mime
View raw message