directory-notifications mailing list archives

Site index · List index
Message view « Date » · « Thread »
Top « Date » · « Thread »
From Apache Jenkins Server <jenk...@builds.apache.org>
Subject Build failed in Jenkins: dir-studio-ui-tests-in-docker #44
Date Wed, 24 May 2017 14:17:39 GMT
See <https://builds.apache.org/job/dir-studio-ui-tests-in-docker/44/display/redirect>

------------------------------------------
[...truncated 2.32 MB...]
testHasValue[InPlaceOidValueEditor - numeric OID](org.apache.directory.studio.test.integration.ui.ValueEditorTest)
 Time elapsed: 0 sec
testGetRawValue[InPlaceOidValueEditor - numeric OID](org.apache.directory.studio.test.integration.ui.ValueEditorTest)
 Time elapsed: 0 sec
testGetDisplayValue[InPlaceOidValueEditor - descr OID](org.apache.directory.studio.test.integration.ui.ValueEditorTest)
 Time elapsed: 0 sec
testGetStringOrBinaryValue[InPlaceOidValueEditor - descr OID](org.apache.directory.studio.test.integration.ui.ValueEditorTest)
 Time elapsed: 0 sec
testHasValue[InPlaceOidValueEditor - descr OID](org.apache.directory.studio.test.integration.ui.ValueEditorTest)
 Time elapsed: 0 sec
testGetRawValue[InPlaceOidValueEditor - descr OID](org.apache.directory.studio.test.integration.ui.ValueEditorTest)
 Time elapsed: 0 sec
testGetDisplayValue[InPlaceOidValueEditor - INVALID](org.apache.directory.studio.test.integration.ui.ValueEditorTest)
 Time elapsed: 0 sec
testGetStringOrBinaryValue[InPlaceOidValueEditor - INVALID](org.apache.directory.studio.test.integration.ui.ValueEditorTest)
 Time elapsed: 0 sec
testHasValue[InPlaceOidValueEditor - INVALID](org.apache.directory.studio.test.integration.ui.ValueEditorTest)
 Time elapsed: 0 sec
testGetRawValue[InPlaceOidValueEditor - INVALID](org.apache.directory.studio.test.integration.ui.ValueEditorTest)
 Time elapsed: 0.001 sec
testGetDisplayValue[InPlaceOidValueEditor - bytearray numeric OID](org.apache.directory.studio.test.integration.ui.ValueEditorTest)
 Time elapsed: 0 sec
testGetStringOrBinaryValue[InPlaceOidValueEditor - bytearray numeric OID](org.apache.directory.studio.test.integration.ui.ValueEditorTest)
 Time elapsed: 0 sec
testHasValue[InPlaceOidValueEditor - bytearray numeric OID](org.apache.directory.studio.test.integration.ui.ValueEditorTest)
 Time elapsed: 0 sec
testGetRawValue[InPlaceOidValueEditor - bytearray numeric OID](org.apache.directory.studio.test.integration.ui.ValueEditorTest)
 Time elapsed: 0 sec
testGetDisplayValue[InPlaceOidValueEditor - bytearray INVALID](org.apache.directory.studio.test.integration.ui.ValueEditorTest)
 Time elapsed: 0 sec
testGetStringOrBinaryValue[InPlaceOidValueEditor - bytearray INVALID](org.apache.directory.studio.test.integration.ui.ValueEditorTest)
 Time elapsed: 0.001 sec
testHasValue[InPlaceOidValueEditor - bytearray INVALID](org.apache.directory.studio.test.integration.ui.ValueEditorTest)
 Time elapsed: 0 sec
testGetRawValue[InPlaceOidValueEditor - bytearray INVALID](org.apache.directory.studio.test.integration.ui.ValueEditorTest)
 Time elapsed: 0 sec
testGetDisplayValue[TextValueEditor - empty string value](org.apache.directory.studio.test.integration.ui.ValueEditorTest)
 Time elapsed: 0 sec
testGetStringOrBinaryValue[TextValueEditor - empty string value](org.apache.directory.studio.test.integration.ui.ValueEditorTest)
 Time elapsed: 0 sec
testHasValue[TextValueEditor - empty string value](org.apache.directory.studio.test.integration.ui.ValueEditorTest)
 Time elapsed: 0 sec
testGetRawValue[TextValueEditor - empty string value](org.apache.directory.studio.test.integration.ui.ValueEditorTest)
 Time elapsed: 0 sec
testGetDisplayValue[TextValueEditor - empty string](org.apache.directory.studio.test.integration.ui.ValueEditorTest)
 Time elapsed: 0 sec
testGetStringOrBinaryValue[TextValueEditor - empty string](org.apache.directory.studio.test.integration.ui.ValueEditorTest)
 Time elapsed: 0 sec
testHasValue[TextValueEditor - empty string](org.apache.directory.studio.test.integration.ui.ValueEditorTest)
 Time elapsed: 0 sec
testGetRawValue[TextValueEditor - empty string](org.apache.directory.studio.test.integration.ui.ValueEditorTest)
 Time elapsed: 0 sec
testGetDisplayValue[TextValueEditor - ascii](org.apache.directory.studio.test.integration.ui.ValueEditorTest)
 Time elapsed: 0 sec
testGetStringOrBinaryValue[TextValueEditor - ascii](org.apache.directory.studio.test.integration.ui.ValueEditorTest)
 Time elapsed: 0 sec
testHasValue[TextValueEditor - ascii](org.apache.directory.studio.test.integration.ui.ValueEditorTest)
 Time elapsed: 0 sec
testGetRawValue[TextValueEditor - ascii](org.apache.directory.studio.test.integration.ui.ValueEditorTest)
 Time elapsed: 0 sec
testGetDisplayValue[TextValueEditor - unicode](org.apache.directory.studio.test.integration.ui.ValueEditorTest)
 Time elapsed: 0 sec
testGetStringOrBinaryValue[TextValueEditor - unicode](org.apache.directory.studio.test.integration.ui.ValueEditorTest)
 Time elapsed: 0 sec
testHasValue[TextValueEditor - unicode](org.apache.directory.studio.test.integration.ui.ValueEditorTest)
 Time elapsed: 0 sec
testGetRawValue[TextValueEditor - unicode](org.apache.directory.studio.test.integration.ui.ValueEditorTest)
 Time elapsed: 0 sec
testGetDisplayValue[TextValueEditor - empty binary value](org.apache.directory.studio.test.integration.ui.ValueEditorTest)
 Time elapsed: 0 sec
testGetStringOrBinaryValue[TextValueEditor - empty binary value](org.apache.directory.studio.test.integration.ui.ValueEditorTest)
 Time elapsed: 0 sec
testHasValue[TextValueEditor - empty binary value](org.apache.directory.studio.test.integration.ui.ValueEditorTest)
 Time elapsed: 0 sec
testGetRawValue[TextValueEditor - empty binary value](org.apache.directory.studio.test.integration.ui.ValueEditorTest)
 Time elapsed: 0 sec
testGetDisplayValue[TextValueEditor - empty bytearray](org.apache.directory.studio.test.integration.ui.ValueEditorTest)
 Time elapsed: 0 sec
testGetStringOrBinaryValue[TextValueEditor - empty bytearray](org.apache.directory.studio.test.integration.ui.ValueEditorTest)
 Time elapsed: 0 sec
testHasValue[TextValueEditor - empty bytearray](org.apache.directory.studio.test.integration.ui.ValueEditorTest)
 Time elapsed: 0 sec
testGetRawValue[TextValueEditor - empty bytearray](org.apache.directory.studio.test.integration.ui.ValueEditorTest)
 Time elapsed: 0 sec
testGetDisplayValue[TextValueEditor - bytearray UTF8](org.apache.directory.studio.test.integration.ui.ValueEditorTest)
 Time elapsed: 0 sec
testGetStringOrBinaryValue[TextValueEditor - bytearray UTF8](org.apache.directory.studio.test.integration.ui.ValueEditorTest)
 Time elapsed: 0 sec
testHasValue[TextValueEditor - bytearray UTF8](org.apache.directory.studio.test.integration.ui.ValueEditorTest)
 Time elapsed: 0 sec
testGetRawValue[TextValueEditor - bytearray UTF8](org.apache.directory.studio.test.integration.ui.ValueEditorTest)
 Time elapsed: 0 sec
testGetDisplayValue[TextValueEditor - bytearray ISO-8859-1](org.apache.directory.studio.test.integration.ui.ValueEditorTest)
 Time elapsed: 0 sec
testGetStringOrBinaryValue[TextValueEditor - bytearray ISO-8859-1](org.apache.directory.studio.test.integration.ui.ValueEditorTest)
 Time elapsed: 0 sec
testHasValue[TextValueEditor - bytearray ISO-8859-1](org.apache.directory.studio.test.integration.ui.ValueEditorTest)
 Time elapsed: 0 sec
testGetRawValue[TextValueEditor - bytearray ISO-8859-1](org.apache.directory.studio.test.integration.ui.ValueEditorTest)
 Time elapsed: 0 sec
testGetDisplayValue[TextValueEditor - bytearray PNG](org.apache.directory.studio.test.integration.ui.ValueEditorTest)
 Time elapsed: 0 sec
testGetStringOrBinaryValue[TextValueEditor - bytearray PNG](org.apache.directory.studio.test.integration.ui.ValueEditorTest)
 Time elapsed: 0 sec
testHasValue[TextValueEditor - bytearray PNG](org.apache.directory.studio.test.integration.ui.ValueEditorTest)
 Time elapsed: 0 sec
testGetRawValue[TextValueEditor - bytearray PNG](org.apache.directory.studio.test.integration.ui.ValueEditorTest)
 Time elapsed: 0 sec
testGetDisplayValue[HexValueEditor - empty string value](org.apache.directory.studio.test.integration.ui.ValueEditorTest)
 Time elapsed: 0 sec
testGetStringOrBinaryValue[HexValueEditor - empty string value](org.apache.directory.studio.test.integration.ui.ValueEditorTest)
 Time elapsed: 0.001 sec
testHasValue[HexValueEditor - empty string value](org.apache.directory.studio.test.integration.ui.ValueEditorTest)
 Time elapsed: 0 sec
testGetRawValue[HexValueEditor - empty string value](org.apache.directory.studio.test.integration.ui.ValueEditorTest)
 Time elapsed: 0 sec
testGetDisplayValue[HexValueEditor - empty string](org.apache.directory.studio.test.integration.ui.ValueEditorTest)
 Time elapsed: 0 sec
testGetStringOrBinaryValue[HexValueEditor - empty string](org.apache.directory.studio.test.integration.ui.ValueEditorTest)
 Time elapsed: 0 sec
testHasValue[HexValueEditor - empty string](org.apache.directory.studio.test.integration.ui.ValueEditorTest)
 Time elapsed: 0 sec
testGetRawValue[HexValueEditor - empty string](org.apache.directory.studio.test.integration.ui.ValueEditorTest)
 Time elapsed: 0 sec
testGetDisplayValue[HexValueEditor - ascii](org.apache.directory.studio.test.integration.ui.ValueEditorTest)
 Time elapsed: 0 sec
testGetStringOrBinaryValue[HexValueEditor - ascii](org.apache.directory.studio.test.integration.ui.ValueEditorTest)
 Time elapsed: 0 sec
testHasValue[HexValueEditor - ascii](org.apache.directory.studio.test.integration.ui.ValueEditorTest)
 Time elapsed: 0 sec
testGetRawValue[HexValueEditor - ascii](org.apache.directory.studio.test.integration.ui.ValueEditorTest)
 Time elapsed: 0 sec
testGetDisplayValue[HexValueEditor - empty binary value](org.apache.directory.studio.test.integration.ui.ValueEditorTest)
 Time elapsed: 0 sec
testGetStringOrBinaryValue[HexValueEditor - empty binary value](org.apache.directory.studio.test.integration.ui.ValueEditorTest)
 Time elapsed: 0 sec
testHasValue[HexValueEditor - empty binary value](org.apache.directory.studio.test.integration.ui.ValueEditorTest)
 Time elapsed: 0 sec
testGetRawValue[HexValueEditor - empty binary value](org.apache.directory.studio.test.integration.ui.ValueEditorTest)
 Time elapsed: 0 sec
testGetDisplayValue[HexValueEditor - empty bytearray](org.apache.directory.studio.test.integration.ui.ValueEditorTest)
 Time elapsed: 0 sec
testGetStringOrBinaryValue[HexValueEditor - empty bytearray](org.apache.directory.studio.test.integration.ui.ValueEditorTest)
 Time elapsed: 0 sec
testHasValue[HexValueEditor - empty bytearray](org.apache.directory.studio.test.integration.ui.ValueEditorTest)
 Time elapsed: 0 sec
testGetRawValue[HexValueEditor - empty bytearray](org.apache.directory.studio.test.integration.ui.ValueEditorTest)
 Time elapsed: 0 sec
testGetDisplayValue[HexValueEditor - bytearray UTF8](org.apache.directory.studio.test.integration.ui.ValueEditorTest)
 Time elapsed: 0 sec
testGetStringOrBinaryValue[HexValueEditor - bytearray UTF8](org.apache.directory.studio.test.integration.ui.ValueEditorTest)
 Time elapsed: 0 sec
testHasValue[HexValueEditor - bytearray UTF8](org.apache.directory.studio.test.integration.ui.ValueEditorTest)
 Time elapsed: 0 sec
testGetRawValue[HexValueEditor - bytearray UTF8](org.apache.directory.studio.test.integration.ui.ValueEditorTest)
 Time elapsed: 0 sec
testGetDisplayValue[HexValueEditor - bytearray ISO-8859-1](org.apache.directory.studio.test.integration.ui.ValueEditorTest)
 Time elapsed: 0 sec
testGetStringOrBinaryValue[HexValueEditor - bytearray ISO-8859-1](org.apache.directory.studio.test.integration.ui.ValueEditorTest)
 Time elapsed: 0 sec
testHasValue[HexValueEditor - bytearray ISO-8859-1](org.apache.directory.studio.test.integration.ui.ValueEditorTest)
 Time elapsed: 0 sec
testGetRawValue[HexValueEditor - bytearray ISO-8859-1](org.apache.directory.studio.test.integration.ui.ValueEditorTest)
 Time elapsed: 0 sec
testGetDisplayValue[HexValueEditor - bytearray PNG](org.apache.directory.studio.test.integration.ui.ValueEditorTest)
 Time elapsed: 0 sec
testGetStringOrBinaryValue[HexValueEditor - bytearray PNG](org.apache.directory.studio.test.integration.ui.ValueEditorTest)
 Time elapsed: 0 sec
testHasValue[HexValueEditor - bytearray PNG](org.apache.directory.studio.test.integration.ui.ValueEditorTest)
 Time elapsed: 0 sec
testGetRawValue[HexValueEditor - bytearray PNG](org.apache.directory.studio.test.integration.ui.ValueEditorTest)
 Time elapsed: 0 sec
Running org.apache.directory.studio.test.integration.ui.EntryEditorTest
Tests run: 4, Failures: 0, Errors: 1, Skipped: 0, Time elapsed: 38.396 sec <<< FAILURE!
- in org.apache.directory.studio.test.integration.ui.EntryEditorTest
testCopyPaste(org.apache.directory.studio.test.integration.ui.EntryEditorTest)  Time elapsed:
6.501 sec
testPasswordValueEditor(org.apache.directory.studio.test.integration.ui.EntryEditorTest) 
Time elapsed: 8.535 sec
testAddEditDeleteAttribute(org.apache.directory.studio.test.integration.ui.EntryEditorTest)
 Time elapsed: 5.372 sec  <<< ERROR!
java.lang.NoClassDefFoundError: Could not initialize class org.eclipse.swtbot.swt.finder.keyboard.Keystrokes
	at org.apache.directory.studio.test.integration.ui.bots.EntryEditorWidgetBot.typeValueAndFinish(EntryEditorWidgetBot.java:87)
	at org.apache.directory.studio.test.integration.ui.bots.EntryEditorBot.typeValueAndFinish(EntryEditorBot.java:82)
	at org.apache.directory.studio.test.integration.ui.EntryEditorTest.testAddEditDeleteAttribute(EntryEditorTest.java:122)

testDnValueEditor(org.apache.directory.studio.test.integration.ui.EntryEditorTest)  Time elapsed:
7.424 sec

Results :

Failed tests: 
  RenameEntryDialogTest.testRenameRdnWithTrailingSpace:159 null
  RenameEntryDialogTest.testRenameRdnWithSharp:139 null
  ApacheDSPluginTest.verifyServerNameCollisionInNewWizard:190 expected:<0> but was:<1>
  ApacheDSPluginTest.serverCreationStartCreateConnectionStopAndDeletion:91->createServer:153
expected:<0> but was:<1>

Tests in error: 
  SchemaEditorSearchTest.testSearchForAliases:78 » ExceptionInInitializer
  CertificateValidationTest.testLdapsCertificateTrustPermanent:365 » Timeout Tim...
  CertificateValidationTest.testLdapsCertificateTrustTemporary:316 » Timeout Tim...
  CertificateValidationTest.testStartTlsCertificateValidationExpired:458 » Timeout
  CertificateValidationTest.testStartTlsCertificateTrustPermanent:725 » Timeout ...
  CertificateValidationTest.testStartTlsCertificateValidationHostnameMismatch:550 » Timeout
  CertificateValidationTest.testStartTlsCertificateDoNotTrust:596 » Timeout Time...
  LdifEditorTest.testNewLdifEditor:80 » NoClassDefFound Could not initialize cla...
  BrowserTest.TestSetInputOnlyOnce:613 » NoClassDefFound Could not initialize cl...
  ApacheDSPluginTest.repairAndStartAndStop:411 » Timeout Timeout after: 60000 ms...
  NewEntryWizardTest.testCreatePersonEntry:182 » NoClassDefFound Could not initi...
  NewEntryWizardTest.testCreateEntryBelowReferralObjectCancel:299 » Timeout Time...
  NewEntryWizardTest.testCreateEntryBelowReferralObjectFollow:345 » Timeout Time...
  NewEntryWizardTest.testCreateOrganizationEntry:122 » Timeout Timeout after: 50...
  NewEntryWizardTest.testCreateEntryWithSharp:380 » Timeout Timeout after: 5000 ...
  NewEntryWizardTest.testCreateEntryWithSlash:257 » Timeout Timeout after: 5000 ...
  NewEntryWizardTest.testCreateUpperCaseOrganizationEntries:204 » Timeout Timeou...
  NewEntryWizardTest.testCreateMvRdnWithNumericOid:410 » Timeout Timeout after: ...
  EntryEditorTest.testAddEditDeleteAttribute:122 » NoClassDefFound Could not ini...

Tests run: 226, Failures: 4, Errors: 19, Skipped: 0

Caught unexpected exception during test framework shutdown
org.eclipse.swt.SWTException: Failed to execute runnable (org.eclipse.swt.SWTException: Widget
is disposed)
	at org.eclipse.swt.SWT.error(SWT.java:4533)
	at org.eclipse.swt.SWT.error(SWT.java:4448)
	at org.eclipse.swt.widgets.Synchronizer.runAsyncMessages(Synchronizer.java:185)
	at org.eclipse.swt.widgets.Display.runAsyncMessages(Display.java:4536)
	at org.eclipse.swt.widgets.Display.readAndDispatch(Display.java:4154)
	at org.eclipse.swt.widgets.Display.release(Display.java:4206)
	at org.eclipse.swt.graphics.Device.dispose(Device.java:266)
	at org.apache.directory.studio.Application.start(Application.java:63)
	at org.eclipse.tycho.surefire.osgibooter.UITestApplication.runApplication(UITestApplication.java:31)
	at org.eclipse.tycho.surefire.osgibooter.AbstractUITestApplication.run(AbstractUITestApplication.java:120)
	at org.eclipse.tycho.surefire.osgibooter.UITestApplication.start(UITestApplication.java:37)
	at org.eclipse.equinox.internal.app.EclipseAppHandle.run(EclipseAppHandle.java:196)
	at org.eclipse.core.runtime.internal.adaptor.EclipseAppLauncher.runApplication(EclipseAppLauncher.java:134)
	at org.eclipse.core.runtime.internal.adaptor.EclipseAppLauncher.start(EclipseAppLauncher.java:104)
	at org.eclipse.core.runtime.adaptor.EclipseStarter.run(EclipseStarter.java:388)
	at org.eclipse.core.runtime.adaptor.EclipseStarter.run(EclipseStarter.java:243)
	at sun.reflect.NativeMethodAccessorImpl.invoke0(Native Method)
	at sun.reflect.NativeMethodAccessorImpl.invoke(NativeMethodAccessorImpl.java:62)
	at sun.reflect.DelegatingMethodAccessorImpl.invoke(DelegatingMethodAccessorImpl.java:43)
	at java.lang.reflect.Method.invoke(Method.java:498)
	at org.eclipse.equinox.launcher.Main.invokeFramework(Main.java:673)
	at org.eclipse.equinox.launcher.Main.basicRun(Main.java:610)
	at org.eclipse.equinox.launcher.Main.run(Main.java:1519)
	at org.eclipse.equinox.launcher.Main.main(Main.java:1492)
Caused by: org.eclipse.swt.SWTException: Widget is disposed
	at org.eclipse.swt.SWT.error(SWT.java:4533)
	at org.eclipse.swt.SWT.error(SWT.java:4448)
	at org.eclipse.swt.SWT.error(SWT.java:4419)
	at org.eclipse.swt.widgets.Widget.error(Widget.java:483)
	at org.eclipse.swt.widgets.Widget.checkWidget(Widget.java:420)
	at org.eclipse.swt.widgets.Tree.getSelection(Tree.java:1775)
	at org.eclipse.jface.viewers.TreeViewer.getSelection(TreeViewer.java:228)
	at org.eclipse.jface.viewers.TreeViewer.setSelection(TreeViewer.java:299)
	at org.eclipse.jface.viewers.AbstractTreeViewer.setSelectionToWidget(AbstractTreeViewer.java:2533)
	at org.eclipse.jface.viewers.AbstractTreeViewer.setSelectionToWidget(AbstractTreeViewer.java:2989)
	at org.eclipse.jface.viewers.StructuredViewer.preservingSelection(StructuredViewer.java:1465)
	at org.eclipse.jface.viewers.TreeViewer.preservingSelection(TreeViewer.java:354)
	at org.eclipse.jface.viewers.StructuredViewer.preservingSelection(StructuredViewer.java:1419)
	at org.eclipse.jface.viewers.StructuredViewer.refresh(StructuredViewer.java:1519)
	at org.eclipse.jface.viewers.ColumnViewer.refresh(ColumnViewer.java:523)
	at org.apache.directory.studio.ldapservers.views.ServersTableViewer$4.run(ServersTableViewer.java:251)
	at org.eclipse.swt.widgets.RunnableLock.run(RunnableLock.java:35)
	at org.eclipse.swt.widgets.Synchronizer.runAsyncMessages(Synchronizer.java:182)
	... 21 more
Job found still running after platform shutdown.  Jobs should be canceled by the plugin that
scheduled them during shutdown: org.eclipse.ui.internal.progress.AnimationManager$1
[INFO] ------------------------------------------------------------------------
[INFO] Reactor Summary:
[INFO] 
[INFO] Apache Directory Studio Parent ..................... SUCCESS [  0.977 s]
[INFO] Apache Directory Studio Target Platform for Eclipse  SUCCESS [  0.149 s]
[INFO] Apache Directory Studio Plugins .................... SUCCESS [  0.886 s]
[INFO] Apache Directory Studio Common UI .................. SUCCESS [  2.953 s]
[INFO] Apache Directory Studio Common Core ................ SUCCESS [  0.235 s]
[INFO] Apache Directory Studio LDIF Parser ................ SUCCESS [  1.687 s]
[INFO] Apache Directory Studio Connection Core ............ SUCCESS [  0.876 s]
[INFO] Apache Directory Studio Connection UI .............. SUCCESS [  0.890 s]
[INFO] Apache Directory Studio LDAP Browser Core .......... SUCCESS [  2.896 s]
[INFO] Apache Directory Studio LDAP Browser Common ........ SUCCESS [  2.643 s]
[INFO] Apache Directory Studio Value Editors .............. SUCCESS [  1.635 s]
[INFO] Apache Directory Studio ACI Item Editor ............ SUCCESS [  0.663 s]
[INFO] Apache Directory Studio ApacheDS Configuration ..... SUCCESS [  1.176 s]
[INFO] Apache Directory Studio LDIF Editor ................ SUCCESS [  0.596 s]
[INFO] Apache Directory Studio LDAP Browser UI ............ SUCCESS [  1.508 s]
[INFO] Apache Directory Studio LDAP Servers ............... SUCCESS [  0.445 s]
[INFO] Apache Directory Studio ApacheDS LDAP Server Adapter SUCCESS [  4.994 s]
[INFO] Apache Directory Studio RCP ........................ SUCCESS [  0.373 s]
[INFO] Apache Directory Studio Schema Editor .............. SUCCESS [  2.771 s]
[INFO] Apache Directory Studio OpenLDAP Common UI ......... SUCCESS [  1.027 s]
[INFO] Apache Directory Studio OpenLDAP Syncrepl .......... SUCCESS [  0.778 s]
[INFO] Apache Directory Studio OpenLDAP Configuration Editor SUCCESS [  2.256 s]
[INFO] Apache Directory Studio OpenLDAP ACL Configuration Editor SUCCESS [  2.311 s]
[INFO] Apache Directory Studio Template Editor ............ SUCCESS [  2.020 s]
[INFO] Apache Directory Studio Combined Editor ............ SUCCESS [  0.357 s]
[INFO] Apache Directory Studio SLF4J to Eclipse Log Binding SUCCESS [  0.105 s]
[INFO] Apache Directory Studio Help Plugins ............... SUCCESS [  0.016 s]
[INFO] Apache Directory Studio Apache DS Help ............. SUCCESS [  4.469 s]
[INFO] Apache Directory Studio LDAP Browser Help .......... SUCCESS [  9.412 s]
[INFO] Apache Directory Studio LDIF Editor Help ........... SUCCESS [  2.288 s]
[INFO] Apache Directory Studio RCP Help ................... SUCCESS [  1.884 s]
[INFO] Apache Directory Studio Schema Editor Help ......... SUCCESS [  2.467 s]
[INFO] Apache Directory Studio Feature Plugins ............ SUCCESS [  0.015 s]
[INFO] Apache Directory Studio ApacheDS Feature ........... SUCCESS [  0.150 s]
[INFO] Apache Directory Studio LDAP Browser Feature ....... SUCCESS [  0.163 s]
[INFO] Apache Directory Studio LDIF Editor Feature ........ SUCCESS [  0.108 s]
[INFO] Apache Directory Studio RCP Feature ................ SUCCESS [  0.784 s]
[INFO] Apache Directory Studio Schema Editor Feature ...... SUCCESS [  0.113 s]
[INFO] Apache Directory Studio OpenLDAP Feature ........... SUCCESS [  0.102 s]
[INFO] Apache Directory Studio National Language Support Feature SUCCESS [  0.452 s]
[INFO] Apache Directory Studio Test Plugins ............... SUCCESS [  0.016 s]
[INFO] Apache Directory Studio Core Integration Tests ..... SUCCESS [05:21 min]
[INFO] Apache Directory Studio UI Integration Tests ....... FAILURE [22:15 min]
[INFO] Apache Directory Studio P2 Repositories ............ SKIPPED
[INFO] Apache Directory Studio P2 Repository Dependencies . SKIPPED
[INFO] Apache Directory Studio P2 Repository Eclipse ...... SKIPPED
[INFO] Apache Directory Studio Product .................... SKIPPED
[INFO] Apache Directory Studio Installers ................. SKIPPED
[INFO] ------------------------------------------------------------------------
[INFO] BUILD FAILURE
[INFO] ------------------------------------------------------------------------
[INFO] Total time: 32:56 min
[INFO] Finished at: 2017-05-24T14:17:29+00:00
[INFO] Final Memory: 293M/3183M
[INFO] ------------------------------------------------------------------------
[ERROR] Failed to execute goal org.eclipse.tycho:tycho-surefire-plugin:0.24.0:test (default-test)
on project org.apache.directory.studio.test.integration.ui: There are test failures.
[ERROR] 
[ERROR] Please refer to /home/hnelson/studio/tests/test.integration.ui/target/surefire-reports
for the individual test results.
[ERROR] -> [Help 1]
[ERROR] 
[ERROR] To see the full stack trace of the errors, re-run Maven with the -e switch.
[ERROR] Re-run Maven using the -X switch to enable full debug logging.
[ERROR] 
[ERROR] For more information about the errors and possible solutions, please read the following
articles:
[ERROR] [Help 1] http://cwiki.apache.org/confluence/display/MAVEN/MojoFailureException
[ERROR] 
[ERROR] After correcting the problems, you can resume the build with the command
[ERROR]   mvn <goals> -rf :org.apache.directory.studio.test.integration.ui
Build step 'Execute shell' marked build as failure
Recording test results

Mime
View raw message