directory-notifications mailing list archives

Site index · List index
Message view « Date » · « Thread »
Top « Date » · « Thread »
From Apache Jenkins Server <>
Subject Build failed in Jenkins: dir-fortress-core-docker-test #340
Date Thu, 04 May 2017 05:28:58 GMT
See <>

Started by timer
[EnvInject] - Loading node environment variables.
Building remotely on qnode3 (ubuntu) in workspace <>
 > git rev-parse --is-inside-work-tree # timeout=10
Fetching changes from the remote Git repository
 > git config remote.origin.url
# timeout=10
Fetching upstream changes from
 > git --version # timeout=10
 > git fetch --tags --progress
 > git rev-parse refs/remotes/origin/master^{commit} # timeout=10
 > git rev-parse refs/remotes/origin/origin/master^{commit} # timeout=10
Checking out Revision 017da896c1f820d85f215db80ee9742ba9d8e88e (refs/remotes/origin/master)
 > git config core.sparsecheckout # timeout=10
 > git checkout -f 017da896c1f820d85f215db80ee9742ba9d8e88e
 > git rev-list 017da896c1f820d85f215db80ee9742ba9d8e88e # timeout=10
[dir-fortress-core-docker-test] $ /bin/bash /tmp/
Error response from daemon: No such container: dir-fortress-core-test-ubuntu-openldap
Error response from daemon: No such container: dir-fortress-core-test-ubuntu-openldap
Docker version 17.03.0-ce, build 60ccb22
Using default tag: latest
latest: Pulling from apachedirectory/openldap-for-apache-fortress-tests
386a066cd84a: Pulling fs layer
a3ed95caeb02: Pulling fs layer
fd3e0a2dc575: Pulling fs layer
46ac59bf7525: Pulling fs layer
eacabfc9d093: Pulling fs layer
0299602c4762: Pulling fs layer
0379e1b67a9d: Pulling fs layer
eacabfc9d093: Waiting
0299602c4762: Waiting
46ac59bf7525: Waiting
fd3e0a2dc575: Waiting
df7e5215927b: Pulling fs layer
caa5737d15ef: Pulling fs layer
0379e1b67a9d: Waiting
df7e5215927b: Waiting
89594c9aadba: Pulling fs layer
8efed4e7cea8: Pulling fs layer
89594c9aadba: Waiting
8efed4e7cea8: Waiting
0b6f7c352ee2: Pulling fs layer
0b6f7c352ee2: Waiting
a3ed95caeb02: Verifying Checksum
fd3e0a2dc575: Download complete
eacabfc9d093: Verifying Checksum
eacabfc9d093: Download complete
46ac59bf7525: Verifying Checksum
46ac59bf7525: Download complete
0299602c4762: Verifying Checksum
0379e1b67a9d: Download complete
386a066cd84a: Download complete
caa5737d15ef: Verifying Checksum
caa5737d15ef: Download complete
89594c9aadba: Verifying Checksum
89594c9aadba: Download complete
df7e5215927b: Verifying Checksum
df7e5215927b: Download complete
0b6f7c352ee2: Download complete
8efed4e7cea8: Verifying Checksum
8efed4e7cea8: Download complete
386a066cd84a: Pull complete
a3ed95caeb02: Pull complete
fd3e0a2dc575: Pull complete
46ac59bf7525: Pull complete
eacabfc9d093: Pull complete
0299602c4762: Pull complete
0379e1b67a9d: Pull complete
df7e5215927b: Pull complete
caa5737d15ef: Pull complete
89594c9aadba: Pull complete
8efed4e7cea8: Pull complete
0b6f7c352ee2: Pull complete
Digest: sha256:03f757f5b2bcc5c7a86063ca343b0ad75201cb4e3f6d73accaf876190d800a7f
Status: Downloaded newer image for apachedirectory/openldap-for-apache-fortress-tests:latest
REPOSITORY                                           TAG                 IMAGE ID        
   CREATED             SIZE
apachedirectory/openldap-for-apache-fortress-tests   latest              d8d6052bc510    
   5 months ago        185 MB
[dir-fortress-core-docker-test] $ /home/jenkins/tools/maven/latest3/bin/mvn -Dmaven.repo.local=<>
-U -V clean install
Apache Maven 3.3.9 (bb52d8502b132ec0a5a3f4c09453c07478323dc5; 2015-11-10T16:41:47+00:00)
Maven home: /home/jenkins/tools/maven/latest3
Java version: 1.7.0_80, vendor: Oracle Corporation
Java home: /usr/local/asfpackages/java/jdk1.7.0_80/jre
Default locale: en_US, platform encoding: UTF-8
OS name: "linux", version: "4.8.3-std-1", arch: "amd64", family: "unix"
[INFO] Scanning for projects...
[INFO] ------------------------------------------------------------------------
[INFO] Building Apache Fortress Core 2.0.0-RC3-SNAPSHOT
[INFO] ------------------------------------------------------------------------
[INFO] --- maven-clean-plugin:2.6.1:clean (default-clean) @ fortress-core ---
[INFO] Deleting <>
[INFO] --- maven-resources-plugin:2.7:copy-resources (copy-resources) @ fortress-core ---
[INFO] Using 'UTF-8' encoding to copy filtered resources.
[INFO] Copying 8 resources
[INFO] --- maven-remote-resources-plugin:1.5:process (default) @ fortress-core ---
[INFO] --- maven-resources-plugin:2.7:resources (default-resources) @ fortress-core ---
[INFO] Using 'UTF-8' encoding to copy filtered resources.
[INFO] Copying 8 resources
[INFO] Copying 3 resources
[INFO] --- maven-compiler-plugin:3.3:compile (default-compile) @ fortress-core ---
[INFO] Changes detected - recompiling the module!
[INFO] Compiling 236 source files to <>
[INFO] ------------------------------------------------------------------------
[INFO] ------------------------------------------------------------------------
[INFO] Total time: 20.228 s
[INFO] Finished at: 2017-05-04T05:28:55+00:00
[INFO] Final Memory: 21M/475M
[INFO] ------------------------------------------------------------------------
[ERROR] Failed to execute goal org.apache.maven.plugins:maven-compiler-plugin:3.3:compile
(default-compile) on project fortress-core: Fatal error compiling: invalid target release:
1.8 -> [Help 1]
[ERROR] To see the full stack trace of the errors, re-run Maven with the -e switch.
[ERROR] Re-run Maven using the -X switch to enable full debug logging.
[ERROR] For more information about the errors and possible solutions, please read the following
[ERROR] [Help 1]
Build step 'Invoke top-level Maven targets' marked build as failure
[dir-fortress-core-docker-test] $ /bin/bash /tmp/
CONTAINER ID        IMAGE                         COMMAND                  CREATED       
     STATUS              PORTS               NAMES
4ba2791dfe56        yetus/hbase:tp-21229          "/bin/sh -c /testp..."   3 hours ago   
     Up 3 hours                              yetus_tp-21229
2770f40d166a        madlib/postgres_9.6:jenkins   "docker-entrypoint..."   4 hours ago   
     Up 4 hours          5432/tcp            madlib

View raw message