directory-notifications mailing list archives

Site index · List index
Message view « Date » · « Thread »
Top « Date » · « Thread »
From Apache Jenkins Server <jenk...@builds.apache.org>
Subject Build failed in Jenkins: dir-fortress-core-docker-test #333
Date Mon, 01 May 2017 16:54:15 GMT
See <https://builds.apache.org/job/dir-fortress-core-docker-test/333/display/redirect?page=changes>

Changes:

[smckinney] FC-201 - jgrapht 1.0.0 requires Java 8

------------------------------------------
Started by an SCM change
[EnvInject] - Loading node environment variables.
Building remotely on qnode3 (ubuntu) in workspace <https://builds.apache.org/job/dir-fortress-core-docker-test/ws/>
 > git rev-parse --is-inside-work-tree # timeout=10
Fetching changes from the remote Git repository
 > git config remote.origin.url https://git-wip-us.apache.org/repos/asf/directory-fortress-core.git
# timeout=10
Fetching upstream changes from https://git-wip-us.apache.org/repos/asf/directory-fortress-core.git
 > git --version # timeout=10
 > git fetch --tags --progress https://git-wip-us.apache.org/repos/asf/directory-fortress-core.git
+refs/heads/*:refs/remotes/origin/*
 > git rev-parse refs/remotes/origin/master^{commit} # timeout=10
 > git rev-parse refs/remotes/origin/origin/master^{commit} # timeout=10
Checking out Revision 6d1e46707f5d1bc43ada5cf799e599636c9d8fdf (refs/remotes/origin/master)
 > git config core.sparsecheckout # timeout=10
 > git checkout -f 6d1e46707f5d1bc43ada5cf799e599636c9d8fdf
 > git rev-list a15a9861b1216b1be6a8c015e85b5ae5f88018b5 # timeout=10
[dir-fortress-core-docker-test] $ /bin/bash /tmp/hudson4230239831952486900.sh
Error response from daemon: No such container: dir-fortress-core-test-ubuntu-openldap
Error response from daemon: No such container: dir-fortress-core-test-ubuntu-openldap
Docker version 17.03.0-ce, build 60ccb22
Using default tag: latest
latest: Pulling from apachedirectory/openldap-for-apache-fortress-tests
386a066cd84a: Pulling fs layer
a3ed95caeb02: Pulling fs layer
fd3e0a2dc575: Pulling fs layer
46ac59bf7525: Pulling fs layer
fd3e0a2dc575: Waiting
46ac59bf7525: Waiting
eacabfc9d093: Pulling fs layer
0299602c4762: Pulling fs layer
eacabfc9d093: Waiting
0379e1b67a9d: Pulling fs layer
df7e5215927b: Pulling fs layer
0299602c4762: Waiting
caa5737d15ef: Pulling fs layer
89594c9aadba: Pulling fs layer
8efed4e7cea8: Pulling fs layer
0379e1b67a9d: Waiting
0b6f7c352ee2: Pulling fs layer
df7e5215927b: Waiting
caa5737d15ef: Waiting
89594c9aadba: Waiting
8efed4e7cea8: Waiting
0b6f7c352ee2: Waiting
a3ed95caeb02: Download complete
fd3e0a2dc575: Verifying Checksum
fd3e0a2dc575: Download complete
eacabfc9d093: Verifying Checksum
eacabfc9d093: Download complete
46ac59bf7525: Verifying Checksum
46ac59bf7525: Download complete
0299602c4762: Verifying Checksum
0299602c4762: Download complete
0379e1b67a9d: Verifying Checksum
0379e1b67a9d: Download complete
df7e5215927b: Verifying Checksum
df7e5215927b: Download complete
386a066cd84a: Verifying Checksum
386a066cd84a: Download complete
caa5737d15ef: Download complete
89594c9aadba: Download complete
8efed4e7cea8: Download complete
0b6f7c352ee2: Verifying Checksum
0b6f7c352ee2: Download complete
386a066cd84a: Pull complete
a3ed95caeb02: Pull complete
fd3e0a2dc575: Pull complete
46ac59bf7525: Pull complete
eacabfc9d093: Pull complete
0299602c4762: Pull complete
0379e1b67a9d: Pull complete
df7e5215927b: Pull complete
caa5737d15ef: Pull complete
89594c9aadba: Pull complete
8efed4e7cea8: Pull complete
0b6f7c352ee2: Pull complete
Digest: sha256:03f757f5b2bcc5c7a86063ca343b0ad75201cb4e3f6d73accaf876190d800a7f
Status: Downloaded newer image for apachedirectory/openldap-for-apache-fortress-tests:latest
REPOSITORY                                           TAG                 IMAGE ID        
   CREATED             SIZE
apachedirectory/openldap-for-apache-fortress-tests   latest              d8d6052bc510    
   4 months ago        185 MB
507f22b575f54017af9d2256def8227ecac10170c296357cfc344d8ebee45a0d
[dir-fortress-core-docker-test] $ /home/jenkins/tools/maven/latest3/bin/mvn -Dmaven.repo.local=<https://builds.apache.org/job/dir-fortress-core-docker-test/ws/.repository>
-U -V clean install
Apache Maven 3.3.9 (bb52d8502b132ec0a5a3f4c09453c07478323dc5; 2015-11-10T16:41:47+00:00)
Maven home: /home/jenkins/tools/maven/latest3
Java version: 1.7.0_80, vendor: Oracle Corporation
Java home: /usr/local/asfpackages/java/jdk1.7.0_80/jre
Default locale: en_US, platform encoding: UTF-8
OS name: "linux", version: "4.8.3-std-1", arch: "amd64", family: "unix"
[INFO] Scanning for projects...
[INFO]                                                                         
[INFO] ------------------------------------------------------------------------
[INFO] Building Apache Fortress Core 2.0.0-RC2-SNAPSHOT
[INFO] ------------------------------------------------------------------------
Downloading: https://repo.maven.apache.org/maven2/org/jgrapht/jgrapht-core/1.0.0/jgrapht-core-1.0.0.pom
3/3 KB   3/3 KB            Downloaded: https://repo.maven.apache.org/maven2/org/jgrapht/jgrapht-core/1.0.0/jgrapht-core-1.0.0.pom
(3 KB at 3.2 KB/sec)
Downloading: https://repo.maven.apache.org/maven2/org/jgrapht/jgrapht/1.0.0/jgrapht-1.0.0.pom
3/8 KB   5/8 KB   8/8 KB            Downloaded: https://repo.maven.apache.org/maven2/org/jgrapht/jgrapht/1.0.0/jgrapht-1.0.0.pom
(8 KB at 277.1 KB/sec)
Downloading: https://repo.maven.apache.org/maven2/org/jgrapht/jgrapht-core/1.0.0/jgrapht-core-1.0.0.jar
3/428 KB   5/428 KB   8/428 KB   11/428 KB   13/428 KB   16/428 KB   19/428 KB   21/428 KB
  24/428 KB   27/428 KB   29/428 KB   32/428 KB   36/428 KB   40/428 KB   44/428 KB   48/428
KB   52/428 KB   56/428 KB   60/428 KB   64/428 KB   68/428 KB   72/428 KB   76/428 KB   80/428
KB   84/428 KB   88/428 KB   92/428 KB   96/428 KB   100/428 KB   104/428 KB   108/428 KB
  112/428 KB   116/428 KB   120/428 KB   124/428 KB   128/428 KB   132/428 KB   136/428 KB
  140/428 KB   144/428 KB   148/428 KB   152/428 KB   156/428 KB   160/428 KB   164/428 KB
  168/428 KB   172/428 KB   176/428 KB   180/428 KB   184/428 KB   188/428 KB   192/428 KB
  196/428 KB   200/428 KB   204/428 KB   208/428 KB   212/428 KB   216/428 KB   220/428 KB
  224/428 KB   228/428 KB   232/428 KB   236/428 KB   240/428 KB   244/428 KB   248/428 KB
  252/428 KB   256/428 KB   260/428 KB   264/428 KB   268/428 KB   272/428 KB   276/428 KB
  280/428 KB   284/428 KB   288/428 KB   292/428 KB   296/428 KB   300/428 KB   304/428 KB
  308/428 KB   312/428 KB   316/428 KB   320/428 KB   324/428 KB   328/428 KB   332/428 KB
  336/428 KB   340/428 KB   344/428 KB   348/428 KB   352/428 KB   356/428 KB   360/428 KB
  364/428 KB   368/428 KB   372/428 KB   376/428 KB   380/428 KB   384/428 KB   388/428 KB
  392/428 KB   396/428 KB   400/428 KB   404/428 KB   408/428 KB   412/428 KB   416/428 KB
  420/428 KB   424/428 KB   428/428 KB   428/428 KB                Downloaded: https://repo.maven.apache.org/maven2/org/jgrapht/jgrapht-core/1.0.0/jgrapht-core-1.0.0.jar
(428 KB at 2760.1 KB/sec)
[INFO] 
[INFO] --- maven-clean-plugin:2.6.1:clean (default-clean) @ fortress-core ---
[INFO] Deleting <https://builds.apache.org/job/dir-fortress-core-docker-test/ws/target>
[INFO] 
[INFO] --- maven-resources-plugin:2.7:copy-resources (copy-resources) @ fortress-core ---
[INFO] Using 'UTF-8' encoding to copy filtered resources.
[INFO] Copying 8 resources
[INFO] 
[INFO] --- maven-remote-resources-plugin:1.5:process (default) @ fortress-core ---
[INFO] 
[INFO] --- maven-resources-plugin:2.7:resources (default-resources) @ fortress-core ---
[INFO] Using 'UTF-8' encoding to copy filtered resources.
[INFO] Copying 8 resources
[INFO] Copying 3 resources
[INFO] 
[INFO] --- maven-compiler-plugin:3.3:compile (default-compile) @ fortress-core ---
[INFO] Changes detected - recompiling the module!
[INFO] Compiling 236 source files to <https://builds.apache.org/job/dir-fortress-core-docker-test/ws/target/classes>
[INFO] ------------------------------------------------------------------------
[INFO] BUILD FAILURE
[INFO] ------------------------------------------------------------------------
[INFO] Total time: 18.276 s
[INFO] Finished at: 2017-05-01T16:54:12+00:00
[INFO] Final Memory: 23M/477M
[INFO] ------------------------------------------------------------------------
[ERROR] Failed to execute goal org.apache.maven.plugins:maven-compiler-plugin:3.3:compile
(default-compile) on project fortress-core: Fatal error compiling: invalid target release:
1.8 -> [Help 1]
[ERROR] 
[ERROR] To see the full stack trace of the errors, re-run Maven with the -e switch.
[ERROR] Re-run Maven using the -X switch to enable full debug logging.
[ERROR] 
[ERROR] For more information about the errors and possible solutions, please read the following
articles:
[ERROR] [Help 1] http://cwiki.apache.org/confluence/display/MAVEN/MojoExecutionException
Build step 'Invoke top-level Maven targets' marked build as failure
[dir-fortress-core-docker-test] $ /bin/bash /tmp/hudson6555879659404504540.sh
dir-fortress-core-test-ubuntu-openldap
dir-fortress-core-test-ubuntu-openldap
CONTAINER ID        IMAGE                         COMMAND                  CREATED       
     STATUS              PORTS               NAMES
c988aaf47afe        yetus/hbase:tp-25398          "/bin/sh -c /testp..."   About an hour ago
  Up About an hour                        yetus_tp-25398
ff7558c0ef47        madlib/postgres_9.6:jenkins   "docker-entrypoint..."   10 days ago   
     Up 10 days          5432/tcp            madlib

Mime
View raw message