directory-notifications mailing list archives

Site index · List index
Message view « Date » · « Thread »
Top « Date » · « Thread »
From Apache Jenkins Server <jenk...@builds.apache.org>
Subject Build failed in Jenkins: dir-fortress-core-docker-test #334
Date Wed, 03 May 2017 23:23:05 GMT
See <https://builds.apache.org/job/dir-fortress-core-docker-test/334/display/redirect?page=changes>

Changes:

[smckinney] 2.0.0.RC2-SNAPSHOT release preps

------------------------------------------
Started by an SCM change
[EnvInject] - Loading node environment variables.
Building remotely on qnode3 (ubuntu) in workspace <https://builds.apache.org/job/dir-fortress-core-docker-test/ws/>
 > git rev-parse --is-inside-work-tree # timeout=10
Fetching changes from the remote Git repository
 > git config remote.origin.url https://git-wip-us.apache.org/repos/asf/directory-fortress-core.git
# timeout=10
Fetching upstream changes from https://git-wip-us.apache.org/repos/asf/directory-fortress-core.git
 > git --version # timeout=10
 > git fetch --tags --progress https://git-wip-us.apache.org/repos/asf/directory-fortress-core.git
+refs/heads/*:refs/remotes/origin/*
 > git rev-parse refs/remotes/origin/master^{commit} # timeout=10
 > git rev-parse refs/remotes/origin/origin/master^{commit} # timeout=10
Checking out Revision a66b75e72627b79e79d1e59212083569118f1297 (refs/remotes/origin/master)
 > git config core.sparsecheckout # timeout=10
 > git checkout -f a66b75e72627b79e79d1e59212083569118f1297
 > git rev-list 6d1e46707f5d1bc43ada5cf799e599636c9d8fdf # timeout=10
[dir-fortress-core-docker-test] $ /bin/bash /tmp/hudson7897687983468204022.sh
Error response from daemon: No such container: dir-fortress-core-test-ubuntu-openldap
Error response from daemon: No such container: dir-fortress-core-test-ubuntu-openldap
Docker version 17.03.0-ce, build 60ccb22
Using default tag: latest
latest: Pulling from apachedirectory/openldap-for-apache-fortress-tests
386a066cd84a: Pulling fs layer
a3ed95caeb02: Pulling fs layer
fd3e0a2dc575: Pulling fs layer
46ac59bf7525: Pulling fs layer
eacabfc9d093: Pulling fs layer
fd3e0a2dc575: Waiting
0299602c4762: Pulling fs layer
0379e1b67a9d: Pulling fs layer
46ac59bf7525: Waiting
df7e5215927b: Pulling fs layer
caa5737d15ef: Pulling fs layer
eacabfc9d093: Waiting
0299602c4762: Waiting
89594c9aadba: Pulling fs layer
caa5737d15ef: Waiting
0379e1b67a9d: Waiting
8efed4e7cea8: Pulling fs layer
89594c9aadba: Waiting
0b6f7c352ee2: Pulling fs layer
df7e5215927b: Waiting
0b6f7c352ee2: Waiting
a3ed95caeb02: Download complete
fd3e0a2dc575: Verifying Checksum
fd3e0a2dc575: Download complete
46ac59bf7525: Verifying Checksum
46ac59bf7525: Download complete
386a066cd84a: Verifying Checksum
386a066cd84a: Download complete
eacabfc9d093: Download complete
0379e1b67a9d: Download complete
df7e5215927b: Verifying Checksum
0299602c4762: Download complete
89594c9aadba: Download complete
caa5737d15ef: Download complete
0b6f7c352ee2: Verifying Checksum
0b6f7c352ee2: Download complete
386a066cd84a: Pull complete
a3ed95caeb02: Pull complete
fd3e0a2dc575: Pull complete
46ac59bf7525: Pull complete
eacabfc9d093: Pull complete
0299602c4762: Pull complete
0379e1b67a9d: Pull complete
df7e5215927b: Pull complete
caa5737d15ef: Pull complete
89594c9aadba: Pull complete
8efed4e7cea8: Pull complete
0b6f7c352ee2: Pull complete
Digest: sha256:03f757f5b2bcc5c7a86063ca343b0ad75201cb4e3f6d73accaf876190d800a7f
Status: Downloaded newer image for apachedirectory/openldap-for-apache-fortress-tests:latest
REPOSITORY                                           TAG                 IMAGE ID        
   CREATED             SIZE
apachedirectory/openldap-for-apache-fortress-tests   latest              d8d6052bc510    
   5 months ago        185 MB
725da8bb9c469f2e061dee61fdbdec0a512331882d550850d11ac51534fe7306
[dir-fortress-core-docker-test] $ /home/jenkins/tools/maven/latest3/bin/mvn -Dmaven.repo.local=<https://builds.apache.org/job/dir-fortress-core-docker-test/ws/.repository>
-U -V clean install
Apache Maven 3.3.9 (bb52d8502b132ec0a5a3f4c09453c07478323dc5; 2015-11-10T16:41:47+00:00)
Maven home: /home/jenkins/tools/maven/latest3
Java version: 1.7.0_80, vendor: Oracle Corporation
Java home: /usr/local/asfpackages/java/jdk1.7.0_80/jre
Default locale: en_US, platform encoding: UTF-8
OS name: "linux", version: "4.8.3-std-1", arch: "amd64", family: "unix"
[INFO] Scanning for projects...
[INFO]                                                                         
[INFO] ------------------------------------------------------------------------
[INFO] Building Apache Fortress Core 2.0.0-RC2-SNAPSHOT
[INFO] ------------------------------------------------------------------------
[INFO] 
[INFO] --- maven-clean-plugin:2.6.1:clean (default-clean) @ fortress-core ---
[INFO] Deleting <https://builds.apache.org/job/dir-fortress-core-docker-test/ws/target>
[INFO] 
[INFO] --- maven-resources-plugin:2.7:copy-resources (copy-resources) @ fortress-core ---
[INFO] Using 'UTF-8' encoding to copy filtered resources.
[INFO] Copying 8 resources
[INFO] 
[INFO] --- maven-remote-resources-plugin:1.5:process (default) @ fortress-core ---
[INFO] 
[INFO] --- maven-resources-plugin:2.7:resources (default-resources) @ fortress-core ---
[INFO] Using 'UTF-8' encoding to copy filtered resources.
[INFO] Copying 8 resources
[INFO] Copying 3 resources
[INFO] 
[INFO] --- maven-compiler-plugin:3.3:compile (default-compile) @ fortress-core ---
[INFO] Changes detected - recompiling the module!
[INFO] Compiling 236 source files to <https://builds.apache.org/job/dir-fortress-core-docker-test/ws/target/classes>
[INFO] ------------------------------------------------------------------------
[INFO] BUILD FAILURE
[INFO] ------------------------------------------------------------------------
[INFO] Total time: 15.911 s
[INFO] Finished at: 2017-05-03T23:23:00+00:00
[INFO] Final Memory: 21M/476M
[INFO] ------------------------------------------------------------------------
[ERROR] Failed to execute goal org.apache.maven.plugins:maven-compiler-plugin:3.3:compile
(default-compile) on project fortress-core: Fatal error compiling: invalid target release:
1.8 -> [Help 1]
[ERROR] 
[ERROR] To see the full stack trace of the errors, re-run Maven with the -e switch.
[ERROR] Re-run Maven using the -X switch to enable full debug logging.
[ERROR] 
[ERROR] For more information about the errors and possible solutions, please read the following
articles:
[ERROR] [Help 1] http://cwiki.apache.org/confluence/display/MAVEN/MojoExecutionException
Build step 'Invoke top-level Maven targets' marked build as failure
[dir-fortress-core-docker-test] $ /bin/bash /tmp/hudson868449373901992086.sh
dir-fortress-core-test-ubuntu-openldap
dir-fortress-core-test-ubuntu-openldap
CONTAINER ID        IMAGE                         COMMAND                  CREATED       
     STATUS              PORTS               NAMES
ff7558c0ef47        madlib/postgres_9.6:jenkins   "docker-entrypoint..."   12 days ago   
     Up 12 days          5432/tcp            madlib

Mime
View raw message