directory-notifications mailing list archives

Site index · List index
Message view « Date » · « Thread »
Top « Date » · « Thread »
From Apache Jenkins Server <jenk...@builds.apache.org>
Subject Build failed in Jenkins: dir-kerby-openjdk #154
Date Fri, 05 May 2017 12:38:57 GMT
See <https://builds.apache.org/job/dir-kerby-openjdk/154/display/redirect?page=changes>

Changes:

[coheigea] [maven-release-plugin] prepare release kerby-all-1.0.0

------------------------------------------
Started by an SCM change
[EnvInject] - Loading node environment variables.
Building remotely on ubuntu-eu2 (ubuntu trusty) in workspace <https://builds.apache.org/job/dir-kerby-openjdk/ws/>
 > git rev-parse --is-inside-work-tree # timeout=10
Fetching changes from the remote Git repository
 > git config remote.origin.url https://git-wip-us.apache.org/repos/asf/directory-kerby.git
# timeout=10
Fetching upstream changes from https://git-wip-us.apache.org/repos/asf/directory-kerby.git
 > git --version # timeout=10
 > git fetch --tags --progress https://git-wip-us.apache.org/repos/asf/directory-kerby.git
+refs/heads/*:refs/remotes/origin/*
 > git rev-parse refs/remotes/origin/trunk^{commit} # timeout=10
 > git rev-parse refs/remotes/origin/origin/trunk^{commit} # timeout=10
Checking out Revision c51bdb8bd1e451caeadaebc72ce294cdaec5c4a1 (refs/remotes/origin/trunk)
 > git config core.sparsecheckout # timeout=10
 > git checkout -f c51bdb8bd1e451caeadaebc72ce294cdaec5c4a1
 > git rev-list ec50c718be9c1a73330665db13de4f81c2cfbffc # timeout=10
Parsing POMs
Modules changed, recalculating dependency graph
Established TCP socket on 58884
maven33-agent.jar already up to date
maven33-interceptor.jar already up to date
maven3-interceptor-commons.jar already up to date
[dir-kerby-openjdk] $ /usr/lib/jvm/java-7-openjdk-amd64//bin/java -Xmx512m -XX:MaxPermSize=128m
-cp /home/jenkins/jenkins-slave/maven33-agent.jar:/home/jenkins/tools/maven/latest3/boot/plexus-classworlds-2.5.2.jar:/home/jenkins/tools/maven/latest3/conf/logging
jenkins.maven3.agent.Maven33Main /home/jenkins/tools/maven/latest3/ /home/jenkins/jenkins-slave/slave.jar
/home/jenkins/jenkins-slave/maven33-interceptor.jar /home/jenkins/jenkins-slave/maven3-interceptor-commons.jar
58884
<===[JENKINS REMOTING CAPACITY]===>   channel started
Executing Maven:  -B -f <https://builds.apache.org/job/dir-kerby-openjdk/ws/pom.xml>
-Dmaven.repo.local=/home/jenkins/jenkins-slave/maven-repositories/0 -V clean deploy
Apache Maven 3.3.9 (bb52d8502b132ec0a5a3f4c09453c07478323dc5; 2015-11-10T16:41:47+00:00)
Maven home: /usr/local/asfpackages/maven/apache-maven-3.3.9
Java version: 1.7.0_121, vendor: Oracle Corporation
Java home: /usr/lib/jvm/java-7-openjdk-amd64/jre
Default locale: en_US, platform encoding: UTF-8
OS name: "linux", version: "3.19.0-25-generic", arch: "amd64", family: "unix"
[INFO] Scanning for projects...
[INFO] ------------------------------------------------------------------------
[INFO] Reactor Build Order:
[INFO] 
[INFO] Apache Kerby Project
[INFO] Kerby-common Project
[INFO] Kerby ASN1 Project
[INFO] Kerby Config
[INFO] Kerby Util
[INFO] Kerby XDR Project
[INFO] Kerby PKIX Project
[INFO] Kerby-kerb Project
[INFO] Kerby-kerb core
[INFO] Kerby-kerb Crypto
[INFO] Kerby-kerb Common
[INFO] Kerby-kerb Util
[INFO] Kerby-kerb Identity
[INFO] Kerby-kerb Identity Test
[INFO] Kerby-kerb Client
[INFO] Kerby-kerb Server
[INFO] Kerby-kerb Admin
[INFO] Kerb Simple Kdc
[INFO] Kerby-kerb server all
[INFO] Kerby KDC Server
[INFO] Kerb Kdc Test
[INFO] Kerby providers
[INFO] Token provider
[INFO] Kerb Integration Test
[INFO] Kerby-kerb Admin Server
[INFO] Kerby-kerb client api all
[INFO] Kdc Tool Project
[INFO] Client Tool
[INFO] KDC Tool
[INFO] Kerby Backend
[INFO] Json identity backend
[INFO] Kerby Kdc Test
[INFO] Ldap identity backend
[INFO] Mavibot based backend
[INFO] Zookeeper identity backend
[INFO] Kerby Distribution
[INFO] KDC Dist
[INFO] Tool Dist
[INFO] Kerby benchmark
[INFO]                                                                         
[INFO] ------------------------------------------------------------------------
[INFO] Building Apache Kerby Project 1.0.0
[INFO] ------------------------------------------------------------------------
[INFO] 
[INFO] --- maven-clean-plugin:3.0.0:clean (default-clean) @ kerby-all ---
[INFO] Deleting <https://builds.apache.org/job/dir-kerby-openjdk/ws/target>
[INFO] 
[INFO] >>> maven-pmd-plugin:3.7:check (validate) > :pmd @ kerby-all >>>
[INFO] 
[INFO] --- maven-pmd-plugin:3.7:pmd (pmd) @ kerby-all ---
[INFO] 
[INFO] <<< maven-pmd-plugin:3.7:check (validate) < :pmd @ kerby-all <<<
[INFO] 
[INFO] --- maven-pmd-plugin:3.7:check (validate) @ kerby-all ---
[INFO] 
[INFO] --- maven-checkstyle-plugin:2.17:check (validate) @ kerby-all ---
[INFO] 
[INFO] --- maven-remote-resources-plugin:1.5:process (process-resource-bundles) @ kerby-all
---
[INFO] 
[INFO] --- maven-site-plugin:3.5.1:attach-descriptor (attach-descriptor) @ kerby-all ---
[INFO] 
[INFO] >>> maven-source-plugin:3.0.0:jar (attach-sources) > generate-sources @
kerby-all >>>
[INFO] 
[INFO] >>> maven-pmd-plugin:3.7:check (validate) > :pmd @ kerby-all >>>
[INFO] 
[INFO] --- maven-pmd-plugin:3.7:pmd (pmd) @ kerby-all ---
[INFO] 
[INFO] <<< maven-pmd-plugin:3.7:check (validate) < :pmd @ kerby-all <<<
[INFO] 
[INFO] --- maven-pmd-plugin:3.7:check (validate) @ kerby-all ---
[INFO] 
[INFO] --- maven-checkstyle-plugin:2.17:check (validate) @ kerby-all ---
[WARNING] Failed to getClass for org.apache.maven.plugins.source.SourceJarMojo
[INFO] 
[INFO] <<< maven-source-plugin:3.0.0:jar (attach-sources) < generate-sources @
kerby-all <<<
[INFO] 
[INFO] --- maven-source-plugin:3.0.0:jar (attach-sources) @ kerby-all ---
[INFO] 
[INFO] --- maven-install-plugin:2.5.2:install (default-install) @ kerby-all ---
[INFO] Installing <https://builds.apache.org/job/dir-kerby-openjdk/ws/pom.xml> to /home/jenkins/jenkins-slave/maven-repositories/0/org/apache/kerby/kerby-all/1.0.0/kerby-all-1.0.0.pom
[INFO] 
[INFO] --- maven-deploy-plugin:2.8.2:deploy (default-deploy) @ kerby-all ---
[INFO] Uploading: https://repository.apache.org/service/local/staging/deploy/maven2/org/apache/kerby/kerby-all/1.0.0/kerby-all-1.0.0.pom
[JENKINS] Archiving disabled
[JENKINS] Archiving disabled
[JENKINS] Archiving disabled
[JENKINS] Archiving disabled
[JENKINS] Archiving disabled
[JENKINS] Archiving disabled
[JENKINS] Archiving disabled
[JENKINS] Archiving disabled
[JENKINS] Archiving disabled
[JENKINS] Archiving disabled
[JENKINS] Archiving disabled
[JENKINS] Archiving disabled
[JENKINS] Archiving disabled
[JENKINS] Archiving disabled
[JENKINS] Archiving disabled
[JENKINS] Archiving disabled
[JENKINS] Archiving disabled
[JENKINS] Archiving disabled
[JENKINS] Archiving disabled
[JENKINS] Archiving disabled
[JENKINS] Archiving disabled
[JENKINS] Archiving disabled
[JENKINS] Archiving disabled
[JENKINS] Archiving disabled
[JENKINS] Archiving disabled
[JENKINS] Archiving disabled
[JENKINS] Archiving disabled
[JENKINS] Archiving disabled
[JENKINS] Archiving disabled
[JENKINS] Archiving disabled
[JENKINS] Archiving disabled
[JENKINS] Archiving disabled
[JENKINS] Archiving disabled
[JENKINS] Archiving disabled
[JENKINS] Archiving disabled
[JENKINS] Archiving disabled
[JENKINS] Archiving disabled
[JENKINS] Archiving disabled
[JENKINS] Archiving disabled
[JENKINS] Archiving disabled
[INFO] ------------------------------------------------------------------------
[INFO] Reactor Summary:
[INFO] 
[INFO] Apache Kerby Project ............................... FAILURE [ 16.186 s]
[INFO] Kerby-common Project ............................... SKIPPED
[INFO] Kerby ASN1 Project ................................. SKIPPED
[INFO] Kerby Config ....................................... SKIPPED
[INFO] Kerby Util ......................................... SKIPPED
[INFO] Kerby XDR Project .................................. SKIPPED
[INFO] Kerby PKIX Project ................................. SKIPPED
[INFO] Kerby-kerb Project ................................. SKIPPED
[INFO] Kerby-kerb core .................................... SKIPPED
[INFO] Kerby-kerb Crypto .................................. SKIPPED
[INFO] Kerby-kerb Common .................................. SKIPPED
[INFO] Kerby-kerb Util .................................... SKIPPED
[INFO] Kerby-kerb Identity ................................ SKIPPED
[INFO] Kerby-kerb Identity Test ........................... SKIPPED
[INFO] Kerby-kerb Client .................................. SKIPPED
[INFO] Kerby-kerb Server .................................. SKIPPED
[INFO] Kerby-kerb Admin ................................... SKIPPED
[INFO] Kerb Simple Kdc .................................... SKIPPED
[INFO] Kerby-kerb server all .............................. SKIPPED
[INFO] Kerby KDC Server ................................... SKIPPED
[INFO] Kerb Kdc Test ...................................... SKIPPED
[INFO] Kerby providers .................................... SKIPPED
[INFO] Token provider ..................................... SKIPPED
[INFO] Kerb Integration Test .............................. SKIPPED
[INFO] Kerby-kerb Admin Server ............................ SKIPPED
[INFO] Kerby-kerb client api all .......................... SKIPPED
[INFO] Kdc Tool Project ................................... SKIPPED
[INFO] Client Tool ........................................ SKIPPED
[INFO] KDC Tool ........................................... SKIPPED
[INFO] Kerby Backend ...................................... SKIPPED
[INFO] Json identity backend .............................. SKIPPED
[INFO] Kerby Kdc Test ..................................... SKIPPED
[INFO] Ldap identity backend .............................. SKIPPED
[INFO] Mavibot based backend .............................. SKIPPED
[INFO] Zookeeper identity backend ......................... SKIPPED
[INFO] Kerby Distribution ................................. SKIPPED
[INFO] KDC Dist ........................................... SKIPPED
[INFO] Tool Dist .......................................... SKIPPED
[INFO] Kerby benchmark .................................... SKIPPED
[INFO] ------------------------------------------------------------------------
[INFO] BUILD FAILURE
[INFO] ------------------------------------------------------------------------
[INFO] Total time: 52.402 s
[INFO] Finished at: 2017-05-05T12:37:44+00:00
[INFO] Final Memory: 37M/316M
[INFO] ------------------------------------------------------------------------
Waiting for Jenkins to finish collecting data
[ERROR] Failed to execute goal org.apache.maven.plugins:maven-deploy-plugin:2.8.2:deploy (default-deploy)
on project kerby-all: Failed to deploy artifacts: Could not transfer artifact org.apache.kerby:kerby-all:pom:1.0.0
from/to apache.releases.https (https://repository.apache.org/service/local/staging/deploy/maven2):
Failed to transfer file: https://repository.apache.org/service/local/staging/deploy/maven2/org/apache/kerby/kerby-all/1.0.0/kerby-all-1.0.0.pom.
Return code is: 401, ReasonPhrase: Unauthorized. -> [Help 1]
[ERROR] 
[ERROR] To see the full stack trace of the errors, re-run Maven with the -e switch.
[ERROR] Re-run Maven using the -X switch to enable full debug logging.
[ERROR] 
[ERROR] For more information about the errors and possible solutions, please read the following
articles:
[ERROR] [Help 1] http://cwiki.apache.org/confluence/display/MAVEN/MojoExecutionException
channel stopped

Mime
View raw message