directory-notifications mailing list archives

Site index · List index
Message view « Date » · « Thread »
Top « Date » · « Thread »
From Apache Jenkins Server <jenk...@builds.apache.org>
Subject Build failed in Jenkins: dir-studio-ui-tests-in-docker #36
Date Wed, 12 Apr 2017 14:03:33 GMT
See <https://builds.apache.org/job/dir-studio-ui-tests-in-docker/36/display/redirect>

------------------------------------------
[...truncated 1.90 MB...]
testHasValue[TextValueEditor - unicode](org.apache.directory.studio.test.integration.ui.ValueEditorTest)
 Time elapsed: 0 sec
testGetRawValue[TextValueEditor - unicode](org.apache.directory.studio.test.integration.ui.ValueEditorTest)
 Time elapsed: 0 sec
testGetDisplayValue[TextValueEditor - empty binary value](org.apache.directory.studio.test.integration.ui.ValueEditorTest)
 Time elapsed: 0 sec
testGetStringOrBinaryValue[TextValueEditor - empty binary value](org.apache.directory.studio.test.integration.ui.ValueEditorTest)
 Time elapsed: 0 sec
testHasValue[TextValueEditor - empty binary value](org.apache.directory.studio.test.integration.ui.ValueEditorTest)
 Time elapsed: 0 sec
testGetRawValue[TextValueEditor - empty binary value](org.apache.directory.studio.test.integration.ui.ValueEditorTest)
 Time elapsed: 0 sec
testGetDisplayValue[TextValueEditor - empty bytearray](org.apache.directory.studio.test.integration.ui.ValueEditorTest)
 Time elapsed: 0 sec
testGetStringOrBinaryValue[TextValueEditor - empty bytearray](org.apache.directory.studio.test.integration.ui.ValueEditorTest)
 Time elapsed: 0 sec
testHasValue[TextValueEditor - empty bytearray](org.apache.directory.studio.test.integration.ui.ValueEditorTest)
 Time elapsed: 0 sec
testGetRawValue[TextValueEditor - empty bytearray](org.apache.directory.studio.test.integration.ui.ValueEditorTest)
 Time elapsed: 0 sec
testGetDisplayValue[TextValueEditor - bytearray UTF8](org.apache.directory.studio.test.integration.ui.ValueEditorTest)
 Time elapsed: 0 sec
testGetStringOrBinaryValue[TextValueEditor - bytearray UTF8](org.apache.directory.studio.test.integration.ui.ValueEditorTest)
 Time elapsed: 0 sec
testHasValue[TextValueEditor - bytearray UTF8](org.apache.directory.studio.test.integration.ui.ValueEditorTest)
 Time elapsed: 0 sec
testGetRawValue[TextValueEditor - bytearray UTF8](org.apache.directory.studio.test.integration.ui.ValueEditorTest)
 Time elapsed: 0 sec
testGetDisplayValue[TextValueEditor - bytearray ISO-8859-1](org.apache.directory.studio.test.integration.ui.ValueEditorTest)
 Time elapsed: 0 sec
testGetStringOrBinaryValue[TextValueEditor - bytearray ISO-8859-1](org.apache.directory.studio.test.integration.ui.ValueEditorTest)
 Time elapsed: 0 sec
testHasValue[TextValueEditor - bytearray ISO-8859-1](org.apache.directory.studio.test.integration.ui.ValueEditorTest)
 Time elapsed: 0 sec
testGetRawValue[TextValueEditor - bytearray ISO-8859-1](org.apache.directory.studio.test.integration.ui.ValueEditorTest)
 Time elapsed: 0 sec
testGetDisplayValue[TextValueEditor - bytearray PNG](org.apache.directory.studio.test.integration.ui.ValueEditorTest)
 Time elapsed: 0 sec
testGetStringOrBinaryValue[TextValueEditor - bytearray PNG](org.apache.directory.studio.test.integration.ui.ValueEditorTest)
 Time elapsed: 0 sec
testHasValue[TextValueEditor - bytearray PNG](org.apache.directory.studio.test.integration.ui.ValueEditorTest)
 Time elapsed: 0 sec
testGetRawValue[TextValueEditor - bytearray PNG](org.apache.directory.studio.test.integration.ui.ValueEditorTest)
 Time elapsed: 0 sec
testGetDisplayValue[HexValueEditor - empty string value](org.apache.directory.studio.test.integration.ui.ValueEditorTest)
 Time elapsed: 0 sec
testGetStringOrBinaryValue[HexValueEditor - empty string value](org.apache.directory.studio.test.integration.ui.ValueEditorTest)
 Time elapsed: 0.001 sec
testHasValue[HexValueEditor - empty string value](org.apache.directory.studio.test.integration.ui.ValueEditorTest)
 Time elapsed: 0 sec
testGetRawValue[HexValueEditor - empty string value](org.apache.directory.studio.test.integration.ui.ValueEditorTest)
 Time elapsed: 0 sec
testGetDisplayValue[HexValueEditor - empty string](org.apache.directory.studio.test.integration.ui.ValueEditorTest)
 Time elapsed: 0 sec
testGetStringOrBinaryValue[HexValueEditor - empty string](org.apache.directory.studio.test.integration.ui.ValueEditorTest)
 Time elapsed: 0 sec
testHasValue[HexValueEditor - empty string](org.apache.directory.studio.test.integration.ui.ValueEditorTest)
 Time elapsed: 0 sec
testGetRawValue[HexValueEditor - empty string](org.apache.directory.studio.test.integration.ui.ValueEditorTest)
 Time elapsed: 0 sec
testGetDisplayValue[HexValueEditor - ascii](org.apache.directory.studio.test.integration.ui.ValueEditorTest)
 Time elapsed: 0 sec
testGetStringOrBinaryValue[HexValueEditor - ascii](org.apache.directory.studio.test.integration.ui.ValueEditorTest)
 Time elapsed: 0 sec
testHasValue[HexValueEditor - ascii](org.apache.directory.studio.test.integration.ui.ValueEditorTest)
 Time elapsed: 0 sec
testGetRawValue[HexValueEditor - ascii](org.apache.directory.studio.test.integration.ui.ValueEditorTest)
 Time elapsed: 0 sec
testGetDisplayValue[HexValueEditor - empty binary value](org.apache.directory.studio.test.integration.ui.ValueEditorTest)
 Time elapsed: 0 sec
testGetStringOrBinaryValue[HexValueEditor - empty binary value](org.apache.directory.studio.test.integration.ui.ValueEditorTest)
 Time elapsed: 0 sec
testHasValue[HexValueEditor - empty binary value](org.apache.directory.studio.test.integration.ui.ValueEditorTest)
 Time elapsed: 0 sec
testGetRawValue[HexValueEditor - empty binary value](org.apache.directory.studio.test.integration.ui.ValueEditorTest)
 Time elapsed: 0 sec
testGetDisplayValue[HexValueEditor - empty bytearray](org.apache.directory.studio.test.integration.ui.ValueEditorTest)
 Time elapsed: 0 sec
testGetStringOrBinaryValue[HexValueEditor - empty bytearray](org.apache.directory.studio.test.integration.ui.ValueEditorTest)
 Time elapsed: 0 sec
testHasValue[HexValueEditor - empty bytearray](org.apache.directory.studio.test.integration.ui.ValueEditorTest)
 Time elapsed: 0 sec
testGetRawValue[HexValueEditor - empty bytearray](org.apache.directory.studio.test.integration.ui.ValueEditorTest)
 Time elapsed: 0 sec
testGetDisplayValue[HexValueEditor - bytearray UTF8](org.apache.directory.studio.test.integration.ui.ValueEditorTest)
 Time elapsed: 0 sec
testGetStringOrBinaryValue[HexValueEditor - bytearray UTF8](org.apache.directory.studio.test.integration.ui.ValueEditorTest)
 Time elapsed: 0 sec
testHasValue[HexValueEditor - bytearray UTF8](org.apache.directory.studio.test.integration.ui.ValueEditorTest)
 Time elapsed: 0 sec
testGetRawValue[HexValueEditor - bytearray UTF8](org.apache.directory.studio.test.integration.ui.ValueEditorTest)
 Time elapsed: 0 sec
testGetDisplayValue[HexValueEditor - bytearray ISO-8859-1](org.apache.directory.studio.test.integration.ui.ValueEditorTest)
 Time elapsed: 0 sec
testGetStringOrBinaryValue[HexValueEditor - bytearray ISO-8859-1](org.apache.directory.studio.test.integration.ui.ValueEditorTest)
 Time elapsed: 0 sec
testHasValue[HexValueEditor - bytearray ISO-8859-1](org.apache.directory.studio.test.integration.ui.ValueEditorTest)
 Time elapsed: 0 sec
testGetRawValue[HexValueEditor - bytearray ISO-8859-1](org.apache.directory.studio.test.integration.ui.ValueEditorTest)
 Time elapsed: 0 sec
testGetDisplayValue[HexValueEditor - bytearray PNG](org.apache.directory.studio.test.integration.ui.ValueEditorTest)
 Time elapsed: 0 sec
testGetStringOrBinaryValue[HexValueEditor - bytearray PNG](org.apache.directory.studio.test.integration.ui.ValueEditorTest)
 Time elapsed: 0 sec
testHasValue[HexValueEditor - bytearray PNG](org.apache.directory.studio.test.integration.ui.ValueEditorTest)
 Time elapsed: 0 sec
testGetRawValue[HexValueEditor - bytearray PNG](org.apache.directory.studio.test.integration.ui.ValueEditorTest)
 Time elapsed: 0 sec
Running org.apache.directory.studio.test.integration.ui.CertificateValidationTest
Tests run: 12, Failures: 0, Errors: 0, Skipped: 0, Time elapsed: 87.187 sec - in org.apache.directory.studio.test.integration.ui.CertificateValidationTest
testStartTlsCertificateTrustTemporary(org.apache.directory.studio.test.integration.ui.CertificateValidationTest)
 Time elapsed: 8.412 sec
testLdapsCertificateTrustPermanent(org.apache.directory.studio.test.integration.ui.CertificateValidationTest)
 Time elapsed: 7.023 sec
testStartTlsCertificateValidationNotYetValid(org.apache.directory.studio.test.integration.ui.CertificateValidationTest)
 Time elapsed: 6.957 sec
testLdapsCertificateTrustTemporary(org.apache.directory.studio.test.integration.ui.CertificateValidationTest)
 Time elapsed: 6.756 sec
testLdapsCertificateDoNotTrust(org.apache.directory.studio.test.integration.ui.CertificateValidationTest)
 Time elapsed: 8.962 sec
testStartTlsCertificateValidationExpired(org.apache.directory.studio.test.integration.ui.CertificateValidationTest)
 Time elapsed: 6.872 sec
testLdapsCertificateValidationNotOK(org.apache.directory.studio.test.integration.ui.CertificateValidationTest)
 Time elapsed: 6.04 sec
testStartTlsCertificateTrustPermanent(org.apache.directory.studio.test.integration.ui.CertificateValidationTest)
 Time elapsed: 7.122 sec
testStartTlsCertificateValidationOK(org.apache.directory.studio.test.integration.ui.CertificateValidationTest)
 Time elapsed: 5.978 sec
testStartTlsCertificateValidationHostnameMismatch(org.apache.directory.studio.test.integration.ui.CertificateValidationTest)
 Time elapsed: 6.045 sec
testLdapsCertificateValidationOK(org.apache.directory.studio.test.integration.ui.CertificateValidationTest)
 Time elapsed: 5.86 sec
testStartTlsCertificateDoNotTrust(org.apache.directory.studio.test.integration.ui.CertificateValidationTest)
 Time elapsed: 7.73 sec
Running org.apache.directory.studio.test.integration.ui.GssApiTest
Tests run: 2, Failures: 0, Errors: 0, Skipped: 0, Time elapsed: 23.524 sec - in org.apache.directory.studio.test.integration.ui.GssApiTest
testGssApiObtainTgtAndUseManualConfigurationAndObtainServiceTicket(org.apache.directory.studio.test.integration.ui.GssApiTest)
 Time elapsed: 11.452 sec
testGssApiUseNativeTgtAndNativeConfigurationAndObtainServiceTicket(org.apache.directory.studio.test.integration.ui.GssApiTest)
 Time elapsed: 10.687 sec
Running org.apache.directory.studio.test.integration.ui.BrowserTest
Tests run: 12, Failures: 0, Errors: 0, Skipped: 0, Time elapsed: 85.539 sec - in org.apache.directory.studio.test.integration.ui.BrowserTest
testBookmark(org.apache.directory.studio.test.integration.ui.BrowserTest)  Time elapsed: 3.383
sec
testRefreshRootDSE(org.apache.directory.studio.test.integration.ui.BrowserTest)  Time elapsed:
10.714 sec
TestSetInputOnlyOnce(org.apache.directory.studio.test.integration.ui.BrowserTest)  Time elapsed:
9.039 sec
testBrowseDnWithIpHostNumber(org.apache.directory.studio.test.integration.ui.BrowserTest)
 Time elapsed: 4.578 sec
testRefreshParent(org.apache.directory.studio.test.integration.ui.BrowserTest)  Time elapsed:
6.486 sec
testCopyPasteValueToBookmark(org.apache.directory.studio.test.integration.ui.BrowserTest)
 Time elapsed: 5.687 sec
testRefreshSearchContinuation(org.apache.directory.studio.test.integration.ui.BrowserTest)
 Time elapsed: 8.191 sec
testDeleteDontUpdateUI(org.apache.directory.studio.test.integration.ui.BrowserTest)  Time
elapsed: 4.893 sec
testBrowseDnWithSharpAndHexSequence(org.apache.directory.studio.test.integration.ui.BrowserTest)
 Time elapsed: 4.538 sec
testNoModificationWhileBrowsingAndRefreshing(org.apache.directory.studio.test.integration.ui.BrowserTest)
 Time elapsed: 14.955 sec
testRefreshContextEntry(org.apache.directory.studio.test.integration.ui.BrowserTest)  Time
elapsed: 7.651 sec
testOnlyOneSearchRequestWhenExpandingEntry(org.apache.directory.studio.test.integration.ui.BrowserTest)
 Time elapsed: 3.902 sec
Running org.apache.directory.studio.test.integration.ui.RcpAppTest
Tests run: 12, Failures: 0, Errors: 0, Skipped: 0, Time elapsed: 10.637 sec - in org.apache.directory.studio.test.integration.ui.RcpAppTest
testLdapPerspectiveViews(org.apache.directory.studio.test.integration.ui.RcpAppTest)  Time
elapsed: 0.377 sec
testHiddenItemsInExportWizard(org.apache.directory.studio.test.integration.ui.RcpAppTest)
 Time elapsed: 0.297 sec
testHiddenPreferencePages(org.apache.directory.studio.test.integration.ui.RcpAppTest)  Time
elapsed: 0.307 sec
testHiddenItemsInNewWizard(org.apache.directory.studio.test.integration.ui.RcpAppTest)  Time
elapsed: 0.292 sec
testVisibleItemsInImportWizard(org.apache.directory.studio.test.integration.ui.RcpAppTest)
 Time elapsed: 0.296 sec
testVisibleItemsInExportWizard(org.apache.directory.studio.test.integration.ui.RcpAppTest)
 Time elapsed: 0.314 sec
testSchemaEditorPerspectiveViews(org.apache.directory.studio.test.integration.ui.RcpAppTest)
 Time elapsed: 1.014 sec
testVisibleItemsInOpenViewsDialog(org.apache.directory.studio.test.integration.ui.RcpAppTest)
 Time elapsed: 0.367 sec
testHiddenItemsInImportWizard(org.apache.directory.studio.test.integration.ui.RcpAppTest)
 Time elapsed: 0.282 sec
testHiddenItemsInOpenViewsDialog(org.apache.directory.studio.test.integration.ui.RcpAppTest)
 Time elapsed: 0.251 sec
testVisibleItemsInNewWizard(org.apache.directory.studio.test.integration.ui.RcpAppTest)  Time
elapsed: 0.301 sec
testVisiblePreferencePages(org.apache.directory.studio.test.integration.ui.RcpAppTest)  Time
elapsed: 5.344 sec
Running org.apache.directory.studio.test.integration.ui.SchemaEditorSearchTest
Tests run: 1, Failures: 0, Errors: 0, Skipped: 0, Time elapsed: 1.971 sec - in org.apache.directory.studio.test.integration.ui.SchemaEditorSearchTest
testSearchForAliases(org.apache.directory.studio.test.integration.ui.SchemaEditorSearchTest)
 Time elapsed: 0.799 sec
Running org.apache.directory.studio.test.integration.ui.ImportExportTest
/home/hnelson/studio/tests/test.integration.ui/target/work/data/ImportExportTest.csv
Tests run: 5, Failures: 0, Errors: 0, Skipped: 0, Time elapsed: 30.018 sec - in org.apache.directory.studio.test.integration.ui.ImportExportTest
testExportCsvShouldPrefixFormulaWithApostrophe(org.apache.directory.studio.test.integration.ui.ImportExportTest)
 Time elapsed: 4.703 sec
testImportContextEntryRefreshesRootDSE(org.apache.directory.studio.test.integration.ui.ImportExportTest)
 Time elapsed: 6.901 sec
testExportImportDsmlWithGermanUmlautInDN(org.apache.directory.studio.test.integration.ui.ImportExportTest)
 Time elapsed: 6.048 sec
testExportImportLdifWithGermanUmlautInDN(org.apache.directory.studio.test.integration.ui.ImportExportTest)
 Time elapsed: 5.704 sec
testImportDoesNotUpdateUI(org.apache.directory.studio.test.integration.ui.ImportExportTest)
 Time elapsed: 5.2 sec
Running org.apache.directory.studio.test.integration.ui.PreferencesTest
Tests run: 2, Failures: 0, Errors: 0, Skipped: 0, Time elapsed: 2.341 sec - in org.apache.directory.studio.test.integration.ui.PreferencesTest
testCertificatValidationSettingsSaved(org.apache.directory.studio.test.integration.ui.PreferencesTest)
 Time elapsed: 0.547 sec
testCertificatValidationPage(org.apache.directory.studio.test.integration.ui.PreferencesTest)
 Time elapsed: 0.668 sec
Running org.apache.directory.studio.test.integration.ui.ProgressViewTest
Tests run: 2, Failures: 0, Errors: 0, Skipped: 0, Time elapsed: 9.736 sec - in org.apache.directory.studio.test.integration.ui.ProgressViewTest
testNoRemainingOpenConnectionJobs(org.apache.directory.studio.test.integration.ui.ProgressViewTest)
 Time elapsed: 8.369 sec
testRemoveAllFinishedOperations(org.apache.directory.studio.test.integration.ui.ProgressViewTest)
 Time elapsed: 0.256 sec
Running org.apache.directory.studio.test.integration.ui.SwtResourcesTest
### SWT resouces count: 449
Tests run: 2, Failures: 0, Errors: 0, Skipped: 0, Time elapsed: 48.849 sec - in org.apache.directory.studio.test.integration.ui.SwtResourcesTest
testSwtResourcesCount(org.apache.directory.studio.test.integration.ui.SwtResourcesTest)  Time
elapsed: 2.977 sec
testSwtResourcesDelta(org.apache.directory.studio.test.integration.ui.SwtResourcesTest)  Time
elapsed: 44.241 sec
Running org.apache.directory.studio.test.integration.ui.RenameEntryDialogTest
Tests run: 4, Failures: 0, Errors: 0, Skipped: 0, Time elapsed: 24.872 sec - in org.apache.directory.studio.test.integration.ui.RenameEntryDialogTest
testRenameMultiValuedRdn(org.apache.directory.studio.test.integration.ui.RenameEntryDialogTest)
 Time elapsed: 5.574 sec
testRenameRdnWithEscapedCharacters(org.apache.directory.studio.test.integration.ui.RenameEntryDialogTest)
 Time elapsed: 5.74 sec
testRenameRdnWithTrailingSpace(org.apache.directory.studio.test.integration.ui.RenameEntryDialogTest)
 Time elapsed: 6.679 sec
testRenameRdnWithSharp(org.apache.directory.studio.test.integration.ui.RenameEntryDialogTest)
 Time elapsed: 5.648 sec
Running org.apache.directory.studio.test.integration.ui.SchemaBrowserTest
Tests run: 1, Failures: 0, Errors: 0, Skipped: 0, Time elapsed: 4.989 sec - in org.apache.directory.studio.test.integration.ui.SchemaBrowserTest
testRawSchemaDefinitionIsFilled(org.apache.directory.studio.test.integration.ui.SchemaBrowserTest)
 Time elapsed: 3.811 sec
Running org.apache.directory.studio.test.integration.ui.SearchTest
Tests run: 3, Failures: 0, Errors: 0, Skipped: 0, Time elapsed: 24.565 sec - in org.apache.directory.studio.test.integration.ui.SearchTest
testOnlyOneUiUpdateOnQuickSearch(org.apache.directory.studio.test.integration.ui.SearchTest)
 Time elapsed: 6.569 sec
testRefresh(org.apache.directory.studio.test.integration.ui.SearchTest)  Time elapsed: 7.791
sec
testCopyPasteSearchBetweenConnections(org.apache.directory.studio.test.integration.ui.SearchTest)
 Time elapsed: 7.057 sec
Running org.apache.directory.studio.test.integration.ui.NewEntryWizardTest
Tests run: 8, Failures: 0, Errors: 0, Skipped: 0, Time elapsed: 47.979 sec - in org.apache.directory.studio.test.integration.ui.NewEntryWizardTest
testCreatePersonEntry(org.apache.directory.studio.test.integration.ui.NewEntryWizardTest)
 Time elapsed: 4.67 sec
testCreateEntryBelowReferralObjectCancel(org.apache.directory.studio.test.integration.ui.NewEntryWizardTest)
 Time elapsed: 10.167 sec
testCreateEntryBelowReferralObjectFollow(org.apache.directory.studio.test.integration.ui.NewEntryWizardTest)
 Time elapsed: 5.658 sec
testCreateOrganizationEntry(org.apache.directory.studio.test.integration.ui.NewEntryWizardTest)
 Time elapsed: 4.935 sec
testCreateEntryWithSharp(org.apache.directory.studio.test.integration.ui.NewEntryWizardTest)
 Time elapsed: 5.07 sec
testCreateEntryWithSlash(org.apache.directory.studio.test.integration.ui.NewEntryWizardTest)
 Time elapsed: 4.826 sec
testCreateUpperCaseOrganizationEntries(org.apache.directory.studio.test.integration.ui.NewEntryWizardTest)
 Time elapsed: 6.142 sec
testCreateMvRdnWithNumericOid(org.apache.directory.studio.test.integration.ui.NewEntryWizardTest)
 Time elapsed: 5.031 sec
Running org.apache.directory.studio.test.integration.ui.NewConnectionWizardTest
The connection failed
 - qwertzuiop.asdfghjkl.yxcvbnm:33197
Tests run: 6, Failures: 0, Errors: 0, Skipped: 0, Time elapsed: 7.736 sec - in org.apache.directory.studio.test.integration.ui.NewConnectionWizardTest
testCheckAuthenticationButtonNotOK(org.apache.directory.studio.test.integration.ui.NewConnectionWizardTest)
 Time elapsed: 0.521 sec
testCreateConnection(org.apache.directory.studio.test.integration.ui.NewConnectionWizardTest)
 Time elapsed: 3.355 sec
testCheckNetworkParameterButtonNotOK(org.apache.directory.studio.test.integration.ui.NewConnectionWizardTest)
 Time elapsed: 1.013 sec
testCheckAuthenticationButtonOK(org.apache.directory.studio.test.integration.ui.NewConnectionWizardTest)
 Time elapsed: 0.509 sec
testCheckNetworkParameterButtonOK(org.apache.directory.studio.test.integration.ui.NewConnectionWizardTest)
 Time elapsed: 0.505 sec
testEnabledDisabledWidgets(org.apache.directory.studio.test.integration.ui.NewConnectionWizardTest)
 Time elapsed: 0.723 sec
Running org.apache.directory.studio.test.integration.ui.EntryEditorTest
Tests run: 4, Failures: 0, Errors: 0, Skipped: 0, Time elapsed: 27.814 sec - in org.apache.directory.studio.test.integration.ui.EntryEditorTest
testCopyPaste(org.apache.directory.studio.test.integration.ui.EntryEditorTest)  Time elapsed:
5.322 sec
testPasswordValueEditor(org.apache.directory.studio.test.integration.ui.EntryEditorTest) 
Time elapsed: 7.606 sec
testAddEditDeleteAttribute(org.apache.directory.studio.test.integration.ui.EntryEditorTest)
 Time elapsed: 6.868 sec
testDnValueEditor(org.apache.directory.studio.test.integration.ui.EntryEditorTest)  Time elapsed:
6.736 sec

Results :

Failed tests: 
  ApacheDSPluginTest.verifyServerNameCollisionInNewWizard:190 expected:<0> but was:<1>
  ApacheDSPluginTest.serverCreationStartCreateConnectionStopAndDeletion:91->createServer:153
expected:<0> but was:<1>

Tests in error: 
  ApacheDSPluginTest.repairAndStartAndStop:411 » Timeout Timeout after: 60000 ms...

Tests run: 226, Failures: 2, Errors: 1, Skipped: 0

[INFO] ------------------------------------------------------------------------
[INFO] Reactor Summary:
[INFO] 
[INFO] Apache Directory Studio Parent ..................... SUCCESS [  0.885 s]
[INFO] Apache Directory Studio Target Platform for Eclipse  SUCCESS [  0.142 s]
[INFO] Apache Directory Studio Plugins .................... SUCCESS [  0.693 s]
[INFO] Apache Directory Studio Common UI .................. SUCCESS [  3.001 s]
[INFO] Apache Directory Studio Common Core ................ SUCCESS [  0.247 s]
[INFO] Apache Directory Studio LDIF Parser ................ SUCCESS [  2.282 s]
[INFO] Apache Directory Studio Connection Core ............ SUCCESS [  1.117 s]
[INFO] Apache Directory Studio Connection UI .............. SUCCESS [  0.968 s]
[INFO] Apache Directory Studio LDAP Browser Core .......... SUCCESS [  3.137 s]
[INFO] Apache Directory Studio LDAP Browser Common ........ SUCCESS [  2.842 s]
[INFO] Apache Directory Studio Value Editors .............. SUCCESS [  1.564 s]
[INFO] Apache Directory Studio ACI Item Editor ............ SUCCESS [  0.605 s]
[INFO] Apache Directory Studio ApacheDS Configuration ..... SUCCESS [  0.887 s]
[INFO] Apache Directory Studio LDIF Editor ................ SUCCESS [  0.542 s]
[INFO] Apache Directory Studio LDAP Browser UI ............ SUCCESS [  1.462 s]
[INFO] Apache Directory Studio LDAP Servers ............... SUCCESS [  0.483 s]
[INFO] Apache Directory Studio ApacheDS LDAP Server Adapter SUCCESS [  4.847 s]
[INFO] Apache Directory Studio RCP ........................ SUCCESS [  0.395 s]
[INFO] Apache Directory Studio Schema Editor .............. SUCCESS [  3.073 s]
[INFO] Apache Directory Studio OpenLDAP Common UI ......... SUCCESS [  1.331 s]
[INFO] Apache Directory Studio OpenLDAP Syncrepl .......... SUCCESS [  1.044 s]
[INFO] Apache Directory Studio OpenLDAP Configuration Editor SUCCESS [  2.612 s]
[INFO] Apache Directory Studio OpenLDAP ACL Configuration Editor SUCCESS [  2.639 s]
[INFO] Apache Directory Studio Template Editor ............ SUCCESS [  1.959 s]
[INFO] Apache Directory Studio Combined Editor ............ SUCCESS [  0.321 s]
[INFO] Apache Directory Studio SLF4J to Eclipse Log Binding SUCCESS [  0.090 s]
[INFO] Apache Directory Studio Help Plugins ............... SUCCESS [  0.013 s]
[INFO] Apache Directory Studio Apache DS Help ............. SUCCESS [  4.690 s]
[INFO] Apache Directory Studio LDAP Browser Help .......... SUCCESS [  9.615 s]
[INFO] Apache Directory Studio LDIF Editor Help ........... SUCCESS [  1.913 s]
[INFO] Apache Directory Studio RCP Help ................... SUCCESS [  1.802 s]
[INFO] Apache Directory Studio Schema Editor Help ......... SUCCESS [  2.430 s]
[INFO] Apache Directory Studio Feature Plugins ............ SUCCESS [  0.034 s]
[INFO] Apache Directory Studio ApacheDS Feature ........... SUCCESS [  0.151 s]
[INFO] Apache Directory Studio LDAP Browser Feature ....... SUCCESS [  0.133 s]
[INFO] Apache Directory Studio LDIF Editor Feature ........ SUCCESS [  0.111 s]
[INFO] Apache Directory Studio RCP Feature ................ SUCCESS [  0.192 s]
[INFO] Apache Directory Studio Schema Editor Feature ...... SUCCESS [  0.105 s]
[INFO] Apache Directory Studio OpenLDAP Feature ........... SUCCESS [  0.097 s]
[INFO] Apache Directory Studio National Language Support Feature SUCCESS [  0.452 s]
[INFO] Apache Directory Studio Test Plugins ............... SUCCESS [  0.018 s]
[INFO] Apache Directory Studio Core Integration Tests ..... SUCCESS [ 32.033 s]
[INFO] Apache Directory Studio UI Integration Tests ....... FAILURE [09:18 min]
[INFO] Apache Directory Studio P2 Repositories ............ SKIPPED
[INFO] Apache Directory Studio P2 Repository Dependencies . SKIPPED
[INFO] Apache Directory Studio P2 Repository Eclipse ...... SKIPPED
[INFO] Apache Directory Studio Product .................... SKIPPED
[INFO] Apache Directory Studio Installers ................. SKIPPED
[INFO] ------------------------------------------------------------------------
[INFO] BUILD FAILURE
[INFO] ------------------------------------------------------------------------
[INFO] Total time: 18:57 min
[INFO] Finished at: 2017-04-12T14:03:16+00:00
[INFO] Final Memory: 296M/3140M
[INFO] ------------------------------------------------------------------------
[ERROR] Failed to execute goal org.eclipse.tycho:tycho-surefire-plugin:0.24.0:test (default-test)
on project org.apache.directory.studio.test.integration.ui: There are test failures.
[ERROR] 
[ERROR] Please refer to /home/hnelson/studio/tests/test.integration.ui/target/surefire-reports
for the individual test results.
[ERROR] -> [Help 1]
[ERROR] 
[ERROR] To see the full stack trace of the errors, re-run Maven with the -e switch.
[ERROR] Re-run Maven using the -X switch to enable full debug logging.
[ERROR] 
[ERROR] For more information about the errors and possible solutions, please read the following
articles:
[ERROR] [Help 1] http://cwiki.apache.org/confluence/display/MAVEN/MojoFailureException
[ERROR] 
[ERROR] After correcting the problems, you can resume the build with the command
[ERROR]   mvn <goals> -rf :org.apache.directory.studio.test.integration.ui
Build step 'Execute shell' marked build as failure
Recording test results

Mime
View raw message