directory-notifications mailing list archives

Site index · List index
Message view « Date » · « Thread »
Top « Date » · « Thread »
From Apache Jenkins Server <jenk...@builds.apache.org>
Subject Build failed in Jenkins: dir-studio-ui-tests-in-docker #38
Date Thu, 27 Apr 2017 18:59:36 GMT
See <https://builds.apache.org/job/dir-studio-ui-tests-in-docker/38/display/redirect>

------------------------------------------
[...truncated 1.93 MB...]
testHasValue[TextValueEditor - unicode](org.apache.directory.studio.test.integration.ui.ValueEditorTest)
 Time elapsed: 0 sec
testGetRawValue[TextValueEditor - unicode](org.apache.directory.studio.test.integration.ui.ValueEditorTest)
 Time elapsed: 0 sec
testGetDisplayValue[TextValueEditor - empty binary value](org.apache.directory.studio.test.integration.ui.ValueEditorTest)
 Time elapsed: 0 sec
testGetStringOrBinaryValue[TextValueEditor - empty binary value](org.apache.directory.studio.test.integration.ui.ValueEditorTest)
 Time elapsed: 0 sec
testHasValue[TextValueEditor - empty binary value](org.apache.directory.studio.test.integration.ui.ValueEditorTest)
 Time elapsed: 0 sec
testGetRawValue[TextValueEditor - empty binary value](org.apache.directory.studio.test.integration.ui.ValueEditorTest)
 Time elapsed: 0.001 sec
testGetDisplayValue[TextValueEditor - empty bytearray](org.apache.directory.studio.test.integration.ui.ValueEditorTest)
 Time elapsed: 0 sec
testGetStringOrBinaryValue[TextValueEditor - empty bytearray](org.apache.directory.studio.test.integration.ui.ValueEditorTest)
 Time elapsed: 0 sec
testHasValue[TextValueEditor - empty bytearray](org.apache.directory.studio.test.integration.ui.ValueEditorTest)
 Time elapsed: 0 sec
testGetRawValue[TextValueEditor - empty bytearray](org.apache.directory.studio.test.integration.ui.ValueEditorTest)
 Time elapsed: 0 sec
testGetDisplayValue[TextValueEditor - bytearray UTF8](org.apache.directory.studio.test.integration.ui.ValueEditorTest)
 Time elapsed: 0 sec
testGetStringOrBinaryValue[TextValueEditor - bytearray UTF8](org.apache.directory.studio.test.integration.ui.ValueEditorTest)
 Time elapsed: 0.001 sec
testHasValue[TextValueEditor - bytearray UTF8](org.apache.directory.studio.test.integration.ui.ValueEditorTest)
 Time elapsed: 0 sec
testGetRawValue[TextValueEditor - bytearray UTF8](org.apache.directory.studio.test.integration.ui.ValueEditorTest)
 Time elapsed: 0 sec
testGetDisplayValue[TextValueEditor - bytearray ISO-8859-1](org.apache.directory.studio.test.integration.ui.ValueEditorTest)
 Time elapsed: 0 sec
testGetStringOrBinaryValue[TextValueEditor - bytearray ISO-8859-1](org.apache.directory.studio.test.integration.ui.ValueEditorTest)
 Time elapsed: 0 sec
testHasValue[TextValueEditor - bytearray ISO-8859-1](org.apache.directory.studio.test.integration.ui.ValueEditorTest)
 Time elapsed: 0 sec
testGetRawValue[TextValueEditor - bytearray ISO-8859-1](org.apache.directory.studio.test.integration.ui.ValueEditorTest)
 Time elapsed: 0 sec
testGetDisplayValue[TextValueEditor - bytearray PNG](org.apache.directory.studio.test.integration.ui.ValueEditorTest)
 Time elapsed: 0.001 sec
testGetStringOrBinaryValue[TextValueEditor - bytearray PNG](org.apache.directory.studio.test.integration.ui.ValueEditorTest)
 Time elapsed: 0 sec
testHasValue[TextValueEditor - bytearray PNG](org.apache.directory.studio.test.integration.ui.ValueEditorTest)
 Time elapsed: 0 sec
testGetRawValue[TextValueEditor - bytearray PNG](org.apache.directory.studio.test.integration.ui.ValueEditorTest)
 Time elapsed: 0 sec
testGetDisplayValue[HexValueEditor - empty string value](org.apache.directory.studio.test.integration.ui.ValueEditorTest)
 Time elapsed: 0 sec
testGetStringOrBinaryValue[HexValueEditor - empty string value](org.apache.directory.studio.test.integration.ui.ValueEditorTest)
 Time elapsed: 0.001 sec
testHasValue[HexValueEditor - empty string value](org.apache.directory.studio.test.integration.ui.ValueEditorTest)
 Time elapsed: 0 sec
testGetRawValue[HexValueEditor - empty string value](org.apache.directory.studio.test.integration.ui.ValueEditorTest)
 Time elapsed: 0.001 sec
testGetDisplayValue[HexValueEditor - empty string](org.apache.directory.studio.test.integration.ui.ValueEditorTest)
 Time elapsed: 0 sec
testGetStringOrBinaryValue[HexValueEditor - empty string](org.apache.directory.studio.test.integration.ui.ValueEditorTest)
 Time elapsed: 0 sec
testHasValue[HexValueEditor - empty string](org.apache.directory.studio.test.integration.ui.ValueEditorTest)
 Time elapsed: 0 sec
testGetRawValue[HexValueEditor - empty string](org.apache.directory.studio.test.integration.ui.ValueEditorTest)
 Time elapsed: 0 sec
testGetDisplayValue[HexValueEditor - ascii](org.apache.directory.studio.test.integration.ui.ValueEditorTest)
 Time elapsed: 0 sec
testGetStringOrBinaryValue[HexValueEditor - ascii](org.apache.directory.studio.test.integration.ui.ValueEditorTest)
 Time elapsed: 0 sec
testHasValue[HexValueEditor - ascii](org.apache.directory.studio.test.integration.ui.ValueEditorTest)
 Time elapsed: 0 sec
testGetRawValue[HexValueEditor - ascii](org.apache.directory.studio.test.integration.ui.ValueEditorTest)
 Time elapsed: 0 sec
testGetDisplayValue[HexValueEditor - empty binary value](org.apache.directory.studio.test.integration.ui.ValueEditorTest)
 Time elapsed: 0 sec
testGetStringOrBinaryValue[HexValueEditor - empty binary value](org.apache.directory.studio.test.integration.ui.ValueEditorTest)
 Time elapsed: 0 sec
testHasValue[HexValueEditor - empty binary value](org.apache.directory.studio.test.integration.ui.ValueEditorTest)
 Time elapsed: 0 sec
testGetRawValue[HexValueEditor - empty binary value](org.apache.directory.studio.test.integration.ui.ValueEditorTest)
 Time elapsed: 0 sec
testGetDisplayValue[HexValueEditor - empty bytearray](org.apache.directory.studio.test.integration.ui.ValueEditorTest)
 Time elapsed: 0 sec
testGetStringOrBinaryValue[HexValueEditor - empty bytearray](org.apache.directory.studio.test.integration.ui.ValueEditorTest)
 Time elapsed: 0 sec
testHasValue[HexValueEditor - empty bytearray](org.apache.directory.studio.test.integration.ui.ValueEditorTest)
 Time elapsed: 0 sec
testGetRawValue[HexValueEditor - empty bytearray](org.apache.directory.studio.test.integration.ui.ValueEditorTest)
 Time elapsed: 0.001 sec
testGetDisplayValue[HexValueEditor - bytearray UTF8](org.apache.directory.studio.test.integration.ui.ValueEditorTest)
 Time elapsed: 0 sec
testGetStringOrBinaryValue[HexValueEditor - bytearray UTF8](org.apache.directory.studio.test.integration.ui.ValueEditorTest)
 Time elapsed: 0 sec
testHasValue[HexValueEditor - bytearray UTF8](org.apache.directory.studio.test.integration.ui.ValueEditorTest)
 Time elapsed: 0 sec
testGetRawValue[HexValueEditor - bytearray UTF8](org.apache.directory.studio.test.integration.ui.ValueEditorTest)
 Time elapsed: 0 sec
testGetDisplayValue[HexValueEditor - bytearray ISO-8859-1](org.apache.directory.studio.test.integration.ui.ValueEditorTest)
 Time elapsed: 0 sec
testGetStringOrBinaryValue[HexValueEditor - bytearray ISO-8859-1](org.apache.directory.studio.test.integration.ui.ValueEditorTest)
 Time elapsed: 0 sec
testHasValue[HexValueEditor - bytearray ISO-8859-1](org.apache.directory.studio.test.integration.ui.ValueEditorTest)
 Time elapsed: 0.001 sec
testGetRawValue[HexValueEditor - bytearray ISO-8859-1](org.apache.directory.studio.test.integration.ui.ValueEditorTest)
 Time elapsed: 0 sec
testGetDisplayValue[HexValueEditor - bytearray PNG](org.apache.directory.studio.test.integration.ui.ValueEditorTest)
 Time elapsed: 0 sec
testGetStringOrBinaryValue[HexValueEditor - bytearray PNG](org.apache.directory.studio.test.integration.ui.ValueEditorTest)
 Time elapsed: 0 sec
testHasValue[HexValueEditor - bytearray PNG](org.apache.directory.studio.test.integration.ui.ValueEditorTest)
 Time elapsed: 0 sec
testGetRawValue[HexValueEditor - bytearray PNG](org.apache.directory.studio.test.integration.ui.ValueEditorTest)
 Time elapsed: 0 sec
Running org.apache.directory.studio.test.integration.ui.CertificateValidationTest
Tests run: 12, Failures: 0, Errors: 0, Skipped: 0, Time elapsed: 92.141 sec - in org.apache.directory.studio.test.integration.ui.CertificateValidationTest
testStartTlsCertificateTrustTemporary(org.apache.directory.studio.test.integration.ui.CertificateValidationTest)
 Time elapsed: 10.265 sec
testLdapsCertificateTrustPermanent(org.apache.directory.studio.test.integration.ui.CertificateValidationTest)
 Time elapsed: 7.959 sec
testStartTlsCertificateValidationNotYetValid(org.apache.directory.studio.test.integration.ui.CertificateValidationTest)
 Time elapsed: 6.099 sec
testLdapsCertificateTrustTemporary(org.apache.directory.studio.test.integration.ui.CertificateValidationTest)
 Time elapsed: 7.09 sec
testLdapsCertificateDoNotTrust(org.apache.directory.studio.test.integration.ui.CertificateValidationTest)
 Time elapsed: 9.977 sec
testStartTlsCertificateValidationExpired(org.apache.directory.studio.test.integration.ui.CertificateValidationTest)
 Time elapsed: 6.071 sec
testLdapsCertificateValidationNotOK(org.apache.directory.studio.test.integration.ui.CertificateValidationTest)
 Time elapsed: 6.479 sec
testStartTlsCertificateTrustPermanent(org.apache.directory.studio.test.integration.ui.CertificateValidationTest)
 Time elapsed: 7.269 sec
testStartTlsCertificateValidationOK(org.apache.directory.studio.test.integration.ui.CertificateValidationTest)
 Time elapsed: 7.15 sec
testStartTlsCertificateValidationHostnameMismatch(org.apache.directory.studio.test.integration.ui.CertificateValidationTest)
 Time elapsed: 7.001 sec
testLdapsCertificateValidationOK(org.apache.directory.studio.test.integration.ui.CertificateValidationTest)
 Time elapsed: 5.975 sec
testStartTlsCertificateDoNotTrust(org.apache.directory.studio.test.integration.ui.CertificateValidationTest)
 Time elapsed: 7.199 sec
Running org.apache.directory.studio.test.integration.ui.GssApiTest
Tests run: 2, Failures: 0, Errors: 0, Skipped: 0, Time elapsed: 27.751 sec - in org.apache.directory.studio.test.integration.ui.GssApiTest
testGssApiObtainTgtAndUseManualConfigurationAndObtainServiceTicket(org.apache.directory.studio.test.integration.ui.GssApiTest)
 Time elapsed: 12.893 sec
testGssApiUseNativeTgtAndNativeConfigurationAndObtainServiceTicket(org.apache.directory.studio.test.integration.ui.GssApiTest)
 Time elapsed: 13.093 sec
Running org.apache.directory.studio.test.integration.ui.BrowserTest
Tests run: 12, Failures: 0, Errors: 0, Skipped: 0, Time elapsed: 91.778 sec - in org.apache.directory.studio.test.integration.ui.BrowserTest
testBookmark(org.apache.directory.studio.test.integration.ui.BrowserTest)  Time elapsed: 3.989
sec
testRefreshRootDSE(org.apache.directory.studio.test.integration.ui.BrowserTest)  Time elapsed:
11.142 sec
TestSetInputOnlyOnce(org.apache.directory.studio.test.integration.ui.BrowserTest)  Time elapsed:
9.786 sec
testBrowseDnWithIpHostNumber(org.apache.directory.studio.test.integration.ui.BrowserTest)
 Time elapsed: 5.092 sec
testRefreshParent(org.apache.directory.studio.test.integration.ui.BrowserTest)  Time elapsed:
7.156 sec
testCopyPasteValueToBookmark(org.apache.directory.studio.test.integration.ui.BrowserTest)
 Time elapsed: 6.024 sec
testRefreshSearchContinuation(org.apache.directory.studio.test.integration.ui.BrowserTest)
 Time elapsed: 9.103 sec
testDeleteDontUpdateUI(org.apache.directory.studio.test.integration.ui.BrowserTest)  Time
elapsed: 5.445 sec
testBrowseDnWithSharpAndHexSequence(org.apache.directory.studio.test.integration.ui.BrowserTest)
 Time elapsed: 4.928 sec
testNoModificationWhileBrowsingAndRefreshing(org.apache.directory.studio.test.integration.ui.BrowserTest)
 Time elapsed: 15.085 sec
testRefreshContextEntry(org.apache.directory.studio.test.integration.ui.BrowserTest)  Time
elapsed: 8.036 sec
testOnlyOneSearchRequestWhenExpandingEntry(org.apache.directory.studio.test.integration.ui.BrowserTest)
 Time elapsed: 4.28 sec
Running org.apache.directory.studio.test.integration.ui.RcpAppTest
Tests run: 12, Failures: 0, Errors: 0, Skipped: 0, Time elapsed: 11.588 sec - in org.apache.directory.studio.test.integration.ui.RcpAppTest
testLdapPerspectiveViews(org.apache.directory.studio.test.integration.ui.RcpAppTest)  Time
elapsed: 0.437 sec
testHiddenItemsInExportWizard(org.apache.directory.studio.test.integration.ui.RcpAppTest)
 Time elapsed: 0.354 sec
testHiddenPreferencePages(org.apache.directory.studio.test.integration.ui.RcpAppTest)  Time
elapsed: 0.348 sec
testHiddenItemsInNewWizard(org.apache.directory.studio.test.integration.ui.RcpAppTest)  Time
elapsed: 0.357 sec
testVisibleItemsInImportWizard(org.apache.directory.studio.test.integration.ui.RcpAppTest)
 Time elapsed: 0.345 sec
testVisibleItemsInExportWizard(org.apache.directory.studio.test.integration.ui.RcpAppTest)
 Time elapsed: 0.364 sec
testSchemaEditorPerspectiveViews(org.apache.directory.studio.test.integration.ui.RcpAppTest)
 Time elapsed: 1.108 sec
testVisibleItemsInOpenViewsDialog(org.apache.directory.studio.test.integration.ui.RcpAppTest)
 Time elapsed: 0.387 sec
testHiddenItemsInImportWizard(org.apache.directory.studio.test.integration.ui.RcpAppTest)
 Time elapsed: 0.354 sec
testHiddenItemsInOpenViewsDialog(org.apache.directory.studio.test.integration.ui.RcpAppTest)
 Time elapsed: 0.389 sec
testVisibleItemsInNewWizard(org.apache.directory.studio.test.integration.ui.RcpAppTest)  Time
elapsed: 0.354 sec
testVisiblePreferencePages(org.apache.directory.studio.test.integration.ui.RcpAppTest)  Time
elapsed: 5.38 sec
Running org.apache.directory.studio.test.integration.ui.SchemaEditorSearchTest
Tests run: 1, Failures: 0, Errors: 0, Skipped: 0, Time elapsed: 2.417 sec - in org.apache.directory.studio.test.integration.ui.SchemaEditorSearchTest
testSearchForAliases(org.apache.directory.studio.test.integration.ui.SchemaEditorSearchTest)
 Time elapsed: 1.057 sec
Running org.apache.directory.studio.test.integration.ui.ImportExportTest
/home/hnelson/studio/tests/test.integration.ui/target/work/data/ImportExportTest.csv
Tests run: 5, Failures: 0, Errors: 0, Skipped: 0, Time elapsed: 33.501 sec - in org.apache.directory.studio.test.integration.ui.ImportExportTest
testExportCsvShouldPrefixFormulaWithApostrophe(org.apache.directory.studio.test.integration.ui.ImportExportTest)
 Time elapsed: 5.227 sec
testImportContextEntryRefreshesRootDSE(org.apache.directory.studio.test.integration.ui.ImportExportTest)
 Time elapsed: 7.915 sec
testExportImportDsmlWithGermanUmlautInDN(org.apache.directory.studio.test.integration.ui.ImportExportTest)
 Time elapsed: 7.184 sec
testExportImportLdifWithGermanUmlautInDN(org.apache.directory.studio.test.integration.ui.ImportExportTest)
 Time elapsed: 6.255 sec
testImportDoesNotUpdateUI(org.apache.directory.studio.test.integration.ui.ImportExportTest)
 Time elapsed: 5.4 sec
Running org.apache.directory.studio.test.integration.ui.PreferencesTest
Tests run: 2, Failures: 0, Errors: 0, Skipped: 0, Time elapsed: 2.996 sec - in org.apache.directory.studio.test.integration.ui.PreferencesTest
testCertificatValidationSettingsSaved(org.apache.directory.studio.test.integration.ui.PreferencesTest)
 Time elapsed: 0.622 sec
testCertificatValidationPage(org.apache.directory.studio.test.integration.ui.PreferencesTest)
 Time elapsed: 0.866 sec
Running org.apache.directory.studio.test.integration.ui.ProgressViewTest
Tests run: 2, Failures: 0, Errors: 0, Skipped: 0, Time elapsed: 10.926 sec - in org.apache.directory.studio.test.integration.ui.ProgressViewTest
testNoRemainingOpenConnectionJobs(org.apache.directory.studio.test.integration.ui.ProgressViewTest)
 Time elapsed: 9.437 sec
testRemoveAllFinishedOperations(org.apache.directory.studio.test.integration.ui.ProgressViewTest)
 Time elapsed: 0.281 sec
Running org.apache.directory.studio.test.integration.ui.SwtResourcesTest
### SWT resouces count: 449
Tests run: 2, Failures: 0, Errors: 0, Skipped: 0, Time elapsed: 57.155 sec - in org.apache.directory.studio.test.integration.ui.SwtResourcesTest
testSwtResourcesCount(org.apache.directory.studio.test.integration.ui.SwtResourcesTest)  Time
elapsed: 3.225 sec
testSwtResourcesDelta(org.apache.directory.studio.test.integration.ui.SwtResourcesTest)  Time
elapsed: 52.159 sec
Running org.apache.directory.studio.test.integration.ui.RenameEntryDialogTest
Tests run: 4, Failures: 0, Errors: 0, Skipped: 0, Time elapsed: 26.719 sec - in org.apache.directory.studio.test.integration.ui.RenameEntryDialogTest
testRenameMultiValuedRdn(org.apache.directory.studio.test.integration.ui.RenameEntryDialogTest)
 Time elapsed: 6.308 sec
testRenameRdnWithEscapedCharacters(org.apache.directory.studio.test.integration.ui.RenameEntryDialogTest)
 Time elapsed: 5.924 sec
testRenameRdnWithTrailingSpace(org.apache.directory.studio.test.integration.ui.RenameEntryDialogTest)
 Time elapsed: 7.286 sec
testRenameRdnWithSharp(org.apache.directory.studio.test.integration.ui.RenameEntryDialogTest)
 Time elapsed: 5.855 sec
Running org.apache.directory.studio.test.integration.ui.SchemaBrowserTest
Tests run: 1, Failures: 0, Errors: 0, Skipped: 0, Time elapsed: 5.407 sec - in org.apache.directory.studio.test.integration.ui.SchemaBrowserTest
testRawSchemaDefinitionIsFilled(org.apache.directory.studio.test.integration.ui.SchemaBrowserTest)
 Time elapsed: 4.125 sec
Running org.apache.directory.studio.test.integration.ui.SearchTest
Tests run: 3, Failures: 0, Errors: 0, Skipped: 0, Time elapsed: 24.681 sec - in org.apache.directory.studio.test.integration.ui.SearchTest
testOnlyOneUiUpdateOnQuickSearch(org.apache.directory.studio.test.integration.ui.SearchTest)
 Time elapsed: 7.078 sec
testRefresh(org.apache.directory.studio.test.integration.ui.SearchTest)  Time elapsed: 8.531
sec
testCopyPasteSearchBetweenConnections(org.apache.directory.studio.test.integration.ui.SearchTest)
 Time elapsed: 7.79 sec
Running org.apache.directory.studio.test.integration.ui.NewEntryWizardTest
Tests run: 8, Failures: 0, Errors: 0, Skipped: 0, Time elapsed: 52.668 sec - in org.apache.directory.studio.test.integration.ui.NewEntryWizardTest
testCreatePersonEntry(org.apache.directory.studio.test.integration.ui.NewEntryWizardTest)
 Time elapsed: 5.576 sec
testCreateEntryBelowReferralObjectCancel(org.apache.directory.studio.test.integration.ui.NewEntryWizardTest)
 Time elapsed: 7.118 sec
testCreateEntryBelowReferralObjectFollow(org.apache.directory.studio.test.integration.ui.NewEntryWizardTest)
 Time elapsed: 7.791 sec
testCreateOrganizationEntry(org.apache.directory.studio.test.integration.ui.NewEntryWizardTest)
 Time elapsed: 5.346 sec
testCreateEntryWithSharp(org.apache.directory.studio.test.integration.ui.NewEntryWizardTest)
 Time elapsed: 5.695 sec
testCreateEntryWithSlash(org.apache.directory.studio.test.integration.ui.NewEntryWizardTest)
 Time elapsed: 5.709 sec
testCreateUpperCaseOrganizationEntries(org.apache.directory.studio.test.integration.ui.NewEntryWizardTest)
 Time elapsed: 6.735 sec
testCreateMvRdnWithNumericOid(org.apache.directory.studio.test.integration.ui.NewEntryWizardTest)
 Time elapsed: 5.638 sec
Running org.apache.directory.studio.test.integration.ui.NewConnectionWizardTest
The connection failed
 - Cannot connect to the server: Hostname 'qwertzuiop.asdfghjkl.yxcvbnm' could not be resolved.
Tests run: 6, Failures: 0, Errors: 0, Skipped: 0, Time elapsed: 18.51 sec - in org.apache.directory.studio.test.integration.ui.NewConnectionWizardTest
testCheckAuthenticationButtonNotOK(org.apache.directory.studio.test.integration.ui.NewConnectionWizardTest)
 Time elapsed: 0.568 sec
testCreateConnection(org.apache.directory.studio.test.integration.ui.NewConnectionWizardTest)
 Time elapsed: 3.869 sec
testCheckNetworkParameterButtonNotOK(org.apache.directory.studio.test.integration.ui.NewConnectionWizardTest)
 Time elapsed: 11.066 sec
testCheckAuthenticationButtonOK(org.apache.directory.studio.test.integration.ui.NewConnectionWizardTest)
 Time elapsed: 0.516 sec
testCheckNetworkParameterButtonOK(org.apache.directory.studio.test.integration.ui.NewConnectionWizardTest)
 Time elapsed: 0.508 sec
testEnabledDisabledWidgets(org.apache.directory.studio.test.integration.ui.NewConnectionWizardTest)
 Time elapsed: 0.712 sec
Running org.apache.directory.studio.test.integration.ui.EntryEditorTest
Tests run: 4, Failures: 0, Errors: 0, Skipped: 0, Time elapsed: 31.072 sec - in org.apache.directory.studio.test.integration.ui.EntryEditorTest
testCopyPaste(org.apache.directory.studio.test.integration.ui.EntryEditorTest)  Time elapsed:
5.753 sec
testPasswordValueEditor(org.apache.directory.studio.test.integration.ui.EntryEditorTest) 
Time elapsed: 8.256 sec
testAddEditDeleteAttribute(org.apache.directory.studio.test.integration.ui.EntryEditorTest)
 Time elapsed: 7.709 sec
testDnValueEditor(org.apache.directory.studio.test.integration.ui.EntryEditorTest)  Time elapsed:
7.871 sec

Results :

Failed tests: 
  ApacheDSPluginTest.verifyServerNameCollisionInNewWizard:190 expected:<0> but was:<1>
  ApacheDSPluginTest.serverCreationStartCreateConnectionStopAndDeletion:91->createServer:153
expected:<0> but was:<1>

Tests in error: 
  ApacheDSPluginTest.repairAndStartAndStop:411 » Timeout Timeout after: 60000 ms...

Tests run: 226, Failures: 2, Errors: 1, Skipped: 0

[INFO] ------------------------------------------------------------------------
[INFO] Reactor Summary:
[INFO] 
[INFO] Apache Directory Studio Parent ..................... SUCCESS [  0.973 s]
[INFO] Apache Directory Studio Target Platform for Eclipse  SUCCESS [  0.168 s]
[INFO] Apache Directory Studio Plugins .................... SUCCESS [  0.839 s]
[INFO] Apache Directory Studio Common UI .................. SUCCESS [  3.592 s]
[INFO] Apache Directory Studio Common Core ................ SUCCESS [  0.351 s]
[INFO] Apache Directory Studio LDIF Parser ................ SUCCESS [  2.801 s]
[INFO] Apache Directory Studio Connection Core ............ SUCCESS [  1.484 s]
[INFO] Apache Directory Studio Connection UI .............. SUCCESS [  1.117 s]
[INFO] Apache Directory Studio LDAP Browser Core .......... SUCCESS [  3.893 s]
[INFO] Apache Directory Studio LDAP Browser Common ........ SUCCESS [  3.936 s]
[INFO] Apache Directory Studio Value Editors .............. SUCCESS [  1.989 s]
[INFO] Apache Directory Studio ACI Item Editor ............ SUCCESS [  0.787 s]
[INFO] Apache Directory Studio ApacheDS Configuration ..... SUCCESS [  0.916 s]
[INFO] Apache Directory Studio LDIF Editor ................ SUCCESS [  0.514 s]
[INFO] Apache Directory Studio LDAP Browser UI ............ SUCCESS [  1.603 s]
[INFO] Apache Directory Studio LDAP Servers ............... SUCCESS [  0.555 s]
[INFO] Apache Directory Studio ApacheDS LDAP Server Adapter SUCCESS [  4.820 s]
[INFO] Apache Directory Studio RCP ........................ SUCCESS [  0.456 s]
[INFO] Apache Directory Studio Schema Editor .............. SUCCESS [  3.101 s]
[INFO] Apache Directory Studio OpenLDAP Common UI ......... SUCCESS [  1.552 s]
[INFO] Apache Directory Studio OpenLDAP Syncrepl .......... SUCCESS [  1.109 s]
[INFO] Apache Directory Studio OpenLDAP Configuration Editor SUCCESS [  2.707 s]
[INFO] Apache Directory Studio OpenLDAP ACL Configuration Editor SUCCESS [  3.150 s]
[INFO] Apache Directory Studio Template Editor ............ SUCCESS [  2.102 s]
[INFO] Apache Directory Studio Combined Editor ............ SUCCESS [  0.315 s]
[INFO] Apache Directory Studio SLF4J to Eclipse Log Binding SUCCESS [  0.087 s]
[INFO] Apache Directory Studio Help Plugins ............... SUCCESS [  0.015 s]
[INFO] Apache Directory Studio Apache DS Help ............. SUCCESS [  4.981 s]
[INFO] Apache Directory Studio LDAP Browser Help .......... SUCCESS [  9.677 s]
[INFO] Apache Directory Studio LDIF Editor Help ........... SUCCESS [  2.194 s]
[INFO] Apache Directory Studio RCP Help ................... SUCCESS [  2.040 s]
[INFO] Apache Directory Studio Schema Editor Help ......... SUCCESS [  3.030 s]
[INFO] Apache Directory Studio Feature Plugins ............ SUCCESS [  0.018 s]
[INFO] Apache Directory Studio ApacheDS Feature ........... SUCCESS [  0.155 s]
[INFO] Apache Directory Studio LDAP Browser Feature ....... SUCCESS [  0.136 s]
[INFO] Apache Directory Studio LDIF Editor Feature ........ SUCCESS [  0.103 s]
[INFO] Apache Directory Studio RCP Feature ................ SUCCESS [  0.191 s]
[INFO] Apache Directory Studio Schema Editor Feature ...... SUCCESS [  0.109 s]
[INFO] Apache Directory Studio OpenLDAP Feature ........... SUCCESS [  0.107 s]
[INFO] Apache Directory Studio National Language Support Feature SUCCESS [  0.330 s]
[INFO] Apache Directory Studio Test Plugins ............... SUCCESS [  0.021 s]
[INFO] Apache Directory Studio Core Integration Tests ..... SUCCESS [ 36.522 s]
[INFO] Apache Directory Studio UI Integration Tests ....... FAILURE [10:16 min]
[INFO] Apache Directory Studio P2 Repositories ............ SKIPPED
[INFO] Apache Directory Studio P2 Repository Dependencies . SKIPPED
[INFO] Apache Directory Studio P2 Repository Eclipse ...... SKIPPED
[INFO] Apache Directory Studio Product .................... SKIPPED
[INFO] Apache Directory Studio Installers ................. SKIPPED
[INFO] ------------------------------------------------------------------------
[INFO] BUILD FAILURE
[INFO] ------------------------------------------------------------------------
[INFO] Total time: 19:09 min
[INFO] Finished at: 2017-04-27T18:58:36+00:00
[INFO] Final Memory: 293M/2704M
[INFO] ------------------------------------------------------------------------
[ERROR] Failed to execute goal org.eclipse.tycho:tycho-surefire-plugin:0.24.0:test (default-test)
on project org.apache.directory.studio.test.integration.ui: There are test failures.
[ERROR] 
[ERROR] Please refer to /home/hnelson/studio/tests/test.integration.ui/target/surefire-reports
for the individual test results.
[ERROR] -> [Help 1]
[ERROR] 
[ERROR] To see the full stack trace of the errors, re-run Maven with the -e switch.
[ERROR] Re-run Maven using the -X switch to enable full debug logging.
[ERROR] 
[ERROR] For more information about the errors and possible solutions, please read the following
articles:
[ERROR] [Help 1] http://cwiki.apache.org/confluence/display/MAVEN/MojoFailureException
[ERROR] 
[ERROR] After correcting the problems, you can resume the build with the command
[ERROR]   mvn <goals> -rf :org.apache.directory.studio.test.integration.ui
Build step 'Execute shell' marked build as failure
Recording test results

Mime
View raw message