directory-notifications mailing list archives

Site index · List index
Message view « Date » · « Thread »
Top « Date » · « Thread »
From Apache Jenkins Server <jenk...@builds.apache.org>
Subject Build failed in Jenkins: dir-apacheds-win #564
Date Fri, 17 Mar 2017 12:51:05 GMT
See <https://builds.apache.org/job/dir-apacheds-win/564/display/redirect?page=changes>

Changes:

[elecharny] Used teh Strings.EMPTY_STRING_ARRAY constant

------------------------------------------
[...truncated 323.90 KB...]
[INFO] Compiling 33 source files to F:\jenkins\jenkins-slave\workspace\dir-apacheds-win\trunk\protocol-kerberos\target\classes
[INFO] /F:/jenkins/jenkins-slave/workspace/dir-apacheds-win/trunk/protocol-kerberos/src/main/java/org/apache/directory/server/kerberos/protocol/KerberosProtocolHandler.java:
Some input files use or override a deprecated API.
[INFO] /F:/jenkins/jenkins-slave/workspace/dir-apacheds-win/trunk/protocol-kerberos/src/main/java/org/apache/directory/server/kerberos/protocol/KerberosProtocolHandler.java:
Recompile with -Xlint:deprecation for details.
[INFO] 
[INFO] --- maven-resources-plugin:3.0.1:testResources (default-testResources) @ apacheds-protocol-kerberos
---
[INFO] Using 'UTF-8' encoding to copy filtered resources.
[INFO] Copying 2 resources
[INFO] Copying 3 resources
[INFO] 
[INFO] --- maven-compiler-plugin:3.6.0:testCompile (default-testCompile) @ apacheds-protocol-kerberos
---
[INFO] Changes detected - recompiling the module!
[INFO] Compiling 12 source files to F:\jenkins\jenkins-slave\workspace\dir-apacheds-win\trunk\protocol-kerberos\target\test-classes
[INFO] 
[INFO] --- maven-surefire-plugin:2.18.1:test (default-test) @ apacheds-protocol-kerberos ---
[INFO] Surefire report directory: F:\jenkins\jenkins-slave\workspace\dir-apacheds-win\trunk\protocol-kerberos\target\surefire-reports

-------------------------------------------------------
 T E S T S
-------------------------------------------------------
Running org.apache.directory.server.kerberos.protocol.AuthenticationEncryptionTypeTest
Tests run: 4, Failures: 0, Errors: 0, Skipped: 1, Time elapsed: 1.213 sec - in org.apache.directory.server.kerberos.protocol.AuthenticationEncryptionTypeTest
Running org.apache.directory.server.kerberos.protocol.AuthenticationPolicyTest
Tests run: 7, Failures: 0, Errors: 0, Skipped: 0, Time elapsed: 0.008 sec - in org.apache.directory.server.kerberos.protocol.AuthenticationPolicyTest
Running org.apache.directory.server.kerberos.protocol.AuthenticationServiceTest
Tests run: 30, Failures: 0, Errors: 0, Skipped: 0, Time elapsed: 0.291 sec - in org.apache.directory.server.kerberos.protocol.AuthenticationServiceTest
Running org.apache.directory.server.kerberos.protocol.EncTktInSkeyTest
Tests run: 1, Failures: 0, Errors: 0, Skipped: 0, Time elapsed: 0.122 sec - in org.apache.directory.server.kerberos.protocol.EncTktInSkeyTest
Running org.apache.directory.server.kerberos.protocol.FragmentDecoderTest
Tests run: 3, Failures: 0, Errors: 0, Skipped: 0, Time elapsed: 0.081 sec - in org.apache.directory.server.kerberos.protocol.FragmentDecoderTest
Running org.apache.directory.server.kerberos.protocol.PreAuthenticationTest
Tests run: 4, Failures: 0, Errors: 0, Skipped: 0, Time elapsed: 0.031 sec - in org.apache.directory.server.kerberos.protocol.PreAuthenticationTest
Running org.apache.directory.server.kerberos.protocol.TicketGrantingEncryptionTypeTest
Tests run: 6, Failures: 0, Errors: 0, Skipped: 1, Time elapsed: 0.074 sec - in org.apache.directory.server.kerberos.protocol.TicketGrantingEncryptionTypeTest
Running org.apache.directory.server.kerberos.protocol.TicketGrantingPolicyTest
Tests run: 12, Failures: 0, Errors: 0, Skipped: 0, Time elapsed: 0.167 sec - in org.apache.directory.server.kerberos.protocol.TicketGrantingPolicyTest
Running org.apache.directory.server.kerberos.protocol.TicketGrantingServiceTest
Tests run: 37, Failures: 0, Errors: 0, Skipped: 2, Time elapsed: 0.369 sec - in org.apache.directory.server.kerberos.protocol.TicketGrantingServiceTest

Results :

Tests run: 104, Failures: 0, Errors: 0, Skipped: 4

[JENKINS] Recording test results
[INFO] 
[INFO] --- maven-bundle-plugin:3.2.0:bundle (default-bundle) @ apacheds-protocol-kerberos
---
[INFO] 
[INFO] --- maven-site-plugin:3.5.1:attach-descriptor (attach-descriptor) @ apacheds-protocol-kerberos
---
[INFO] 
[INFO] --- tools-maven-plugin:1.4:verify-legal-files (verify-legal-files) @ apacheds-protocol-kerberos
---
[INFO] Checking legal files in: apacheds-protocol-kerberos-2.0.0-M24-SNAPSHOT.jar
[INFO] 
[INFO] >>> maven-source-plugin:3.0.1:jar (attach-sources) > generate-sources @
apacheds-protocol-kerberos >>>
[INFO] 
[INFO] --- maven-checkstyle-plugin:2.17:check (validate) @ apacheds-protocol-kerberos ---
[WARNING] Failed to getClass for org.apache.maven.plugins.source.SourceJarMojo
[INFO] 
[INFO] <<< maven-source-plugin:3.0.1:jar (attach-sources) < generate-sources @
apacheds-protocol-kerberos <<<
[INFO] 
[INFO] --- maven-source-plugin:3.0.1:jar (attach-sources) @ apacheds-protocol-kerberos ---
[INFO] Building jar: F:\jenkins\jenkins-slave\workspace\dir-apacheds-win\trunk\protocol-kerberos\target\apacheds-protocol-kerberos-2.0.0-M24-SNAPSHOT-sources.jar
[INFO] 
[INFO] --- maven-install-plugin:2.5.2:install (default-install) @ apacheds-protocol-kerberos
---
[INFO] Installing F:\jenkins\jenkins-slave\workspace\dir-apacheds-win\trunk\protocol-kerberos\target\apacheds-protocol-kerberos-2.0.0-M24-SNAPSHOT.jar
to f:\jenkins\jenkins-slave\maven-repositories\0\org\apache\directory\server\apacheds-protocol-kerberos\2.0.0-M24-SNAPSHOT\apacheds-protocol-kerberos-2.0.0-M24-SNAPSHOT.jar
[INFO] Installing F:\jenkins\jenkins-slave\workspace\dir-apacheds-win\trunk\protocol-kerberos\pom.xml
to f:\jenkins\jenkins-slave\maven-repositories\0\org\apache\directory\server\apacheds-protocol-kerberos\2.0.0-M24-SNAPSHOT\apacheds-protocol-kerberos-2.0.0-M24-SNAPSHOT.pom
[INFO] Installing F:\jenkins\jenkins-slave\workspace\dir-apacheds-win\trunk\protocol-kerberos\target\apacheds-protocol-kerberos-2.0.0-M24-SNAPSHOT-sources.jar
to f:\jenkins\jenkins-slave\maven-repositories\0\org\apache\directory\server\apacheds-protocol-kerberos\2.0.0-M24-SNAPSHOT\apacheds-protocol-kerberos-2.0.0-M24-SNAPSHOT-sources.jar
[INFO] 
[INFO] --- maven-bundle-plugin:3.2.0:install (default-install) @ apacheds-protocol-kerberos
---
[INFO] Installing org/apache/directory/server/apacheds-protocol-kerberos/2.0.0-M24-SNAPSHOT/apacheds-protocol-kerberos-2.0.0-M24-SNAPSHOT.jar
[INFO] Writing OBR metadata
[JENKINS] Archiving disabled
[INFO]                                                                         
[INFO] ------------------------------------------------------------------------
[INFO] Building ApacheDS Protocol Ldap 2.0.0-M24-SNAPSHOT
[INFO] ------------------------------------------------------------------------
[INFO] Downloading: https://repository.apache.org/content/repositories/snapshots/org/apache/directory/api/api-ldap-extras-sp/1.0.0-RC3-SNAPSHOT/maven-metadata.xml
[INFO] Downloaded: https://repository.apache.org/content/repositories/snapshots/org/apache/directory/api/api-ldap-extras-sp/1.0.0-RC3-SNAPSHOT/maven-metadata.xml
(2 KB at 1.7 KB/sec)
[INFO] Downloading: https://repository.apache.org/content/repositories/snapshots/org/apache/directory/api/api-ldap-extras-sp/1.0.0-RC3-SNAPSHOT/api-ldap-extras-sp-1.0.0-RC3-20170315.013105-50.pom
[INFO] Downloaded: https://repository.apache.org/content/repositories/snapshots/org/apache/directory/api/api-ldap-extras-sp/1.0.0-RC3-SNAPSHOT/api-ldap-extras-sp-1.0.0-RC3-20170315.013105-50.pom
(4 KB at 6.5 KB/sec)
[INFO] Downloading: https://repository.apache.org/content/repositories/snapshots/org/apache/directory/api/api-ldap-extras-sp/1.0.0-RC3-SNAPSHOT/api-ldap-extras-sp-1.0.0-RC3-20170315.013105-50.jar
[INFO] Downloaded: https://repository.apache.org/content/repositories/snapshots/org/apache/directory/api/api-ldap-extras-sp/1.0.0-RC3-SNAPSHOT/api-ldap-extras-sp-1.0.0-RC3-20170315.013105-50.jar
(13 KB at 22.0 KB/sec)
[INFO] 
[INFO] --- maven-clean-plugin:3.0.0:clean (default-clean) @ apacheds-protocol-ldap ---
[INFO] Deleting F:\jenkins\jenkins-slave\workspace\dir-apacheds-win\trunk\protocol-ldap\target
[INFO] 
[INFO] --- maven-checkstyle-plugin:2.17:check (validate) @ apacheds-protocol-ldap ---
[INFO] 
[INFO] --- maven-remote-resources-plugin:1.5:process (process-resource-bundles) @ apacheds-protocol-ldap
---
[INFO] 
[INFO] --- maven-resources-plugin:3.0.1:resources (default-resources) @ apacheds-protocol-ldap
---
[INFO] Using 'UTF-8' encoding to copy filtered resources.
[INFO] Copying 0 resource
[INFO] Copying 3 resources
[INFO] 
[INFO] --- maven-compiler-plugin:3.6.0:compile (default-compile) @ apacheds-protocol-ldap
---
[INFO] Changes detected - recompiling the module!
[INFO] Compiling 81 source files to F:\jenkins\jenkins-slave\workspace\dir-apacheds-win\trunk\protocol-ldap\target\classes
[INFO] /F:/jenkins/jenkins-slave/workspace/dir-apacheds-win/trunk/protocol-ldap/src/main/java/org/apache/directory/server/ldap/replication/ReplicationTrustManager.java:
Some input files use or override a deprecated API.
[INFO] /F:/jenkins/jenkins-slave/workspace/dir-apacheds-win/trunk/protocol-ldap/src/main/java/org/apache/directory/server/ldap/replication/ReplicationTrustManager.java:
Recompile with -Xlint:deprecation for details.
[INFO] /F:/jenkins/jenkins-slave/workspace/dir-apacheds-win/trunk/protocol-ldap/src/main/java/org/apache/directory/server/ldap/handlers/request/ExtendedRequestHandler.java:
Some input files use unchecked or unsafe operations.
[INFO] /F:/jenkins/jenkins-slave/workspace/dir-apacheds-win/trunk/protocol-ldap/src/main/java/org/apache/directory/server/ldap/handlers/request/ExtendedRequestHandler.java:
Recompile with -Xlint:unchecked for details.
[INFO] -------------------------------------------------------------
[ERROR] COMPILATION ERROR : 
[INFO] -------------------------------------------------------------
[ERROR] /F:/jenkins/jenkins-slave/workspace/dir-apacheds-win/trunk/protocol-ldap/src/main/java/org/apache/directory/server/ldap/handlers/PersistentSearchListener.java:[82,111]
cannot find symbol
  symbol:   variable EMPTY_STRING_ARRAY
  location: class org.apache.directory.api.util.Strings
[INFO] 1 error
[INFO] -------------------------------------------------------------
[JENKINS] Archiving disabled
[JENKINS] Archiving disabled
[JENKINS] Archiving disabled
[JENKINS] Archiving disabled
[JENKINS] Archiving disabled
[JENKINS] Archiving disabled
[JENKINS] Archiving disabled
[JENKINS] Archiving disabled
[JENKINS] Archiving disabled
[JENKINS] Archiving disabled
[JENKINS] Archiving disabled
[JENKINS] Archiving disabled
[JENKINS] Archiving disabled
[JENKINS] Archiving disabled
[JENKINS] Archiving disabled
[JENKINS] Archiving disabled
[JENKINS] Archiving disabled
[JENKINS] Archiving disabled
[JENKINS] Archiving disabled
[JENKINS] Archiving disabled
[JENKINS] Archiving disabled
[JENKINS] Archiving disabled
[JENKINS] Archiving disabled
[JENKINS] Archiving disabled
[JENKINS] Archiving disabled
[JENKINS] Archiving disabled
[JENKINS] Archiving disabled
[JENKINS] Archiving disabled
[JENKINS] Archiving disabled
[JENKINS] Archiving disabled
[JENKINS] Archiving disabled
[JENKINS] Archiving disabled
[JENKINS] Archiving disabled
[JENKINS] Archiving disabled
[JENKINS] Archiving disabled
[JENKINS] Archiving disabled
[JENKINS] Archiving disabled
[JENKINS] Archiving disabled
[JENKINS] Archiving disabled
[JENKINS] Archiving disabled
[JENKINS] Archiving disabled
[JENKINS] Archiving disabled
[JENKINS] Archiving disabled
[JENKINS] Archiving disabled
[JENKINS] Archiving disabled
[JENKINS] Archiving disabled
[JENKINS] Archiving disabled
[JENKINS] Archiving disabled
[JENKINS] Archiving disabled
[JENKINS] Archiving disabled
[JENKINS] Archiving disabled
[JENKINS] Archiving disabled
[JENKINS] Archiving disabled
[JENKINS] Archiving disabled
[JENKINS] Archiving disabled
[JENKINS] Archiving disabled
[JENKINS] Archiving disabled
[JENKINS] Archiving disabled
[INFO] ------------------------------------------------------------------------
[INFO] Reactor Summary:
[INFO] 
[INFO] ApacheDS ........................................... SUCCESS [ 10.849 s]
[INFO] ApacheDS I18n ...................................... SUCCESS [  9.807 s]
[INFO] ApacheDS Core Constants ............................ SUCCESS [  4.444 s]
[INFO] ApacheDS Core API .................................. SUCCESS [01:43 min]
[INFO] ApacheDS Core Shared ............................... SUCCESS [  9.107 s]
[INFO] ApacheDS Interceptors .............................. SUCCESS [  2.590 s]
[INFO] ApacheDS AdministrativePoint Interceptor ........... SUCCESS [  7.868 s]
[INFO] ApacheDS Authentication Interceptor ................ SUCCESS [ 10.628 s]
[INFO] ApacheDS Interceptor to increment numeric attributes SUCCESS [  6.861 s]
[INFO] ApacheDS Authorization Interceptor ................. SUCCESS [ 13.783 s]
[INFO] ApacheDS ChangeLog Interceptor ..................... SUCCESS [ 10.747 s]
[INFO] ApacheDS Collective Attribute Interceptor .......... SUCCESS [  6.677 s]
[INFO] ApacheDS Event Interceptor ......................... SUCCESS [  6.696 s]
[INFO] ApacheDS Exception Interceptor ..................... SUCCESS [  7.323 s]
[INFO] ApacheDS Journal Interceptor ....................... SUCCESS [  6.804 s]
[INFO] ApacheDS Normalization Interceptor ................. SUCCESS [  9.887 s]
[INFO] ApacheDS Operational Attribute Interceptor ......... SUCCESS [  6.576 s]
[INFO] ApacheDS Referral Interceptor ...................... SUCCESS [  7.599 s]
[INFO] ApacheDS Schema Interceptor ........................ SUCCESS [ 13.009 s]
[INFO] ApacheDS Subtree Interceptor ....................... SUCCESS [ 13.839 s]
[INFO] ApacheDS Triggers Interceptor ...................... SUCCESS [  8.640 s]
[INFO] ApacheDS Core ...................................... SUCCESS [ 13.297 s]
[INFO] ApacheDS Core AVL .................................. SUCCESS [ 12.941 s]
[INFO] ApacheDS Generalized (X) DBM Partition ............. SUCCESS [ 24.766 s]
[INFO] ApacheDS LDIF Partition ............................ SUCCESS [ 15.151 s]
[INFO] ApacheDS JDBM Partition ............................ SUCCESS [ 31.010 s]
[INFO] ApacheDS Mavibot Partition ......................... SUCCESS [ 20.027 s]
[INFO] ApacheDS Core Annotations .......................... SUCCESS [ 34.147 s]
[INFO] ApacheDS Core JNDI ................................. SUCCESS [  9.384 s]
[INFO] ApacheDS Protocol Kerberos Codec ................... SUCCESS [ 35.116 s]
[INFO] ApacheDS Interceptors for Kerberos ................. SUCCESS [  8.719 s]
[INFO] ApacheDS Protocol Dhcp ............................. SUCCESS [  6.695 s]
[INFO] ApacheDS Protocol Shared ........................... SUCCESS [  7.694 s]
[INFO] ApacheDS Protocol Dns .............................. SUCCESS [ 13.183 s]
[INFO] ApacheDS Protocol Kerberos ......................... SUCCESS [ 15.427 s]
[INFO] ApacheDS Protocol Ldap ............................. FAILURE [  8.244 s]
[INFO] ApacheDS Protocol Ntp .............................. SKIPPED
[INFO] Apacheds Server Annotations ........................ SKIPPED
[INFO] ApacheDS Server Config ............................. SKIPPED
[INFO] ApacheDS Server JNDI ............................... SKIPPED
[INFO] ApacheDS Test Framework ............................ SKIPPED
[INFO] ApacheDS All ....................................... SKIPPED
[INFO] ApacheDS Logger Interceptor ........................ SKIPPED
[INFO] ApacheDS Password Hashing Interceptor .............. SKIPPED
[INFO] ApacheDS Core Integration .......................... SKIPPED
[INFO] ApacheDS Protocol Kerberos Test .................... SKIPPED
[INFO] ApacheDS Server Integration ........................ SKIPPED
[INFO] ApacheDS DirectoryService-WebApp bridge ............ SKIPPED
[INFO] ApacheDS Jetty HTTP Server Integration ............. SKIPPED
[INFO] ApacheDS Service Builder ........................... SKIPPED
[INFO] Apache Directory LDAP Client API test .............. SKIPPED
[INFO] kerberos-client .................................... SKIPPED
[INFO] ApacheDS Service ................................... SKIPPED
[INFO] ApacheDS Wrapper ................................... SKIPPED
[INFO] ApacheDS Installers Maven Plugin ................... SKIPPED
[INFO] ApacheDS Installers ................................ SKIPPED
[INFO] ApacheDS OSGi Integration Tests .................... SKIPPED
[INFO] ------------------------------------------------------------------------
[INFO] BUILD FAILURE
[INFO] ------------------------------------------------------------------------
[INFO] Total time: 10:35 min
[INFO] Finished at: 2017-03-17T12:50:47+00:00
[INFO] Final Memory: 102M/476M
[INFO] ------------------------------------------------------------------------
[ERROR] Failed to execute goal org.apache.maven.plugins:maven-compiler-plugin:3.6.0:compile
(default-compile) on project apacheds-protocol-ldap: Compilation failure
[ERROR] /F:/jenkins/jenkins-slave/workspace/dir-apacheds-win/trunk/protocol-ldap/src/main/java/org/apache/directory/server/ldap/handlers/PersistentSearchListener.java:[82,111]
cannot find symbol
[ERROR] symbol:   variable EMPTY_STRING_ARRAY
[ERROR] location: class org.apache.directory.api.util.Strings
[ERROR] -> [Help 1]
[ERROR] 
[ERROR] To see the full stack trace of the errors, re-run Maven with the -e switch.
[ERROR] Re-run Maven using the -X switch to enable full debug logging.
[ERROR] 
[ERROR] For more information about the errors and possible solutions, please read the following
articles:
[ERROR] [Help 1] http://cwiki.apache.org/confluence/display/MAVEN/MojoFailureException
[ERROR] 
[ERROR] After correcting the problems, you can resume the build with the command
[ERROR]   mvn <goals> -rf :apacheds-protocol-ldap
channel stopped
Java HotSpot(TM) 64-Bit Server VM warning: ignoring option MaxPermSize=128m; support was removed
in 8.0

Mime
View raw message