directory-notifications mailing list archives

Site index · List index
Message view « Date » · « Thread »
Top « Date » · « Thread »
From Apache Jenkins Server <jenk...@builds.apache.org>
Subject Build failed in Jenkins: dir-apacheds-ubuntu-deploy #1960
Date Sat, 14 Jan 2017 12:27:07 GMT
See <https://builds.apache.org/job/dir-apacheds-ubuntu-deploy/1960/changes>

Changes:

[elecharny] Improved one test

[elecharny] Bumped up to the latest shared revision, and the latest skin revision

[elecharny] Set the log4j property file to avoid printing useless informations

[elecharny] Fixed teh ApacheDS starting script

[elecharny] Added a test

[elecharny] o Fixed a failing test
o Used the try-with-resource syntax

[elecharny] Added some SSL/TLS tests

[elecharny] Fixed some failures introduced in a previous commit

------------------------------------------
[...truncated 133 lines...]
	at com.google.inject.internal.InjectorImpl.getInstance(InjectorImpl.java:1051)
	at org.eclipse.sisu.space.AbstractDeferredClass.get(AbstractDeferredClass.java:48)
	at com.google.inject.internal.ProviderInternalFactory.provision(ProviderInternalFactory.java:81)
	at com.google.inject.internal.InternalFactoryToInitializableAdapter.provision(InternalFactoryToInitializableAdapter.java:53)
	at com.google.inject.internal.ProviderInternalFactory$1.call(ProviderInternalFactory.java:65)
	at com.google.inject.internal.ProvisionListenerStackCallback$Provision.provision(ProvisionListenerStackCallback.java:115)
	at org.eclipse.sisu.bean.BeanScheduler$Activator.onProvision(BeanScheduler.java:176)
	at com.google.inject.internal.ProvisionListenerStackCallback$Provision.provision(ProvisionListenerStackCallback.java:126)
	at com.google.inject.internal.ProvisionListenerStackCallback.provision(ProvisionListenerStackCallback.java:68)
	at com.google.inject.internal.ProviderInternalFactory.circularGet(ProviderInternalFactory.java:63)
	at com.google.inject.internal.InternalFactoryToInitializableAdapter.get(InternalFactoryToInitializableAdapter.java:45)
	at com.google.inject.internal.InjectorImpl$2$1.call(InjectorImpl.java:1016)
	at com.google.inject.internal.InjectorImpl.callInContext(InjectorImpl.java:1092)
	at com.google.inject.internal.InjectorImpl$2.get(InjectorImpl.java:1012)
	at org.eclipse.sisu.inject.Guice4$1.get(Guice4.java:162)
	at org.eclipse.sisu.inject.LazyBeanEntry.getValue(LazyBeanEntry.java:81)
	at org.eclipse.sisu.plexus.LazyPlexusBean.getValue(LazyPlexusBean.java:51)
	at org.codehaus.plexus.DefaultPlexusContainer.lookup(DefaultPlexusContainer.java:263)
	at org.codehaus.plexus.DefaultPlexusContainer.lookup(DefaultPlexusContainer.java:255)
	at org.apache.maven.plugin.internal.DefaultMavenPluginManager.getConfiguredMojo(DefaultMavenPluginManager.java:517)
	at org.apache.maven.plugin.DefaultBuildPluginManager.executeMojo(DefaultBuildPluginManager.java:121)
	at org.apache.maven.lifecycle.internal.MojoExecutor.execute(MojoExecutor.java:207)
	at org.apache.maven.lifecycle.internal.MojoExecutor.execute(MojoExecutor.java:153)
	at org.apache.maven.lifecycle.internal.MojoExecutor.execute(MojoExecutor.java:145)
	at org.apache.maven.lifecycle.internal.LifecycleModuleBuilder.buildProject(LifecycleModuleBuilder.java:116)
	at org.apache.maven.lifecycle.internal.LifecycleModuleBuilder.buildProject(LifecycleModuleBuilder.java:80)
	at org.apache.maven.lifecycle.internal.builder.singlethreaded.SingleThreadedBuilder.build(SingleThreadedBuilder.java:51)
	at org.apache.maven.lifecycle.internal.LifecycleStarter.execute(LifecycleStarter.java:128)
	at org.apache.maven.DefaultMaven.doExecute(DefaultMaven.java:307)
	at org.apache.maven.DefaultMaven.doExecute(DefaultMaven.java:193)
	at org.apache.maven.DefaultMaven.execute(DefaultMaven.java:106)
	at org.jvnet.hudson.maven3.launcher.Maven32Launcher.main(Maven32Launcher.java:132)
	at sun.reflect.NativeMethodAccessorImpl.invoke0(Native Method)
	at sun.reflect.NativeMethodAccessorImpl.invoke(NativeMethodAccessorImpl.java:57)
	at sun.reflect.DelegatingMethodAccessorImpl.invoke(DelegatingMethodAccessorImpl.java:43)
	at java.lang.reflect.Method.invoke(Method.java:606)
	at org.codehaus.plexus.classworlds.launcher.Launcher.launchStandard(Launcher.java:330)
	at org.codehaus.plexus.classworlds.launcher.Launcher.launch(Launcher.java:238)
	at jenkins.maven3.agent.Maven32Main.launch(Maven32Main.java:186)
	at sun.reflect.NativeMethodAccessorImpl.invoke0(Native Method)
	at sun.reflect.NativeMethodAccessorImpl.invoke(NativeMethodAccessorImpl.java:57)
	at sun.reflect.DelegatingMethodAccessorImpl.invoke(DelegatingMethodAccessorImpl.java:43)
	at java.lang.reflect.Method.invoke(Method.java:606)
	at hudson.maven.Maven3Builder.call(Maven3Builder.java:136)
	at hudson.maven.Maven3Builder.call(Maven3Builder.java:71)
	at hudson.remoting.UserRequest.perform(UserRequest.java:153)
	at hudson.remoting.UserRequest.perform(UserRequest.java:50)
	at hudson.remoting.Request$2.run(Request.java:332)
	at hudson.remoting.InterceptingExecutorService$1.call(InterceptingExecutorService.java:68)
	at java.util.concurrent.FutureTask.run(FutureTask.java:262)
	at java.util.concurrent.ThreadPoolExecutor.runWorker(ThreadPoolExecutor.java:1145)
	at java.util.concurrent.ThreadPoolExecutor$Worker.run(ThreadPoolExecutor.java:615)
	at java.lang.Thread.run(Thread.java:745)
[JENKINS] Archiving disabled
[JENKINS] Archiving disabled
[JENKINS] Archiving disabled
[JENKINS] Archiving disabled
[JENKINS] Archiving disabled
[JENKINS] Archiving disabled
[JENKINS] Archiving disabled
[JENKINS] Archiving disabled
[JENKINS] Archiving disabled
[JENKINS] Archiving disabled
[JENKINS] Archiving disabled
[JENKINS] Archiving disabled
[JENKINS] Archiving disabled
[JENKINS] Archiving disabled
[JENKINS] Archiving disabled
[JENKINS] Archiving disabled
[JENKINS] Archiving disabled
[JENKINS] Archiving disabled
[JENKINS] Archiving disabled
[JENKINS] Archiving disabled
[JENKINS] Archiving disabled
[JENKINS] Archiving disabled
[JENKINS] Archiving disabled
[JENKINS] Archiving disabled
[JENKINS] Archiving disabled
[JENKINS] Archiving disabled
[JENKINS] Archiving disabled
[JENKINS] Archiving disabled
[JENKINS] Archiving disabled
[JENKINS] Archiving disabled
[JENKINS] Archiving disabled
[JENKINS] Archiving disabled
[JENKINS] Archiving disabled
[JENKINS] Archiving disabled
[JENKINS] Archiving disabled
[JENKINS] Archiving disabled
[JENKINS] Archiving disabled
[JENKINS] Archiving disabled
[JENKINS] Archiving disabled
[JENKINS] Archiving disabled
[JENKINS] Archiving disabled
[JENKINS] Archiving disabled
[JENKINS] Archiving disabled
[JENKINS] Archiving disabled
[JENKINS] Archiving disabled
[JENKINS] Archiving disabled
[JENKINS] Archiving disabled
[JENKINS] Archiving disabled
[JENKINS] Archiving disabled
[JENKINS] Archiving disabled
[JENKINS] Archiving disabled
[JENKINS] Archiving disabled
[JENKINS] Archiving disabled
[JENKINS] Archiving disabled
[JENKINS] Archiving disabled
[JENKINS] Archiving disabled
[JENKINS] Archiving disabled
[JENKINS] Archiving disabled[INFO] ------------------------------------------------------------------------
[INFO] Reactor Summary:
[INFO] 
[INFO] ApacheDS ........................................... FAILURE [  2.602 s]
[INFO] ApacheDS I18n ...................................... SKIPPED
[INFO] ApacheDS Core Constants ............................ SKIPPED
[INFO] ApacheDS Core API .................................. SKIPPED
[INFO] ApacheDS Core Shared ............................... SKIPPED
[INFO] ApacheDS Interceptors .............................. SKIPPED
[INFO] ApacheDS AdministrativePoint Interceptor ........... SKIPPED
[INFO] ApacheDS Authentication Interceptor ................ SKIPPED
[INFO] ApacheDS Interceptor to increment numeric attributes SKIPPED
[INFO] ApacheDS Authorization Interceptor ................. SKIPPED
[INFO] ApacheDS ChangeLog Interceptor ..................... SKIPPED
[INFO] ApacheDS Collective Attribute Interceptor .......... SKIPPED
[INFO] ApacheDS Event Interceptor ......................... SKIPPED
[INFO] ApacheDS Exception Interceptor ..................... SKIPPED
[INFO] ApacheDS Journal Interceptor ....................... SKIPPED
[INFO] ApacheDS Normalization Interceptor ................. SKIPPED
[INFO] ApacheDS Operational Attribute Interceptor ......... SKIPPED
[INFO] ApacheDS Referral Interceptor ...................... SKIPPED
[INFO] ApacheDS Schema Interceptor ........................ SKIPPED
[INFO] ApacheDS Subtree Interceptor ....................... SKIPPED
[INFO] ApacheDS Triggers Interceptor ...................... SKIPPED
[INFO] ApacheDS Core ...................................... SKIPPED
[INFO] ApacheDS Core AVL .................................. SKIPPED
[INFO] ApacheDS Generalized (X) DBM Partition ............. SKIPPED
[INFO] ApacheDS LDIF Partition ............................ SKIPPED
[INFO] ApacheDS JDBM Partition ............................ SKIPPED
[INFO] ApacheDS Mavibot Partition ......................... SKIPPED
[INFO] ApacheDS Core Annotations .......................... SKIPPED
[INFO] ApacheDS Core JNDI ................................. SKIPPED
[INFO] ApacheDS Protocol Kerberos Codec ................... SKIPPED
[INFO] ApacheDS Interceptors for Kerberos ................. SKIPPED
[INFO] ApacheDS Protocol Dhcp ............................. SKIPPED
[INFO] ApacheDS Protocol Shared ........................... SKIPPED
[INFO] ApacheDS Protocol Dns .............................. SKIPPED
[INFO] ApacheDS Protocol Kerberos ......................... SKIPPED
[INFO] ApacheDS Protocol Ldap ............................. SKIPPED
[INFO] ApacheDS Protocol Ntp .............................. SKIPPED
[INFO] Apacheds Server Annotations ........................ SKIPPED
[INFO] ApacheDS Server Config ............................. SKIPPED
[INFO] ApacheDS Server JNDI ............................... SKIPPED
[INFO] ApacheDS Test Framework ............................ SKIPPED
[INFO] ApacheDS All ....................................... SKIPPED
[INFO] ApacheDS Logger Interceptor ........................ SKIPPED
[INFO] ApacheDS Password Hashing Interceptor .............. SKIPPED
[INFO] ApacheDS Core Integration .......................... SKIPPED
[INFO] ApacheDS Protocol Kerberos Test .................... SKIPPED
[INFO] ApacheDS Server Integration ........................ SKIPPED
[INFO] ApacheDS DirectoryService-WebApp bridge ............ SKIPPED
[INFO] ApacheDS Jetty HTTP Server Integration ............. SKIPPED
[INFO] ApacheDS Service Builder ........................... SKIPPED
[INFO] Apache Directory LDAP Client API test .............. SKIPPED
[INFO] kerberos-client .................................... SKIPPED
[INFO] ApacheDS Service ................................... SKIPPED
[INFO] ApacheDS Wrapper ................................... SKIPPED
[INFO] ApacheDS Installers Maven Plugin ................... SKIPPED
[INFO] ApacheDS Installers ................................ SKIPPED
[INFO] ApacheDS OSGi Integration Tests .................... SKIPPED
[INFO] ------------------------------------------------------------------------
[INFO] BUILD FAILURE
[INFO] ------------------------------------------------------------------------
[INFO] Total time: 13.868 s
[INFO] Finished at: 2017-01-14T11:35:13+00:00

[INFO] Final Memory: 51M/491M
[INFO] ------------------------------------------------------------------------
Waiting for Jenkins to finish collecting data
[ERROR] Failed to execute goal org.apache.maven.plugins:maven-checkstyle-plugin:2.17:check
(validate) on project apacheds-parent: Execution validate of goal org.apache.maven.plugins:maven-checkstyle-plugin:2.17:check
failed: An API incompatibility was encountered while executing org.apache.maven.plugins:maven-checkstyle-plugin:2.17:check:
java.lang.UnsupportedClassVersionError: com/puppycrawl/tools/checkstyle/api/AuditListener
: Unsupported major.minor version 52.0
[ERROR] -----------------------------------------------------
[ERROR] realm =    plugin>org.apache.maven.plugins:maven-checkstyle-plugin:2.17
[ERROR] strategy = org.codehaus.plexus.classworlds.strategy.SelfFirstStrategy
[ERROR] urls[0] = file:/home/jenkins/jenkins-slave/maven-repositories/1/org/apache/maven/plugins/maven-checkstyle-plugin/2.17/maven-checkstyle-plugin-2.17.jar
[ERROR] urls[1] = file:/home/jenkins/jenkins-slave/maven-repositories/1/com/puppycrawl/tools/checkstyle/7.2/checkstyle-7.2.jar
[ERROR] urls[2] = file:/home/jenkins/jenkins-slave/maven-repositories/1/antlr/antlr/2.7.7/antlr-2.7.7.jar
[ERROR] urls[3] = file:/home/jenkins/jenkins-slave/maven-repositories/1/org/antlr/antlr4-runtime/4.5.3/antlr4-runtime-4.5.3.jar
[ERROR] urls[4] = file:/home/jenkins/jenkins-slave/maven-repositories/1/commons-beanutils/commons-beanutils/1.9.3/commons-beanutils-1.9.3.jar
[ERROR] urls[5] = file:/home/jenkins/jenkins-slave/maven-repositories/1/commons-logging/commons-logging/1.2/commons-logging-1.2.jar
[ERROR] urls[6] = file:/home/jenkins/jenkins-slave/maven-repositories/1/commons-cli/commons-cli/1.3.1/commons-cli-1.3.1.jar
[ERROR] urls[7] = file:/home/jenkins/jenkins-slave/maven-repositories/1/com/google/guava/guava/19.0/guava-19.0.jar
[ERROR] urls[8] = file:/usr/local/asfpackages/java/jdk1.7.0_80/jre/../lib/tools.jar
[ERROR] urls[9] = file:/home/jenkins/jenkins-slave/maven-repositories/1/org/apache/directory/buildtools/checkstyle-configuration/0.3/checkstyle-configuration-0.3.jar
[ERROR] urls[10] = file:/home/jenkins/jenkins-slave/maven-repositories/1/org/slf4j/slf4j-jdk14/1.5.6/slf4j-jdk14-1.5.6.jar
[ERROR] urls[11] = file:/home/jenkins/jenkins-slave/maven-repositories/1/org/slf4j/jcl-over-slf4j/1.5.6/jcl-over-slf4j-1.5.6.jar
[ERROR] urls[12] = file:/home/jenkins/jenkins-slave/maven-repositories/1/junit/junit/3.8.1/junit-3.8.1.jar
[ERROR] urls[13] = file:/home/jenkins/jenkins-slave/maven-repositories/1/org/codehaus/plexus/plexus-interactivity-api/1.0-alpha-4/plexus-interactivity-api-1.0-alpha-4.jar
[ERROR] urls[14] = file:/home/jenkins/jenkins-slave/maven-repositories/1/backport-util-concurrent/backport-util-concurrent/3.1/backport-util-concurrent-3.1.jar
[ERROR] urls[15] = file:/home/jenkins/jenkins-slave/maven-repositories/1/org/sonatype/plexus/plexus-sec-dispatcher/1.3/plexus-sec-dispatcher-1.3.jar
[ERROR] urls[16] = file:/home/jenkins/jenkins-slave/maven-repositories/1/org/sonatype/plexus/plexus-cipher/1.4/plexus-cipher-1.4.jar
[ERROR] urls[17] = file:/home/jenkins/jenkins-slave/maven-repositories/1/org/apache/maven/reporting/maven-reporting-api/3.0/maven-reporting-api-3.0.jar
[ERROR] urls[18] = file:/home/jenkins/jenkins-slave/maven-repositories/1/org/apache/maven/reporting/maven-reporting-impl/2.3/maven-reporting-impl-2.3.jar
[ERROR] urls[19] = file:/home/jenkins/jenkins-slave/maven-repositories/1/org/apache/maven/shared/maven-shared-utils/0.6/maven-shared-utils-0.6.jar
[ERROR] urls[20] = file:/home/jenkins/jenkins-slave/maven-repositories/1/com/google/code/findbugs/jsr305/2.0.1/jsr305-2.0.1.jar
[ERROR] urls[21] = file:/home/jenkins/jenkins-slave/maven-repositories/1/org/apache/maven/doxia/doxia-core/1.2/doxia-core-1.2.jar
[ERROR] urls[22] = file:/home/jenkins/jenkins-slave/maven-repositories/1/xerces/xercesImpl/2.9.1/xercesImpl-2.9.1.jar
[ERROR] urls[23] = file:/home/jenkins/jenkins-slave/maven-repositories/1/xml-apis/xml-apis/1.3.04/xml-apis-1.3.04.jar
[ERROR] urls[24] = file:/home/jenkins/jenkins-slave/maven-repositories/1/org/apache/httpcomponents/httpclient/4.0.2/httpclient-4.0.2.jar
[ERROR] urls[25] = file:/home/jenkins/jenkins-slave/maven-repositories/1/org/apache/httpcomponents/httpcore/4.0.1/httpcore-4.0.1.jar
[ERROR] urls[26] = file:/home/jenkins/jenkins-slave/maven-repositories/1/commons-codec/commons-codec/1.3/commons-codec-1.3.jar
[ERROR] urls[27] = file:/home/jenkins/jenkins-slave/maven-repositories/1/commons-validator/commons-validator/1.3.1/commons-validator-1.3.1.jar
[ERROR] urls[28] = file:/home/jenkins/jenkins-slave/maven-repositories/1/commons-digester/commons-digester/1.6/commons-digester-1.6.jar
[ERROR] urls[29] = file:/home/jenkins/jenkins-slave/maven-repositories/1/org/apache/maven/doxia/doxia-sink-api/1.4/doxia-sink-api-1.4.jar
[ERROR] urls[30] = file:/home/jenkins/jenkins-slave/maven-repositories/1/org/apache/maven/doxia/doxia-logging-api/1.4/doxia-logging-api-1.4.jar
[ERROR] urls[31] = file:/home/jenkins/jenkins-slave/maven-repositories/1/org/apache/maven/doxia/doxia-decoration-model/1.4/doxia-decoration-model-1.4.jar
[ERROR] urls[32] = file:/home/jenkins/jenkins-slave/maven-repositories/1/org/apache/maven/doxia/doxia-site-renderer/1.4/doxia-site-renderer-1.4.jar
[ERROR] urls[33] = file:/home/jenkins/jenkins-slave/maven-repositories/1/org/apache/maven/doxia/doxia-module-xhtml/1.4/doxia-module-xhtml-1.4.jar
[ERROR] urls[34] = file:/home/jenkins/jenkins-slave/maven-repositories/1/org/apache/maven/doxia/doxia-module-fml/1.4/doxia-module-fml-1.4.jar
[ERROR] urls[35] = file:/home/jenkins/jenkins-slave/maven-repositories/1/org/codehaus/plexus/plexus-i18n/1.0-beta-7/plexus-i18n-1.0-beta-7.jar
[ERROR] urls[36] = file:/home/jenkins/jenkins-slave/maven-repositories/1/org/apache/velocity/velocity-tools/2.0/velocity-tools-2.0.jar
[ERROR] urls[37] = file:/home/jenkins/jenkins-slave/maven-repositories/1/commons-chain/commons-chain/1.1/commons-chain-1.1.jar
[ERROR] urls[38] = file:/home/jenkins/jenkins-slave/maven-repositories/1/dom4j/dom4j/1.1/dom4j-1.1.jar
[ERROR] urls[39] = file:/home/jenkins/jenkins-slave/maven-repositories/1/sslext/sslext/1.2-0/sslext-1.2-0.jar
[ERROR] urls[40] = file:/home/jenkins/jenkins-slave/maven-repositories/1/org/apache/struts/struts-core/1.3.8/struts-core-1.3.8.jar
[ERROR] urls[41] = file:/home/jenkins/jenkins-slave/maven-repositories/1/org/apache/struts/struts-taglib/1.3.8/struts-taglib-1.3.8.jar
[ERROR] urls[42] = file:/home/jenkins/jenkins-slave/maven-repositories/1/org/apache/struts/struts-tiles/1.3.8/struts-tiles-1.3.8.jar
[ERROR] urls[43] = file:/home/jenkins/jenkins-slave/maven-repositories/1/org/apache/maven/doxia/doxia-integration-tools/1.6/doxia-integration-tools-1.6.jar
[ERROR] urls[44] = file:/home/jenkins/jenkins-slave/maven-repositories/1/commons-io/commons-io/1.4/commons-io-1.4.jar
[ERROR] urls[45] = file:/home/jenkins/jenkins-slave/maven-repositories/1/org/codehaus/plexus/plexus-component-annotations/1.5.5/plexus-component-annotations-1.5.5.jar
[ERROR] urls[46] = file:/home/jenkins/jenkins-slave/maven-repositories/1/org/codehaus/plexus/plexus-resources/1.0.1/plexus-resources-1.0.1.jar
[ERROR] urls[47] = file:/home/jenkins/jenkins-slave/maven-repositories/1/org/codehaus/plexus/plexus-utils/3.0.20/plexus-utils-3.0.20.jar
[ERROR] urls[48] = file:/home/jenkins/jenkins-slave/maven-repositories/1/org/codehaus/plexus/plexus-interpolation/1.21/plexus-interpolation-1.21.jar
[ERROR] urls[49] = file:/home/jenkins/jenkins-slave/maven-repositories/1/org/codehaus/plexus/plexus-velocity/1.1.8/plexus-velocity-1.1.8.jar
[ERROR] urls[50] = file:/home/jenkins/jenkins-slave/maven-repositories/1/org/apache/velocity/velocity/1.5/velocity-1.5.jar
[ERROR] urls[51] = file:/home/jenkins/jenkins-slave/maven-repositories/1/commons-lang/commons-lang/2.1/commons-lang-2.1.jar
[ERROR] urls[52] = file:/home/jenkins/jenkins-slave/maven-repositories/1/oro/oro/2.0.8/oro-2.0.8.jar
[ERROR] urls[53] = file:/home/jenkins/jenkins-slave/maven-repositories/1/commons-collections/commons-collections/3.2.1/commons-collections-3.2.1.jar
[ERROR] Number of foreign imports: 1
[ERROR] import: Entry[import  from realm ClassRealm[project>org.apache.directory.server:apacheds-parent:2.0.0-M24-SNAPSHOT,
parent: ClassRealm[maven.api, parent: null]]]
[ERROR] 
[ERROR] -----------------------------------------------------
[ERROR] -> [Help 1]
[ERROR] 
[ERROR] To see the full stack trace of the errors, re-run Maven with the -e switch.
[ERROR] Re-run Maven using the -X switch to enable full debug logging.
[ERROR] 
[ERROR] For more information about the errors and possible solutions, please read the following
articles:
[ERROR] [Help 1] http://cwiki.apache.org/confluence/display/MAVEN/PluginContainerException
channel stopped

Mime
View raw message