directory-notifications mailing list archives

Site index · List index
Message view « Date » · « Thread »
Top « Date » · « Thread »
From pct...@apache.org
Subject Build failed in Jenkins: directory-fortress-enmasse #525
Date Mon, 05 Dec 2016 07:51:16 GMT
See <https://analysis.apache.org/jenkins/job/directory-fortress-enmasse/525/>

------------------------------------------
Started by timer
Building in workspace <https://analysis.apache.org/jenkins/job/directory-fortress-enmasse/ws/>
Checkout:workspace / <https://analysis.apache.org/jenkins/job/directory-fortress-enmasse/ws/>
- hudson.remoting.LocalChannel@4c764b29
Using strategy: Default
Last Built Revision: Revision 12d6e9975a3a669dd6deada41684bd8ad0f22fbc (origin/master, origin/HEAD)
Fetching changes from 1 remote Git repository
Fetching upstream changes from origin
Seen branch in repository origin/1.0-RC41
Seen branch in repository origin/HEAD
Seen branch in repository origin/master
Seen 3 remote branches
Commencing build of Revision 12d6e9975a3a669dd6deada41684bd8ad0f22fbc (origin/master, origin/HEAD)
Checking out Revision 12d6e9975a3a669dd6deada41684bd8ad0f22fbc (origin/master, origin/HEAD)
Warning : There are multiple branch changesets here
Parsing POMs
[workspace] $ /x1/jenkins/jenkins-master/jenkins-home/tools/hudson.model.JDK/jdk1.7.0_65/bin/java
-Xms256m -Xmx512m -XX:+UseCompressedOops -XX:MaxPermSize=256m -cp /x1/jenkins/jenkins-master/jenkins-home/plugins/maven-plugin/WEB-INF/lib/maven3-agent-1.6.jar:/x1/jenkins/jenkins-master/jenkins-home/tools/hudson.tasks.Maven_MavenInstallation/maven-3.0.5/boot/plexus-classworlds-2.4.jar
org.jvnet.hudson.maven3.agent.Maven3Main /x1/jenkins/jenkins-master/jenkins-home/tools/hudson.tasks.Maven_MavenInstallation/maven-3.0.5
/x1/jenkins/jenkins-master/catalina-base/webapps/jenkins/WEB-INF/lib/remoting-2.36.jar /x1/jenkins/jenkins-master/jenkins-home/plugins/maven-plugin/WEB-INF/lib/maven3-interceptor-1.6.jar
/x1/jenkins/jenkins-master/jenkins-home/plugins/maven-plugin/WEB-INF/lib/maven3-interceptor-commons-1.6.jar
35424
<===[JENKINS REMOTING CAPACITY]===>   channel started
log4j:WARN No appenders could be found for logger (org.apache.commons.beanutils.converters.BooleanConverter).
log4j:WARN Please initialize the log4j system properly.
Executing Maven:  -B -f <https://analysis.apache.org/jenkins/job/directory-fortress-enmasse/ws/pom.xml>
clean install -U -DskipTests -fae
[INFO] Scanning for projects...
[WARNING] 
[WARNING] Some problems were encountered while building the effective model for org.apache.directory.fortress:fortress-rest:war:2.0.0-RC2-SNAPSHOT
[WARNING] 'build.plugins.plugin.version' for org.codehaus.mojo:tomcat-maven-plugin is missing.
@ line 280, column 15
[WARNING] 'reporting.plugins.plugin.version' for org.apache.maven.plugins:maven-javadoc-plugin
is missing. @ line 405, column 15
[WARNING] 
[WARNING] It is highly recommended to fix these problems because they threaten the stability
of your build.
[WARNING] 
[WARNING] For this reason, future Maven versions might no longer support building such malformed
projects.
[WARNING] 
[INFO]                                                                         
[INFO] ------------------------------------------------------------------------
[INFO] Building Apache Fortress Rest 2.0.0-RC2-SNAPSHOT
[INFO] ------------------------------------------------------------------------
Downloading: http://repo.maven.apache.org/maven2/org/codehaus/mojo/tomcat-maven-plugin/maven-metadata.xml
Downloaded: http://repo.maven.apache.org/maven2/org/codehaus/mojo/tomcat-maven-plugin/maven-metadata.xml
(439 B at 1.6 KB/sec)
[INFO] 
[INFO] --- maven-clean-plugin:2.6.1:clean (default-clean) @ fortress-rest ---
[INFO] Deleting <https://analysis.apache.org/jenkins/job/directory-fortress-enmasse/ws/target>
[INFO] 
[INFO] --- maven-remote-resources-plugin:1.5:process (default) @ fortress-rest ---
[INFO] 
[INFO] --- maven-resources-plugin:2.7:resources (default-resources) @ fortress-rest ---
[INFO] Using 'UTF-8' encoding to copy filtered resources.
[INFO] Copying 6 resources
[INFO] Copying 3 resources
[INFO] 
[INFO] --- maven-compiler-plugin:3.3:compile (default-compile) @ fortress-rest ---
[INFO] Changes detected - recompiling the module!
[INFO] Compiling 15 source files to <https://analysis.apache.org/jenkins/job/directory-fortress-enmasse/ws/target/classes>
[INFO] 
[INFO] --- maven-resources-plugin:2.7:testResources (default-testResources) @ fortress-rest
---
[INFO] Using 'UTF-8' encoding to copy filtered resources.
[INFO] Copying 23 resources
[INFO] Copying 3 resources
[INFO] 
[INFO] --- maven-compiler-plugin:3.3:testCompile (default-testCompile) @ fortress-rest ---
[INFO] Changes detected - recompiling the module!
[INFO] Compiling 1 source file to <https://analysis.apache.org/jenkins/job/directory-fortress-enmasse/ws/target/test-classes>
[INFO] 
[INFO] --- maven-surefire-plugin:2.18.1:test (default-test) @ fortress-rest ---
[INFO] Tests are skipped.
[INFO] 
[INFO] --- maven-antrun-plugin:1.8:run (default) @ fortress-rest ---
[INFO] Executing tasks

fortress-load:
[INFO] Executed tasks
[INFO] 
[INFO] --- maven-war-plugin:2.4:war (default-war) @ fortress-rest ---
[INFO] Packaging webapp
[INFO] Assembling webapp [fortress-rest] in [<https://analysis.apache.org/jenkins/job/directory-fortress-enmasse/ws/target/fortress-rest-2.0.0-RC2-SNAPSHOT]>
[INFO] Processing war project
[INFO] Copying webapp webResources [<https://analysis.apache.org/jenkins/job/directory-fortress-enmasse/ws/src/main/resources]>
to [<https://analysis.apache.org/jenkins/job/directory-fortress-enmasse/ws/target/fortress-rest-2.0.0-RC2-SNAPSHOT]>
[INFO] Copying webapp resources [<https://analysis.apache.org/jenkins/job/directory-fortress-enmasse/ws/src/main/webapp]>
[INFO] Webapp assembled in [257 msecs]
[INFO] Building war: <https://analysis.apache.org/jenkins/job/directory-fortress-enmasse/ws/target/fortress-rest.war>
[INFO] Packaging classes
[INFO] Building jar: <https://analysis.apache.org/jenkins/job/directory-fortress-enmasse/ws/target/fortress-rest-classes.jar>
[INFO] 
[INFO] --- maven-site-plugin:3.4:attach-descriptor (attach-descriptor) @ fortress-rest ---
[WARNING] Failed to getClass for org.apache.maven.plugin.source.SourceJarMojo
[INFO] 
[INFO] --- maven-source-plugin:2.4:jar (attach-sources) @ fortress-rest ---
[INFO] Building jar: <https://analysis.apache.org/jenkins/job/directory-fortress-enmasse/ws/target/fortress-rest-2.0.0-RC2-SNAPSHOT-sources.jar>
[INFO] 
[INFO] --- tools-maven-plugin:1.4:verify-legal-files (verify-legal-files) @ fortress-rest
---
[INFO] Checking legal files in: fortress-rest.war
[INFO] Checking legal files in: fortress-rest-classes.jar
[INFO] Checking legal files in: fortress-rest-2.0.0-RC2-SNAPSHOT-sources.jar
[INFO] 
[INFO] --- maven-install-plugin:2.5.2:install (default-install) @ fortress-rest ---
[INFO] Installing <https://analysis.apache.org/jenkins/job/directory-fortress-enmasse/ws/target/fortress-rest.war>
to /x1/jenkins/mvn-repo/org/apache/directory/fortress/fortress-rest/2.0.0-RC2-SNAPSHOT/fortress-rest-2.0.0-RC2-SNAPSHOT.war
[INFO] Installing <https://analysis.apache.org/jenkins/job/directory-fortress-enmasse/ws/pom.xml>
to /x1/jenkins/mvn-repo/org/apache/directory/fortress/fortress-rest/2.0.0-RC2-SNAPSHOT/fortress-rest-2.0.0-RC2-SNAPSHOT.pom
[INFO] Installing <https://analysis.apache.org/jenkins/job/directory-fortress-enmasse/ws/target/fortress-rest-classes.jar>
to /x1/jenkins/mvn-repo/org/apache/directory/fortress/fortress-rest/2.0.0-RC2-SNAPSHOT/fortress-rest-2.0.0-RC2-SNAPSHOT-classes.jar
[INFO] Installing <https://analysis.apache.org/jenkins/job/directory-fortress-enmasse/ws/target/fortress-rest-2.0.0-RC2-SNAPSHOT-sources.jar>
to /x1/jenkins/mvn-repo/org/apache/directory/fortress/fortress-rest/2.0.0-RC2-SNAPSHOT/fortress-rest-2.0.0-RC2-SNAPSHOT-sources.jar
[INFO] ------------------------------------------------------------------------
[INFO] BUILD SUCCESS
[INFO] ------------------------------------------------------------------------
[INFO] Total time: 23.600s
[INFO] Finished at: Mon Dec 05 07:51:15 UTC 2016
[INFO] Final Memory: 30M/311M
[INFO] ------------------------------------------------------------------------
channel stopped
ERROR: Failed to parse POMs
java.io.IOException: Remote call on Channel to Maven [/x1/jenkins/jenkins-master/jenkins-home/tools/hudson.model.JDK/jdk1.7.0_65/bin/java,
-Xms256m, -Xmx512m, -XX:+UseCompressedOops, -XX:MaxPermSize=256m, -cp, /x1/jenkins/jenkins-master/jenkins-home/plugins/maven-plugin/WEB-INF/lib/maven3-agent-1.6.jar:/x1/jenkins/jenkins-master/jenkins-home/tools/hudson.tasks.Maven_MavenInstallation/maven-3.0.5/boot/plexus-classworlds-2.4.jar,
org.jvnet.hudson.maven3.agent.Maven3Main, /x1/jenkins/jenkins-master/jenkins-home/tools/hudson.tasks.Maven_MavenInstallation/maven-3.0.5,
/x1/jenkins/jenkins-master/catalina-base/webapps/jenkins/WEB-INF/lib/remoting-2.36.jar, /x1/jenkins/jenkins-master/jenkins-home/plugins/maven-plugin/WEB-INF/lib/maven3-interceptor-1.6.jar,
/x1/jenkins/jenkins-master/jenkins-home/plugins/maven-plugin/WEB-INF/lib/maven3-interceptor-commons-1.6.jar,
35424] failed
	at hudson.remoting.Channel.call(Channel.java:731)
	at hudson.maven.ProcessCache$MavenProcess.call(ProcessCache.java:161)
	at hudson.maven.MavenModuleSetBuild$MavenModuleSetBuildExecution.doRun(MavenModuleSetBuild.java:849)
	at hudson.model.AbstractBuild$AbstractBuildExecution.run(AbstractBuild.java:523)
	at hudson.model.Run.execute(Run.java:1689)
	at hudson.maven.MavenModuleSetBuild.run(MavenModuleSetBuild.java:531)
	at hudson.model.ResourceController.execute(ResourceController.java:88)
	at hudson.model.Executor.run(Executor.java:231)
Caused by: java.lang.Error: Unable to load resource hudson/maven/Messages.properties
	at hudson.remoting.RemoteClassLoader.findResource(RemoteClassLoader.java:376)
	at java.lang.ClassLoader.getResource(ClassLoader.java:1147)
	at java.lang.Class.getResource(Class.java:2142)
	at org.jvnet.localizer.ResourceBundleHolder.get(ResourceBundleHolder.java:83)
	at org.jvnet.localizer.ResourceBundleHolder.get(ResourceBundleHolder.java:102)
	at org.jvnet.localizer.ResourceBundleHolder.get(ResourceBundleHolder.java:102)
	at org.jvnet.localizer.ResourceBundleHolder.format(ResourceBundleHolder.java:139)
	at hudson.maven.Messages.MavenBuilder_Waiting(Messages.java:475)
	at hudson.maven.AbstractMavenBuilder.waitForAsynchronousExecutions(AbstractMavenBuilder.java:184)
	at hudson.maven.Maven3Builder.call(Maven3Builder.java:143)
	at hudson.maven.Maven3Builder.call(Maven3Builder.java:71)
	at hudson.remoting.UserRequest.perform(UserRequest.java:118)
	at hudson.remoting.UserRequest.perform(UserRequest.java:48)
	at hudson.remoting.Request$2.run(Request.java:328)
	at hudson.remoting.InterceptingExecutorService$1.call(InterceptingExecutorService.java:72)
	at java.util.concurrent.FutureTask.run(FutureTask.java:262)
	at java.util.concurrent.ThreadPoolExecutor.runWorker(ThreadPoolExecutor.java:1145)
	at java.util.concurrent.ThreadPoolExecutor$Worker.run(ThreadPoolExecutor.java:615)
	at java.lang.Thread.run(Thread.java:745)
Caused by: java.io.FileNotFoundException: /x1/jenkins/jenkins-master/jenkins-home/plugins/maven-plugin/WEB-INF/lib/classes.jar
(No such file or directory)
	at java.util.zip.ZipFile.open(Native Method)
	at java.util.zip.ZipFile.<init>(ZipFile.java:215)
	at java.util.zip.ZipFile.<init>(ZipFile.java:145)
	at java.util.jar.JarFile.<init>(JarFile.java:154)
	at java.util.jar.JarFile.<init>(JarFile.java:91)
	at sun.net.www.protocol.jar.URLJarFile.<init>(URLJarFile.java:93)
	at sun.net.www.protocol.jar.URLJarFile.getJarFile(URLJarFile.java:69)
	at sun.net.www.protocol.jar.JarFileFactory.get(JarFileFactory.java:99)
	at sun.net.www.protocol.jar.JarURLConnection.connect(JarURLConnection.java:122)
	at sun.net.www.protocol.jar.JarURLConnection.getInputStream(JarURLConnection.java:150)
	at java.net.URL.openStream(URL.java:1037)
	at hudson.remoting.ResourceImageDirect.<init>(ResourceImageDirect.java:29)
	at hudson.remoting.RemoteClassLoader$ResourceFile.<init>(RemoteClassLoader.java:538)
	at hudson.remoting.RemoteClassLoader$ClassLoaderProxy.makeResource(RemoteClassLoader.java:852)
	at hudson.remoting.RemoteClassLoader$ClassLoaderProxy.getResource2(RemoteClassLoader.java:834)
	at sun.reflect.GeneratedMethodAccessor384.invoke(Unknown Source)
	at sun.reflect.DelegatingMethodAccessorImpl.invoke(DelegatingMethodAccessorImpl.java:43)
	at java.lang.reflect.Method.invoke(Method.java:606)
	at hudson.remoting.RemoteInvocationHandler$RPCRequest.perform(RemoteInvocationHandler.java:299)
	at hudson.remoting.Request$2.run(Request.java:328)
	at hudson.remoting.InterceptingExecutorService$1.call(InterceptingExecutorService.java:72)
	at jenkins.util.ContextResettingExecutorService$2.call(ContextResettingExecutorService.java:46)
	... 4 more
Skipping sonar analysis due to bad build status FAILURE

Mime
View raw message