directory-notifications mailing list archives

Site index · List index
Message view « Date » · « Thread »
Top « Date » · « Thread »
From Apache Jenkins Server <jenk...@builds.apache.org>
Subject Build failed in Jenkins: dir-apacheds-ubuntu-deploy #1953
Date Fri, 23 Dec 2016 12:32:28 GMT
See <https://builds.apache.org/job/dir-apacheds-ubuntu-deploy/1953/changes>

Changes:

[elecharny] o Use Strings.EMPTY_BYTES instead of StringConstants.EMPTY_BYTES

------------------------------------------
[...truncated 2185 lines...]
[INFO] ------------------------------------------------------------------------
[INFO] Building ApacheDS LDIF Partition 2.0.0-M24-SNAPSHOT
[INFO] ------------------------------------------------------------------------
[INFO] 
[INFO] --- maven-clean-plugin:2.6.1:clean (default-clean) @ apacheds-ldif-partition ---
[INFO] Deleting <https://builds.apache.org/job/dir-apacheds-ubuntu-deploy/ws/trunk/ldif-partition/target>
[INFO] 
[INFO] --- maven-checkstyle-plugin:2.16:check (validate) @ apacheds-ldif-partition ---
[INFO] 
[INFO] --- maven-remote-resources-plugin:1.5:process (default) @ apacheds-ldif-partition ---
[INFO] 
[INFO] --- maven-resources-plugin:2.7:resources (default-resources) @ apacheds-ldif-partition
---
[INFO] Using 'UTF-8' encoding to copy filtered resources.
[INFO] Copying 2 resources
[INFO] Copying 3 resources
[INFO] 
[INFO] --- maven-compiler-plugin:3.3:compile (default-compile) @ apacheds-ldif-partition ---
[INFO] Changes detected - recompiling the module!
[INFO] Compiling 3 source files to <https://builds.apache.org/job/dir-apacheds-ubuntu-deploy/ws/trunk/ldif-partition/target/classes>
[INFO] <https://builds.apache.org/job/dir-apacheds-ubuntu-deploy/ws/trunk/ldif-partition/src/main/java/org/apache/directory/server/core/partition/ldif/LdifPartition.java>:
<https://builds.apache.org/job/dir-apacheds-ubuntu-deploy/ws/trunk/ldif-partition/src/main/java/org/apache/directory/server/core/partition/ldif/LdifPartition.java>
uses unchecked or unsafe operations.
[INFO] <https://builds.apache.org/job/dir-apacheds-ubuntu-deploy/ws/trunk/ldif-partition/src/main/java/org/apache/directory/server/core/partition/ldif/LdifPartition.java>:
Recompile with -Xlint:unchecked for details.
[INFO] 
[INFO] --- maven-resources-plugin:2.7:testResources (default-testResources) @ apacheds-ldif-partition
---
[INFO] Using 'UTF-8' encoding to copy filtered resources.
[INFO] Copying 1 resource
[INFO] Copying 3 resources
[INFO] 
[INFO] --- maven-compiler-plugin:3.3:testCompile (default-testCompile) @ apacheds-ldif-partition
---
[INFO] Changes detected - recompiling the module!
[INFO] Compiling 3 source files to <https://builds.apache.org/job/dir-apacheds-ubuntu-deploy/ws/trunk/ldif-partition/target/test-classes>
[INFO] <https://builds.apache.org/job/dir-apacheds-ubuntu-deploy/ws/trunk/ldif-partition/src/test/java/org/apache/directory/server/core/partition/ldif/LdifPartitionTest.java>:
<https://builds.apache.org/job/dir-apacheds-ubuntu-deploy/ws/trunk/ldif-partition/src/test/java/org/apache/directory/server/core/partition/ldif/LdifPartitionTest.java>
uses or overrides a deprecated API.
[INFO] <https://builds.apache.org/job/dir-apacheds-ubuntu-deploy/ws/trunk/ldif-partition/src/test/java/org/apache/directory/server/core/partition/ldif/LdifPartitionTest.java>:
Recompile with -Xlint:deprecation for details.
[INFO] 
[INFO] --- maven-surefire-plugin:2.18.1:test (default-test) @ apacheds-ldif-partition ---
[INFO] Surefire report directory: <https://builds.apache.org/job/dir-apacheds-ubuntu-deploy/ws/trunk/ldif-partition/target/surefire-reports>

-------------------------------------------------------
 T E S T S
-------------------------------------------------------
Running org.apache.directory.server.core.partition.ldif.SingleFileLdifPartitionTest
Tests run: 14, Failures: 0, Errors: 0, Skipped: 1, Time elapsed: 2.828 sec - in org.apache.directory.server.core.partition.ldif.SingleFileLdifPartitionTest
Running org.apache.directory.server.core.partition.ldif.LdifPartitionTest
Tests run: 11, Failures: 0, Errors: 0, Skipped: 0, Time elapsed: 0.963 sec - in org.apache.directory.server.core.partition.ldif.LdifPartitionTest

Results :

Tests run: 25, Failures: 0, Errors: 0, Skipped: 1

[JENKINS] Recording test results
[INFO] 
[INFO] --- maven-bundle-plugin:2.5.3:bundle (default-bundle) @ apacheds-ldif-partition ---
[INFO] 
[INFO] --- maven-site-plugin:3.4:attach-descriptor (attach-descriptor) @ apacheds-ldif-partition
---
[INFO] 
[INFO] --- tools-maven-plugin:1.4:verify-legal-files (verify-legal-files) @ apacheds-ldif-partition
---
[INFO] Checking legal files in: apacheds-ldif-partition-2.0.0-M24-SNAPSHOT.jar
[INFO] 
[INFO] >>> maven-source-plugin:2.4:jar (attach-sources) > generate-sources @ apacheds-ldif-partition
>>>
[INFO] 
[INFO] --- maven-checkstyle-plugin:2.16:check (validate) @ apacheds-ldif-partition ---
[WARNING] Failed to getClass for org.apache.maven.plugin.source.SourceJarMojo
[INFO] 
[INFO] <<< maven-source-plugin:2.4:jar (attach-sources) < generate-sources @ apacheds-ldif-partition
<<<
[INFO] 
[INFO] --- maven-source-plugin:2.4:jar (attach-sources) @ apacheds-ldif-partition ---
[INFO] Building jar: <https://builds.apache.org/job/dir-apacheds-ubuntu-deploy/ws/trunk/ldif-partition/target/apacheds-ldif-partition-2.0.0-M24-SNAPSHOT-sources.jar>
[INFO] 
[INFO] --- maven-install-plugin:2.5.2:install (default-install) @ apacheds-ldif-partition
---
[INFO] Installing <https://builds.apache.org/job/dir-apacheds-ubuntu-deploy/ws/trunk/ldif-partition/target/apacheds-ldif-partition-2.0.0-M24-SNAPSHOT.jar>
to /home/jenkins/jenkins-slave/maven-repositories/1/org/apache/directory/server/apacheds-ldif-partition/2.0.0-M24-SNAPSHOT/apacheds-ldif-partition-2.0.0-M24-SNAPSHOT.jar
[INFO] Installing <https://builds.apache.org/job/dir-apacheds-ubuntu-deploy/ws/trunk/ldif-partition/pom.xml>
to /home/jenkins/jenkins-slave/maven-repositories/1/org/apache/directory/server/apacheds-ldif-partition/2.0.0-M24-SNAPSHOT/apacheds-ldif-partition-2.0.0-M24-SNAPSHOT.pom
[INFO] Installing <https://builds.apache.org/job/dir-apacheds-ubuntu-deploy/ws/trunk/ldif-partition/target/apacheds-ldif-partition-2.0.0-M24-SNAPSHOT-sources.jar>
to /home/jenkins/jenkins-slave/maven-repositories/1/org/apache/directory/server/apacheds-ldif-partition/2.0.0-M24-SNAPSHOT/apacheds-ldif-partition-2.0.0-M24-SNAPSHOT-sources.jar
[INFO] 
[INFO] --- maven-bundle-plugin:2.5.3:install (default-install) @ apacheds-ldif-partition ---
[INFO] Installing org/apache/directory/server/apacheds-ldif-partition/2.0.0-M24-SNAPSHOT/apacheds-ldif-partition-2.0.0-M24-SNAPSHOT.jar
[INFO] Writing OBR metadata
[INFO] 
[INFO] --- maven-deploy-plugin:2.8.2:deploy (default-deploy) @ apacheds-ldif-partition ---
[INFO] Downloading: https://repository.apache.org/content/repositories/snapshots/org/apache/directory/server/apacheds-ldif-partition/2.0.0-M24-SNAPSHOT/maven-metadata.xml
[INFO] Downloaded: https://repository.apache.org/content/repositories/snapshots/org/apache/directory/server/apacheds-ldif-partition/2.0.0-M24-SNAPSHOT/maven-metadata.xml
(2 KB at 1.7 KB/sec)
[INFO] Uploading: https://repository.apache.org/content/repositories/snapshots/org/apache/directory/server/apacheds-ldif-partition/2.0.0-M24-SNAPSHOT/apacheds-ldif-partition-2.0.0-M24-20161223.115528-30.jar
[INFO] Uploaded: https://repository.apache.org/content/repositories/snapshots/org/apache/directory/server/apacheds-ldif-partition/2.0.0-M24-SNAPSHOT/apacheds-ldif-partition-2.0.0-M24-20161223.115528-30.jar
(29 KB at 31.4 KB/sec)
[INFO] Uploading: https://repository.apache.org/content/repositories/snapshots/org/apache/directory/server/apacheds-ldif-partition/2.0.0-M24-SNAPSHOT/apacheds-ldif-partition-2.0.0-M24-20161223.115528-30.pom
[INFO] Uploaded: https://repository.apache.org/content/repositories/snapshots/org/apache/directory/server/apacheds-ldif-partition/2.0.0-M24-SNAPSHOT/apacheds-ldif-partition-2.0.0-M24-20161223.115528-30.pom
(4 KB at 3.9 KB/sec)
[INFO] Downloading: https://repository.apache.org/content/repositories/snapshots/org/apache/directory/server/apacheds-ldif-partition/maven-metadata.xml
[INFO] Downloaded: https://repository.apache.org/content/repositories/snapshots/org/apache/directory/server/apacheds-ldif-partition/maven-metadata.xml
(418 B at 0.8 KB/sec)
[INFO] Uploading: https://repository.apache.org/content/repositories/snapshots/org/apache/directory/server/apacheds-ldif-partition/2.0.0-M24-SNAPSHOT/maven-metadata.xml
[INFO] Uploaded: https://repository.apache.org/content/repositories/snapshots/org/apache/directory/server/apacheds-ldif-partition/2.0.0-M24-SNAPSHOT/maven-metadata.xml
(2 KB at 1.2 KB/sec)
[INFO] Uploading: https://repository.apache.org/content/repositories/snapshots/org/apache/directory/server/apacheds-ldif-partition/maven-metadata.xml
[INFO] Uploaded: https://repository.apache.org/content/repositories/snapshots/org/apache/directory/server/apacheds-ldif-partition/maven-metadata.xml
(418 B at 0.5 KB/sec)
[INFO] Uploading: https://repository.apache.org/content/repositories/snapshots/org/apache/directory/server/apacheds-ldif-partition/2.0.0-M24-SNAPSHOT/apacheds-ldif-partition-2.0.0-M24-20161223.115528-30-sources.jar
[INFO] Uploaded: https://repository.apache.org/content/repositories/snapshots/org/apache/directory/server/apacheds-ldif-partition/2.0.0-M24-SNAPSHOT/apacheds-ldif-partition-2.0.0-M24-20161223.115528-30-sources.jar
(23 KB at 24.8 KB/sec)
[INFO] Uploading: https://repository.apache.org/content/repositories/snapshots/org/apache/directory/server/apacheds-ldif-partition/2.0.0-M24-SNAPSHOT/maven-metadata.xml
[INFO] Uploaded: https://repository.apache.org/content/repositories/snapshots/org/apache/directory/server/apacheds-ldif-partition/2.0.0-M24-SNAPSHOT/maven-metadata.xml
(2 KB at 1.2 KB/sec)
[INFO] 
[INFO] --- maven-bundle-plugin:2.5.3:deploy (default-deploy) @ apacheds-ldif-partition ---
[INFO] Remote OBR update disabled (enable with -DremoteOBR)
[JENKINS] Archiving disabled
[INFO]                                                                         
[INFO] ------------------------------------------------------------------------
[INFO] Building ApacheDS JDBM Partition 2.0.0-M24-SNAPSHOT
[INFO] ------------------------------------------------------------------------
[INFO] Downloading: http://repository.apache.org/snapshots/org/apache/directory/server/apacheds-xdbm-partition/2.0.0-M24-SNAPSHOT/maven-metadata.xml
[INFO] Downloaded: http://repository.apache.org/snapshots/org/apache/directory/server/apacheds-xdbm-partition/2.0.0-M24-SNAPSHOT/maven-metadata.xml
(2 KB at 2.6 KB/sec)
[INFO] Downloading: http://repository.apache.org/snapshots/org/apache/directory/server/apacheds-xdbm-partition/2.0.0-M24-SNAPSHOT/apacheds-xdbm-partition-2.0.0-M24-20161223.115509-30-tests.jar
[INFO] Downloaded: http://repository.apache.org/snapshots/org/apache/directory/server/apacheds-xdbm-partition/2.0.0-M24-SNAPSHOT/apacheds-xdbm-partition-2.0.0-M24-20161223.115509-30-tests.jar
(101 KB at 166.3 KB/sec)
[INFO] 
[INFO] --- maven-clean-plugin:2.6.1:clean (default-clean) @ apacheds-jdbm-partition ---
[INFO] Deleting <https://builds.apache.org/job/dir-apacheds-ubuntu-deploy/ws/trunk/jdbm-partition/target>
[INFO] 
[INFO] --- maven-checkstyle-plugin:2.16:check (validate) @ apacheds-jdbm-partition ---
[INFO] There is 1 error reported by Checkstyle 6.8.1 with directory-checks.xml ruleset.
[ERROR] src/main/java/org/apache/directory/server/core/partition/impl/btree/jdbm/JdbmTable.java[42:8]
(imports) UnusedImports: Unused import - org.apache.directory.api.util.StringConstants.
[JENKINS] Archiving disabled
[JENKINS] Archiving disabled
[JENKINS] Archiving disabled
[JENKINS] Archiving disabled
[JENKINS] Archiving disabled
[JENKINS] Archiving disabled
[JENKINS] Archiving disabled
[JENKINS] Archiving disabled
[JENKINS] Archiving disabled
[JENKINS] Archiving disabled
[JENKINS] Archiving disabled
[JENKINS] Archiving disabled
[JENKINS] Archiving disabled
[JENKINS] Archiving disabled
[JENKINS] Archiving disabled
[JENKINS] Archiving disabled
[JENKINS] Archiving disabled
[JENKINS] Archiving disabled
[JENKINS] Archiving disabled
[JENKINS] Archiving disabled
[JENKINS] Archiving disabled
[JENKINS] Archiving disabled
[JENKINS] Archiving disabled
[JENKINS] Archiving disabled
[JENKINS] Archiving disabled
[JENKINS] Archiving disabled
[JENKINS] Archiving disabled
[JENKINS] Archiving disabled
[JENKINS] Archiving disabled
[JENKINS] Archiving disabled
[JENKINS] Archiving disabled
[JENKINS] Archiving disabled
[JENKINS] Archiving disabled
[JENKINS] Archiving disabled
[JENKINS] Archiving disabled
[JENKINS] Archiving disabled
[JENKINS] Archiving disabled
[JENKINS] Archiving disabled
[JENKINS] Archiving disabled
[JENKINS] Archiving disabled
[JENKINS] Archiving disabled
[JENKINS] Archiving disabled
[JENKINS] Archiving disabled
[JENKINS] Archiving disabled
[JENKINS] Archiving disabled
[JENKINS] Archiving disabled
[JENKINS] Archiving disabled
[JENKINS] Archiving disabled
[JENKINS] Archiving disabled
[JENKINS] Archiving disabled
[JENKINS] Archiving disabled
[JENKINS] Archiving disabled
[JENKINS] Archiving disabled
[JENKINS] Archiving disabled
[JENKINS] Archiving disabled
[JENKINS] Archiving disabled
[JENKINS] Archiving disabled
[JENKINS] Archiving disabled[INFO] ------------------------------------------------------------------------
[INFO] Reactor Summary:
[INFO] 
[INFO] ApacheDS ........................................... SUCCESS [ 12.144 s]
[INFO] ApacheDS I18n ...................................... SUCCESS [  9.853 s]
[INFO] ApacheDS Core Constants ............................ SUCCESS [  8.061 s]
[INFO] ApacheDS Core API .................................. SUCCESS [ 29.167 s]
[INFO] ApacheDS Core Shared ............................... SUCCESS [ 12.471 s]
[INFO] ApacheDS Interceptors .............................. SUCCESS [  4.699 s]
[INFO] ApacheDS AdministrativePoint Interceptor ........... SUCCESS [ 11.499 s]
[INFO] ApacheDS Authentication Interceptor ................ SUCCESS [ 12.598 s]
[INFO] ApacheDS Interceptor to increment numeric attributes SUCCESS [  9.765 s]
[INFO] ApacheDS Authorization Interceptor ................. SUCCESS [ 13.573 s]
[INFO] ApacheDS ChangeLog Interceptor ..................... SUCCESS [ 11.472 s]
[INFO] ApacheDS Collective Attribute Interceptor .......... SUCCESS [ 10.680 s]
[INFO] ApacheDS Event Interceptor ......................... SUCCESS [ 10.238 s]
[INFO] ApacheDS Exception Interceptor ..................... SUCCESS [ 12.079 s]
[INFO] ApacheDS Journal Interceptor ....................... SUCCESS [ 10.065 s]
[INFO] ApacheDS Normalization Interceptor ................. SUCCESS [ 12.060 s]
[INFO] ApacheDS Operational Attribute Interceptor ......... SUCCESS [  9.909 s]
[INFO] ApacheDS Referral Interceptor ...................... SUCCESS [ 11.828 s]
[INFO] ApacheDS Schema Interceptor ........................ SUCCESS [ 14.290 s]
[INFO] ApacheDS Subtree Interceptor ....................... SUCCESS [ 13.263 s]
[INFO] ApacheDS Triggers Interceptor ...................... SUCCESS [ 12.104 s]
[INFO] ApacheDS Core ...................................... SUCCESS [ 14.268 s]
[INFO] ApacheDS Core AVL .................................. SUCCESS [ 13.727 s]
[INFO] ApacheDS Generalized (X) DBM Partition ............. SUCCESS [ 23.862 s]
[INFO] ApacheDS LDIF Partition ............................ SUCCESS [ 15.945 s]
[INFO] ApacheDS JDBM Partition ............................ FAILURE [  2.424 s]
[INFO] ApacheDS Mavibot Partition ......................... SKIPPED
[INFO] ApacheDS Core Annotations .......................... SKIPPED
[INFO] ApacheDS Core JNDI ................................. SKIPPED
[INFO] ApacheDS Protocol Kerberos Codec ................... SKIPPED
[INFO] ApacheDS Interceptors for Kerberos ................. SKIPPED
[INFO] ApacheDS Protocol Dhcp ............................. SKIPPED
[INFO] ApacheDS Protocol Shared ........................... SKIPPED
[INFO] ApacheDS Protocol Dns .............................. SKIPPED
[INFO] ApacheDS Protocol Kerberos ......................... SKIPPED
[INFO] ApacheDS Protocol Ldap ............................. SKIPPED
[INFO] ApacheDS Protocol Ntp .............................. SKIPPED
[INFO] Apacheds Server Annotations ........................ SKIPPED
[INFO] ApacheDS Server Config ............................. SKIPPED
[INFO] ApacheDS Server JNDI ............................... SKIPPED
[INFO] ApacheDS Test Framework ............................ SKIPPED
[INFO] ApacheDS All ....................................... SKIPPED
[INFO] ApacheDS Logger Interceptor ........................ SKIPPED
[INFO] ApacheDS Password Hashing Interceptor .............. SKIPPED
[INFO] ApacheDS Core Integration .......................... SKIPPED
[INFO] ApacheDS Protocol Kerberos Test .................... SKIPPED
[INFO] ApacheDS Server Integration ........................ SKIPPED
[INFO] ApacheDS DirectoryService-WebApp bridge ............ SKIPPED
[INFO] ApacheDS Jetty HTTP Server Integration ............. SKIPPED
[INFO] ApacheDS Service Builder ........................... SKIPPED
[INFO] Apache Directory LDAP Client API test .............. SKIPPED
[INFO] kerberos-client .................................... SKIPPED
[INFO] ApacheDS Service ................................... SKIPPED
[INFO] ApacheDS Wrapper ................................... SKIPPED
[INFO] ApacheDS Installers Maven Plugin ................... SKIPPED
[INFO] ApacheDS Installers ................................ SKIPPED
[INFO] ApacheDS OSGi Integration Tests .................... SKIPPED
[INFO] ------------------------------------------------------------------------
[INFO] BUILD FAILURE
[INFO] ------------------------------------------------------------------------
[INFO] Total time: 05:51 min
[INFO] Finished at: 2016-12-23T11:55:48+00:00

[INFO] Final Memory: 110M/465M
[INFO] ------------------------------------------------------------------------
Waiting for Jenkins to finish collecting data
[ERROR] Failed to execute goal org.apache.maven.plugins:maven-checkstyle-plugin:2.16:check
(validate) on project apacheds-jdbm-partition: You have 1 Checkstyle violation. -> [Help
1]
[ERROR] 
[ERROR] To see the full stack trace of the errors, re-run Maven with the -e switch.
[ERROR] Re-run Maven using the -X switch to enable full debug logging.
[ERROR] 
[ERROR] For more information about the errors and possible solutions, please read the following
articles:
[ERROR] [Help 1] http://cwiki.apache.org/confluence/display/MAVEN/MojoFailureException
[ERROR] 
[ERROR] After correcting the problems, you can resume the build with the command
[ERROR]   mvn <goals> -rf :apacheds-jdbm-partition
channel stopped

Mime
View raw message