directory-notifications mailing list archives

Site index · List index
Message view « Date » · « Thread »
Top « Date » · « Thread »
From pct...@apache.org
Subject Build failed in Jenkins: directory-kerby #243
Date Mon, 05 Dec 2016 06:24:09 GMT
See <https://analysis.apache.org/jenkins/job/directory-kerby/243/>

------------------------------------------
[...truncated 2029 lines...]
[INFO] ------------------------------------------------------------------------
[INFO] Building Kerby Distribution 1.0.0-RC3-SNAPSHOT
[INFO] ------------------------------------------------------------------------
[INFO] 
[INFO] --- maven-clean-plugin:3.0.0:clean (default-clean) @ kerby-dist ---
[INFO] Deleting <https://analysis.apache.org/jenkins/job/directory-kerby/ws/kerby-dist/target>
[INFO] 
[INFO] --- maven-pmd-plugin:3.6:pmd (pmd) @ kerby-dist ---
[INFO] 
[INFO] --- maven-pmd-plugin:3.6:check (validate) @ kerby-dist ---
[INFO] 
[INFO] --- maven-checkstyle-plugin:2.17:check (validate) @ kerby-dist ---
[INFO] 
[INFO] --- maven-remote-resources-plugin:1.5:process (process-resource-bundles) @ kerby-dist
---
[INFO] 
[INFO] --- maven-site-plugin:3.5.1:attach-descriptor (attach-descriptor) @ kerby-dist ---
[INFO] 
[INFO] --- maven-pmd-plugin:3.6:pmd (pmd) @ kerby-dist ---
[INFO] 
[INFO] --- maven-pmd-plugin:3.6:check (validate) @ kerby-dist ---
[INFO] 
[INFO] --- maven-checkstyle-plugin:2.17:check (validate) @ kerby-dist ---
[WARNING] Failed to getClass for org.apache.maven.plugins.source.SourceJarMojo
[INFO] 
[INFO] --- maven-source-plugin:3.0.0:jar (attach-sources) @ kerby-dist ---
[INFO] 
[INFO] --- maven-install-plugin:2.5.2:install (default-install) @ kerby-dist ---
[INFO] Installing <https://analysis.apache.org/jenkins/job/directory-kerby/ws/kerby-dist/pom.xml>
to /x1/jenkins/mvn-repo/org/apache/kerby/kerby-dist/1.0.0-RC3-SNAPSHOT/kerby-dist-1.0.0-RC3-SNAPSHOT.pom
[INFO]                                                                         
[INFO] ------------------------------------------------------------------------
[INFO] Building KDC Dist 1.0.0-RC3-SNAPSHOT
[INFO] ------------------------------------------------------------------------
[INFO] 
[INFO] --- maven-clean-plugin:3.0.0:clean (default-clean) @ kdc-dist ---
[INFO] Deleting <https://analysis.apache.org/jenkins/job/directory-kerby/ws/kerby-dist/kdc-dist/target>
[INFO] 
[INFO] --- maven-pmd-plugin:3.6:pmd (pmd) @ kdc-dist ---
[INFO] 
[INFO] --- maven-pmd-plugin:3.6:check (validate) @ kdc-dist ---
[INFO] 
[INFO] --- maven-checkstyle-plugin:2.17:check (validate) @ kdc-dist ---
[INFO] 
[INFO] --- maven-remote-resources-plugin:1.5:process (process-resource-bundles) @ kdc-dist
---
[INFO] 
[INFO] --- maven-site-plugin:3.5.1:attach-descriptor (attach-descriptor) @ kdc-dist ---
[INFO] 
[INFO] --- maven-pmd-plugin:3.6:pmd (pmd) @ kdc-dist ---
[INFO] 
[INFO] --- maven-pmd-plugin:3.6:check (validate) @ kdc-dist ---
[INFO] 
[INFO] --- maven-checkstyle-plugin:2.17:check (validate) @ kdc-dist ---
[WARNING] Failed to getClass for org.apache.maven.plugins.source.SourceJarMojo
[INFO] 
[INFO] --- maven-source-plugin:3.0.0:jar (attach-sources) @ kdc-dist ---
[INFO] 
[INFO] --- maven-install-plugin:2.5.2:install (default-install) @ kdc-dist ---
[INFO] Installing <https://analysis.apache.org/jenkins/job/directory-kerby/ws/kerby-dist/kdc-dist/pom.xml>
to /x1/jenkins/mvn-repo/org/apache/kerby/kdc-dist/1.0.0-RC3-SNAPSHOT/kdc-dist-1.0.0-RC3-SNAPSHOT.pom
[INFO]                                                                         
[INFO] ------------------------------------------------------------------------
[INFO] Building Tool Dist 1.0.0-RC3-SNAPSHOT
[INFO] ------------------------------------------------------------------------
[INFO] 
[INFO] --- maven-clean-plugin:3.0.0:clean (default-clean) @ tool-dist ---
[INFO] Deleting <https://analysis.apache.org/jenkins/job/directory-kerby/ws/kerby-dist/tool-dist/target>
[INFO] 
[INFO] --- maven-pmd-plugin:3.6:pmd (pmd) @ tool-dist ---
[INFO] 
[INFO] --- maven-pmd-plugin:3.6:check (validate) @ tool-dist ---
[INFO] 
[INFO] --- maven-checkstyle-plugin:2.17:check (validate) @ tool-dist ---
[INFO] 
[INFO] --- maven-remote-resources-plugin:1.5:process (process-resource-bundles) @ tool-dist
---
[INFO] 
[INFO] --- maven-site-plugin:3.5.1:attach-descriptor (attach-descriptor) @ tool-dist ---
[INFO] 
[INFO] --- maven-pmd-plugin:3.6:pmd (pmd) @ tool-dist ---
[INFO] 
[INFO] --- maven-pmd-plugin:3.6:check (validate) @ tool-dist ---
[INFO] 
[INFO] --- maven-checkstyle-plugin:2.17:check (validate) @ tool-dist ---
[WARNING] Failed to getClass for org.apache.maven.plugins.source.SourceJarMojo
[INFO] 
[INFO] --- maven-source-plugin:3.0.0:jar (attach-sources) @ tool-dist ---
[INFO] 
[INFO] --- maven-install-plugin:2.5.2:install (default-install) @ tool-dist ---
[INFO] Installing <https://analysis.apache.org/jenkins/job/directory-kerby/ws/kerby-dist/tool-dist/pom.xml>
to /x1/jenkins/mvn-repo/org/apache/kerby/tool-dist/1.0.0-RC3-SNAPSHOT/tool-dist-1.0.0-RC3-SNAPSHOT.pom
[INFO]                                                                         
[INFO] ------------------------------------------------------------------------
[INFO] Building Kerby benchmark 1.0.0-RC3-SNAPSHOT
[INFO] ------------------------------------------------------------------------
[INFO] 
[INFO] --- maven-clean-plugin:3.0.0:clean (default-clean) @ benchmark ---
[INFO] Deleting <https://analysis.apache.org/jenkins/job/directory-kerby/ws/benchmark/target>
[INFO] 
[INFO] --- maven-pmd-plugin:3.6:pmd (pmd) @ benchmark ---
[INFO] 
[INFO] --- maven-pmd-plugin:3.6:check (validate) @ benchmark ---
[INFO] 
[INFO] --- maven-checkstyle-plugin:2.17:check (validate) @ benchmark ---
[INFO] 
[INFO] --- maven-remote-resources-plugin:1.5:process (process-resource-bundles) @ benchmark
---
[INFO] 
[INFO] --- maven-resources-plugin:2.7:resources (default-resources) @ benchmark ---
[INFO] Using 'UTF-8' encoding to copy filtered resources.
[INFO] Copying 1 resource
[INFO] Copying 3 resources
[INFO] 
[INFO] --- maven-compiler-plugin:3.5.1:compile (default-compile) @ benchmark ---
[INFO] Changes detected - recompiling the module!
[INFO] Compiling 2 source files to <https://analysis.apache.org/jenkins/job/directory-kerby/ws/benchmark/target/classes>
[INFO] 
[INFO] --- maven-resources-plugin:2.7:testResources (default-testResources) @ benchmark ---
[INFO] Using 'UTF-8' encoding to copy filtered resources.
[INFO] skip non existing resourceDirectory <https://analysis.apache.org/jenkins/job/directory-kerby/ws/benchmark/src/test/resources>
[INFO] Copying 3 resources
[INFO] 
[INFO] --- maven-compiler-plugin:3.5.1:testCompile (default-testCompile) @ benchmark ---
[INFO] No sources to compile
[INFO] 
[INFO] --- maven-surefire-plugin:2.19.1:test (default-test) @ benchmark ---
[INFO] Tests are skipped.
[INFO] 
[INFO] --- maven-surefire-plugin:2.19.1:test (default) @ benchmark ---
[INFO] Tests are skipped.
[INFO] 
[INFO] --- maven-jar-plugin:3.0.0:jar (default-jar) @ benchmark ---
[INFO] Building jar: <https://analysis.apache.org/jenkins/job/directory-kerby/ws/benchmark/target/benchmark-1.0.0-RC3-SNAPSHOT.jar>
[INFO] 
[INFO] --- maven-site-plugin:3.5.1:attach-descriptor (attach-descriptor) @ benchmark ---
[INFO] 
[INFO] --- maven-pmd-plugin:3.6:pmd (pmd) @ benchmark ---
[INFO] 
[INFO] --- maven-pmd-plugin:3.6:check (validate) @ benchmark ---
[INFO] 
[INFO] --- maven-checkstyle-plugin:2.17:check (validate) @ benchmark ---
[WARNING] Failed to getClass for org.apache.maven.plugins.source.SourceJarMojo
[INFO] 
[INFO] --- maven-source-plugin:3.0.0:jar (attach-sources) @ benchmark ---
[INFO] Building jar: <https://analysis.apache.org/jenkins/job/directory-kerby/ws/benchmark/target/benchmark-1.0.0-RC3-SNAPSHOT-sources.jar>
[INFO] 
[INFO] --- maven-install-plugin:2.5.2:install (default-install) @ benchmark ---
[INFO] Installing <https://analysis.apache.org/jenkins/job/directory-kerby/ws/benchmark/target/benchmark-1.0.0-RC3-SNAPSHOT.jar>
to /x1/jenkins/mvn-repo/org/apache/kerby/benchmark/1.0.0-RC3-SNAPSHOT/benchmark-1.0.0-RC3-SNAPSHOT.jar
[INFO] Installing <https://analysis.apache.org/jenkins/job/directory-kerby/ws/benchmark/pom.xml>
to /x1/jenkins/mvn-repo/org/apache/kerby/benchmark/1.0.0-RC3-SNAPSHOT/benchmark-1.0.0-RC3-SNAPSHOT.pom
[INFO] Installing <https://analysis.apache.org/jenkins/job/directory-kerby/ws/benchmark/target/benchmark-1.0.0-RC3-SNAPSHOT-sources.jar>
to /x1/jenkins/mvn-repo/org/apache/kerby/benchmark/1.0.0-RC3-SNAPSHOT/benchmark-1.0.0-RC3-SNAPSHOT-sources.jar
[INFO] ------------------------------------------------------------------------
[INFO] Reactor Summary:
[INFO] 
[INFO] Apache Kerby Project .............................. SUCCESS [9.753s]
[INFO] Kerby-common Project .............................. SUCCESS [1.517s]
[INFO] Kerby ASN1 Project ................................ SUCCESS [14.157s]
[INFO] Kerby Config ...................................... SUCCESS [4.110s]
[INFO] Kerby Util ........................................ SUCCESS [4.158s]
[INFO] Kerby XDR Project ................................. SUCCESS [3.153s]
[INFO] Kerby PKIX Project ................................ SUCCESS [7.129s]
[INFO] Kerby-kerb Project ................................ SUCCESS [1.381s]
[INFO] Kerby-kerb core ................................... SUCCESS [5.553s]
[INFO] Kerby-kerb Crypto ................................. SUCCESS [5.054s]
[INFO] Kerby-kerb Common ................................. SUCCESS [4.037s]
[INFO] Kerby-kerb Util ................................... SUCCESS [3.238s]
[INFO] Kerby-kerb Identity ............................... SUCCESS [2.448s]
[INFO] Kerby-kerb Identity Test .......................... SUCCESS [2.999s]
[INFO] Kerby-kerb Client ................................. SUCCESS [3.438s]
[INFO] Kerby-kerb Server ................................. SUCCESS [4.074s]
[INFO] Kerby-kerb Admin .................................. SUCCESS [3.597s]
[INFO] Kerb Simple Kdc ................................... SUCCESS [2.382s]
[INFO] Kerby-kerb server all ............................. SUCCESS [1.828s]
[INFO] Kerby KDC Server .................................. SUCCESS [3.318s]
[INFO] Kerb Kdc Test ..................................... SUCCESS [2.948s]
[INFO] Kerby providers ................................... SUCCESS [1.244s]
[INFO] Token provider .................................... SUCCESS [3.077s]
[INFO] Kerb Integration Test ............................. SUCCESS [2.987s]
[INFO] Kerby-kerb Admin Server ........................... SUCCESS [3.122s]
[INFO] Kerby-kerb client api all ......................... SUCCESS [1.966s]
[INFO] Kdc Tool Project .................................. SUCCESS [1.269s]
[INFO] Client Tool ....................................... SUCCESS [2.743s]
[INFO] KDC Tool .......................................... SUCCESS [2.634s]
[INFO] Kerby Backend ..................................... SUCCESS [1.268s]
[INFO] Json identity backend ............................. SUCCESS [2.727s]
[INFO] Zookeeper identity backend ........................ SUCCESS [2.989s]
[INFO] Ldap identity backend ............................. SUCCESS [6.169s]
[INFO] Kerby Kdc Test .................................... SUCCESS [4.269s]
[INFO] Mavibot based backend ............................. SUCCESS [2.695s]
[INFO] Kerby Distribution ................................ SUCCESS [1.309s]
[INFO] KDC Dist .......................................... SUCCESS [1.589s]
[INFO] Tool Dist ......................................... SUCCESS [1.485s]
[INFO] Kerby benchmark ................................... SUCCESS [2.458s]
[INFO] ------------------------------------------------------------------------
[INFO] BUILD SUCCESS
[INFO] ------------------------------------------------------------------------
[INFO] Total time: 2:22.355s
[INFO] Finished at: Mon Dec 05 06:24:07 UTC 2016
[INFO] Final Memory: 65M/472M
[INFO] ------------------------------------------------------------------------
channel stopped
ERROR: Failed to parse POMs
java.io.IOException: Remote call on Channel to Maven [/x1/jenkins/jenkins-master/jenkins-home/tools/hudson.model.JDK/jdk1.7.0_65/bin/java,
-Xms256m, -Xmx512m, -XX:+UseCompressedOops, -XX:MaxPermSize=256m, -cp, /x1/jenkins/jenkins-master/jenkins-home/plugins/maven-plugin/WEB-INF/lib/maven3-agent-1.6.jar:/x1/jenkins/jenkins-master/jenkins-home/tools/hudson.tasks.Maven_MavenInstallation/maven-3.0.5/boot/plexus-classworlds-2.4.jar,
org.jvnet.hudson.maven3.agent.Maven3Main, /x1/jenkins/jenkins-master/jenkins-home/tools/hudson.tasks.Maven_MavenInstallation/maven-3.0.5,
/x1/jenkins/jenkins-master/catalina-base/webapps/jenkins/WEB-INF/lib/remoting-2.36.jar, /x1/jenkins/jenkins-master/jenkins-home/plugins/maven-plugin/WEB-INF/lib/maven3-interceptor-1.6.jar,
/x1/jenkins/jenkins-master/jenkins-home/plugins/maven-plugin/WEB-INF/lib/maven3-interceptor-commons-1.6.jar,
35938] failed
	at hudson.remoting.Channel.call(Channel.java:731)
	at hudson.maven.ProcessCache$MavenProcess.call(ProcessCache.java:161)
	at hudson.maven.MavenModuleSetBuild$MavenModuleSetBuildExecution.doRun(MavenModuleSetBuild.java:849)
	at hudson.model.AbstractBuild$AbstractBuildExecution.run(AbstractBuild.java:523)
	at hudson.model.Run.execute(Run.java:1689)
	at hudson.maven.MavenModuleSetBuild.run(MavenModuleSetBuild.java:531)
	at hudson.model.ResourceController.execute(ResourceController.java:88)
	at hudson.model.Executor.run(Executor.java:231)
Caused by: java.lang.Error: Unable to load resource hudson/maven/Messages.properties
	at hudson.remoting.RemoteClassLoader.findResource(RemoteClassLoader.java:376)
	at java.lang.ClassLoader.getResource(ClassLoader.java:1147)
	at java.lang.Class.getResource(Class.java:2142)
	at org.jvnet.localizer.ResourceBundleHolder.get(ResourceBundleHolder.java:83)
	at org.jvnet.localizer.ResourceBundleHolder.get(ResourceBundleHolder.java:102)
	at org.jvnet.localizer.ResourceBundleHolder.get(ResourceBundleHolder.java:102)
	at org.jvnet.localizer.ResourceBundleHolder.format(ResourceBundleHolder.java:139)
	at hudson.maven.Messages.MavenBuilder_Waiting(Messages.java:475)
	at hudson.maven.AbstractMavenBuilder.waitForAsynchronousExecutions(AbstractMavenBuilder.java:184)
	at hudson.maven.Maven3Builder.call(Maven3Builder.java:143)
	at hudson.maven.Maven3Builder.call(Maven3Builder.java:71)
	at hudson.remoting.UserRequest.perform(UserRequest.java:118)
	at hudson.remoting.UserRequest.perform(UserRequest.java:48)
	at hudson.remoting.Request$2.run(Request.java:328)
	at hudson.remoting.InterceptingExecutorService$1.call(InterceptingExecutorService.java:72)
	at java.util.concurrent.FutureTask.run(FutureTask.java:262)
	at java.util.concurrent.ThreadPoolExecutor.runWorker(ThreadPoolExecutor.java:1145)
	at java.util.concurrent.ThreadPoolExecutor$Worker.run(ThreadPoolExecutor.java:615)
	at java.lang.Thread.run(Thread.java:745)
Caused by: java.io.FileNotFoundException: /x1/jenkins/jenkins-master/jenkins-home/plugins/maven-plugin/WEB-INF/lib/classes.jar
(No such file or directory)
	at java.util.zip.ZipFile.open(Native Method)
	at java.util.zip.ZipFile.<init>(ZipFile.java:215)
	at java.util.zip.ZipFile.<init>(ZipFile.java:145)
	at java.util.jar.JarFile.<init>(JarFile.java:154)
	at java.util.jar.JarFile.<init>(JarFile.java:91)
	at sun.net.www.protocol.jar.URLJarFile.<init>(URLJarFile.java:93)
	at sun.net.www.protocol.jar.URLJarFile.getJarFile(URLJarFile.java:69)
	at sun.net.www.protocol.jar.JarFileFactory.get(JarFileFactory.java:99)
	at sun.net.www.protocol.jar.JarURLConnection.connect(JarURLConnection.java:122)
	at sun.net.www.protocol.jar.JarURLConnection.getInputStream(JarURLConnection.java:150)
	at java.net.URL.openStream(URL.java:1037)
	at hudson.remoting.ResourceImageDirect.<init>(ResourceImageDirect.java:29)
	at hudson.remoting.RemoteClassLoader$ResourceFile.<init>(RemoteClassLoader.java:538)
	at hudson.remoting.RemoteClassLoader$ClassLoaderProxy.makeResource(RemoteClassLoader.java:852)
	at hudson.remoting.RemoteClassLoader$ClassLoaderProxy.getResource2(RemoteClassLoader.java:834)
	at sun.reflect.GeneratedMethodAccessor384.invoke(Unknown Source)
	at sun.reflect.DelegatingMethodAccessorImpl.invoke(DelegatingMethodAccessorImpl.java:43)
	at java.lang.reflect.Method.invoke(Method.java:606)
	at hudson.remoting.RemoteInvocationHandler$RPCRequest.perform(RemoteInvocationHandler.java:299)
	at hudson.remoting.Request$2.run(Request.java:328)
	at hudson.remoting.InterceptingExecutorService$1.call(InterceptingExecutorService.java:72)
	at jenkins.util.ContextResettingExecutorService$2.call(ContextResettingExecutorService.java:46)
	... 4 more
Skipping sonar analysis due to bad build status FAILURE

Mime
View raw message