directory-notifications mailing list archives

Site index · List index
Message view « Date » · « Thread »
Top « Date » · « Thread »
From Apache Jenkins Server <jenk...@builds.apache.org>
Subject Build failed in Jenkins: dir-fortress-core-docker-test #280
Date Thu, 17 Nov 2016 05:30:54 GMT
See <https://builds.apache.org/job/dir-fortress-core-docker-test/280/>

------------------------------------------
[...truncated 32701 lines...]
 [startAnt] [FortressAdmin] 2016-11-17 05:30:17,061 (INFO ) addConfig
 [startAnt] [FortressAdmin] 2016-11-17 05:30:17,061 (INFO ) addConfig
 [startAnt] [FortressAdmin] 2016-11-17 05:30:17,061 (INFO ) addConfig
 [startAnt] [FortressAdmin] 2016-11-17 05:30:17,061 (INFO ) addConfig
 [startAnt] [FortressAdmin] 2016-11-17 05:30:17,061 (INFO ) addConfig
 [startAnt] [FortressAdmin] 2016-11-17 05:30:17,061 (INFO ) addConfig
 [startAnt] [FortressAdmin] 2016-11-17 05:30:17,061 (INFO ) addConfig
 [startAnt] [FortressAdmin] 2016-11-17 05:30:17,061 (INFO ) addConfig
 [startAnt] [FortressAdmin] 2016-11-17 05:30:17,062 (INFO ) addConfig
 [startAnt] [FortressAdmin] 2016-11-17 05:30:17,062 (INFO ) addConfig
 [startAnt] [FortressAdmin] 2016-11-17 05:30:17,062 (INFO ) addConfig
 [startAnt] [FortressAdmin] 2016-11-17 05:30:17,062 (INFO ) addConfig
 [startAnt] [FortressAdmin] 2016-11-17 05:30:17,062 (INFO ) addConfig
 [startAnt] [FortressAdmin] 2016-11-17 05:30:17,062 (INFO ) addConfig
 [startAnt] [FortressAdmin] 2016-11-17 05:30:17,062 (INFO ) addConfig
 [startAnt] [FortressAdmin] 2016-11-17 05:30:17,062 (INFO ) addConfig
 [startAnt] [FortressAdmin] 2016-11-17 05:30:17,062 (INFO ) addConfig
 [startAnt] [FortressAdmin] 2016-11-17 05:30:17,062 (INFO ) addConfig
 [startAnt] [FortressAdmin] 2016-11-17 05:30:17,063 (INFO ) addConfig
 [startAnt] [FortressAdmin] 2016-11-17 05:30:17,063 (INFO ) addConfig
 [startAnt] [FortressAdmin] 2016-11-17 05:30:17,063 (INFO ) addConfig
 [startAnt] [FortressAdmin] 2016-11-17 05:30:17,063 (INFO ) addConfig
 [startAnt] [FortressAdmin] 2016-11-17 05:30:17,063 (INFO ) addConfig
 [startAnt] [FortressAdmin] 2016-11-17 05:30:17,063 (INFO ) addConfig
 [startAnt] [FortressAdmin] 2016-11-17 05:30:17,063 (INFO ) addConfig
 [startAnt] [FortressAdmin] 2016-11-17 05:30:17,063 (INFO ) addConfig
 [startAnt] [FortressAdmin] 2016-11-17 05:30:17,063 (INFO ) addConfig realm name [TOMCAT]
 [startAnt] [FortressAdmin] 2016-11-17 05:30:17,064 (INFO ) create dn [cn=TOMCAT,ou=Config,dc=openldap,dc=org]
[INFO] Executed tasks
[INFO] 
[INFO] --- maven-antrun-plugin:1.8:run (initialize-fortress-config) @ fortress-core ---
[WARNING] Parameter tasks is deprecated, use target instead
[INFO] Executing tasks

main:

init:

init-fortress-config:
     [echo] Determine configuration requirements

init:

init-fortress-config-local:
     [echo] ###############  Modify fortress configuration per user settings  ###############
   [delete] Deleting: <https://builds.apache.org/job/dir-fortress-core-docker-test/ws/config/bootstrap/fortress.properties>
   [delete] Deleting: <https://builds.apache.org/job/dir-fortress-core-docker-test/ws/config/fortress.properties>
     [copy] Copying 1 file to <https://builds.apache.org/job/dir-fortress-core-docker-test/ws/config/bootstrap>
     [copy] Copying 1 file to <https://builds.apache.org/job/dir-fortress-core-docker-test/ws/config>
     [echo] ###############  Modify fortress load scripts per user settings  ###############
   [delete] Deleting: <https://builds.apache.org/job/dir-fortress-core-docker-test/ws/ldap/setup/refreshLDAPData.xml>
     [copy] Copying 1 file to <https://builds.apache.org/job/dir-fortress-core-docker-test/ws/ldap/setup>
     [echo] ###############  Copy ehcache config to bootstrap config folder  ###############
   [delete] Deleting: <https://builds.apache.org/job/dir-fortress-core-docker-test/ws/config/bootstrap/ehcache.xml>
     [copy] Copying 1 file to <https://builds.apache.org/job/dir-fortress-core-docker-test/ws/config/bootstrap>
     [echo] Target init-fortress-config-local complete.

init:

init-fortress-config-remote:
[INFO] Executed tasks
[INFO] 
[INFO] --- maven-jar-plugin:2.6:jar (default-jar) @ fortress-core ---
[INFO] Building jar: <https://builds.apache.org/job/dir-fortress-core-docker-test/ws/target/fortress-core-2.0.0-RC2-SNAPSHOT.jar>
[INFO] 
[INFO] --- maven-site-plugin:3.4:attach-descriptor (attach-descriptor) @ fortress-core ---
[INFO] 
[INFO] --- maven-jar-plugin:2.6:test-jar (default) @ fortress-core ---
[INFO] Building jar: <https://builds.apache.org/job/dir-fortress-core-docker-test/ws/target/fortress-core-2.0.0-RC2-SNAPSHOT-tests.jar>
[INFO] 
[INFO] --- tools-maven-plugin:1.4:verify-legal-files (verify-legal-files) @ fortress-core
---
[INFO] Checking legal files in: fortress-core-2.0.0-RC2-SNAPSHOT.jar
[INFO] Checking legal files in: fortress-core-2.0.0-RC2-SNAPSHOT-tests.jar
[INFO] 
[INFO] --- maven-source-plugin:2.4:jar-no-fork (attach-sources) @ fortress-core ---
[INFO] Building jar: <https://builds.apache.org/job/dir-fortress-core-docker-test/ws/target/fortress-core-2.0.0-RC2-SNAPSHOT-sources.jar>
[INFO] 
[INFO] --- maven-install-plugin:2.5.2:install (default-install) @ fortress-core ---
[INFO] Installing <https://builds.apache.org/job/dir-fortress-core-docker-test/ws/target/fortress-core-2.0.0-RC2-SNAPSHOT.jar>
to <https://builds.apache.org/job/dir-fortress-core-docker-test/ws/.repository/org/apache/directory/fortress/fortress-core/2.0.0-RC2-SNAPSHOT/fortress-core-2.0.0-RC2-SNAPSHOT.jar>
[INFO] Installing <https://builds.apache.org/job/dir-fortress-core-docker-test/ws/pom.xml>
to <https://builds.apache.org/job/dir-fortress-core-docker-test/ws/.repository/org/apache/directory/fortress/fortress-core/2.0.0-RC2-SNAPSHOT/fortress-core-2.0.0-RC2-SNAPSHOT.pom>
[INFO] Installing <https://builds.apache.org/job/dir-fortress-core-docker-test/ws/target/fortress-core-2.0.0-RC2-SNAPSHOT-tests.jar>
to <https://builds.apache.org/job/dir-fortress-core-docker-test/ws/.repository/org/apache/directory/fortress/fortress-core/2.0.0-RC2-SNAPSHOT/fortress-core-2.0.0-RC2-SNAPSHOT-tests.jar>
[INFO] Installing <https://builds.apache.org/job/dir-fortress-core-docker-test/ws/target/fortress-core-2.0.0-RC2-SNAPSHOT-sources.jar>
to <https://builds.apache.org/job/dir-fortress-core-docker-test/ws/.repository/org/apache/directory/fortress/fortress-core/2.0.0-RC2-SNAPSHOT/fortress-core-2.0.0-RC2-SNAPSHOT-sources.jar>
[INFO] ------------------------------------------------------------------------
[INFO] BUILD SUCCESS
[INFO] ------------------------------------------------------------------------
[INFO] Total time: 12.513 s
[INFO] Finished at: 2016-11-17T05:30:19+00:00
[INFO] Final Memory: 29M/482M
[INFO] ------------------------------------------------------------------------
[dir-fortress-core-docker-test] $ /home/jenkins/tools/maven/latest3/bin/mvn -Dmaven.repo.local=<https://builds.apache.org/job/dir-fortress-core-docker-test/ws/.repository>
install -Dload.file=./ldap/setup/DelegatedAdminManagerLoad.xml
[INFO] Scanning for projects...
[INFO]                                                                         
[INFO] ------------------------------------------------------------------------
[INFO] Building Apache Fortress Core 2.0.0-RC2-SNAPSHOT
[INFO] ------------------------------------------------------------------------
[INFO] 
[INFO] --- maven-resources-plugin:2.7:copy-resources (copy-resources) @ fortress-core ---
[INFO] Using 'UTF-8' encoding to copy filtered resources.
[INFO] Copying 8 resources
[INFO] 
[INFO] --- maven-remote-resources-plugin:1.5:process (default) @ fortress-core ---
[INFO] 
[INFO] --- maven-resources-plugin:2.7:resources (default-resources) @ fortress-core ---
[INFO] Using 'UTF-8' encoding to copy filtered resources.
[INFO] Copying 8 resources
[INFO] Copying 3 resources
[INFO] 
[INFO] --- maven-compiler-plugin:3.3:compile (default-compile) @ fortress-core ---
[INFO] Nothing to compile - all classes are up to date
[INFO] 
[INFO] --- maven-resources-plugin:2.7:testResources (default-testResources) @ fortress-core
---
[INFO] Using 'UTF-8' encoding to copy filtered resources.
[INFO] Copying 8 resources
[INFO] Copying 3 resources
[INFO] 
[INFO] --- maven-compiler-plugin:3.3:testCompile (default-testCompile) @ fortress-core ---
[INFO] Nothing to compile - all classes are up to date
[INFO] 
[INFO] --- maven-surefire-plugin:2.18.1:test (default-test) @ fortress-core ---
[INFO] 
[INFO] --- maven-antrun-plugin:1.8:run (default) @ fortress-core ---
[INFO] Executing tasks

fortress-load:
     [echo] ############### Run Fortress Ant script to load policy ###############
 [startAnt] Buildfile: <https://builds.apache.org/job/dir-fortress-core-docker-test/ws/ldap/setup/DelegatedAdminManagerLoad.xml>
 [startAnt] 
 [startAnt] all:
 [startAnt] [FortressAdmin] 2016-11-17 05:30:29,841 (INFO ) static init: found from: fortress.properties
path: <https://builds.apache.org/job/dir-fortress-core-docker-test/ws/config/bootstrap/fortress.properties>
 [startAnt] [FortressAdmin] 2016-11-17 05:30:29,868 (INFO ) static init: loading from: fortress.properties
 [startAnt] [FortressAdmin] 2016-11-17 05:30:29,879 (INFO ) static init: load config realm
[DEFAULT]
 [startAnt] [FortressAdmin] 2016-11-17 05:30:29,898 (INFO ) getConfig dn [cn=DEFAULT,ou=Config,dc=openldap,dc=org]
 [startAnt] [FortressAdmin] 2016-11-17 05:30:29,901 (INFO ) LDAP POOL:  host=[localhost],
port=[32774], min=[1], max=[10]
 [startAnt] [FortressAdmin] 2016-11-17 05:30:30,058 (INFO ) Registered pre-bundled control
factory: 1.3.6.1.4.1.18060.0.0.1
 [startAnt] [FortressAdmin] 2016-11-17 05:30:30,059 (INFO ) Registered pre-bundled control
factory: 2.16.840.1.113730.3.4.7
 [startAnt] [FortressAdmin] 2016-11-17 05:30:30,060 (INFO ) Registered pre-bundled control
factory: 2.16.840.1.113730.3.4.2
 [startAnt] [FortressAdmin] 2016-11-17 05:30:30,060 (INFO ) Registered pre-bundled control
factory: 2.16.840.1.113730.3.4.18
 [startAnt] [FortressAdmin] 2016-11-17 05:30:30,061 (INFO ) Registered pre-bundled control
factory: 1.2.840.113556.1.4.319
 [startAnt] [FortressAdmin] 2016-11-17 05:30:30,061 (INFO ) Registered pre-bundled control
factory: 2.16.840.1.113730.3.4.3
 [startAnt] [FortressAdmin] 2016-11-17 05:30:30,062 (INFO ) Registered pre-bundled control
factory: 1.3.6.1.4.1.4203.1.10.1
 [startAnt] [FortressAdmin] 2016-11-17 05:30:30,063 (INFO ) Registered pre-bundled control
factory: 1.3.6.1.4.1.18060.0.0.1
 [startAnt] [FortressAdmin] 2016-11-17 05:30:30,063 (INFO ) Registered pre-bundled control
factory: 2.16.840.1.113730.3.4.7
 [startAnt] [FortressAdmin] 2016-11-17 05:30:30,063 (INFO ) Registered pre-bundled control
factory: 2.16.840.1.113730.3.4.2
 [startAnt] [FortressAdmin] 2016-11-17 05:30:30,063 (INFO ) Registered pre-bundled control
factory: 2.16.840.1.113730.3.4.18
 [startAnt] [FortressAdmin] 2016-11-17 05:30:30,063 (INFO ) Registered pre-bundled control
factory: 1.2.840.113556.1.4.319
 [startAnt] [FortressAdmin] 2016-11-17 05:30:30,063 (INFO ) Registered pre-bundled control
factory: 2.16.840.1.113730.3.4.3
 [startAnt] [FortressAdmin] 2016-11-17 05:30:30,063 (INFO ) Registered pre-bundled control
factory: 1.3.6.1.4.1.4203.1.10.1
 [startAnt] [FortressAdmin] 2016-11-17 05:30:30,064 (INFO ) Registered pre-bundled control
factory: 1.3.6.1.4.1.42.2.27.8.5.1
 [startAnt] [FortressAdmin] 2016-11-17 05:30:30,064 (INFO ) Registered pre-bundled control
factory: 2.16.840.1.113730.3.4.9
 [startAnt] [FortressAdmin] 2016-11-17 05:30:30,065 (INFO ) Registered pre-bundled control
factory: 2.16.840.1.113730.3.4.10
 [startAnt] [FortressAdmin] 2016-11-17 05:30:30,065 (INFO ) Registered pre-bundled control
factory: 1.3.6.1.4.1.4203.1.9.1.3
 [startAnt] [FortressAdmin] 2016-11-17 05:30:30,066 (INFO ) Registered pre-bundled control
factory: 1.3.6.1.4.1.4203.1.9.1.4
 [startAnt] [FortressAdmin] 2016-11-17 05:30:30,067 (INFO ) Registered pre-bundled control
factory: 1.3.6.1.4.1.4203.1.9.1.1
 [startAnt] [FortressAdmin] 2016-11-17 05:30:30,067 (INFO ) Registered pre-bundled control
factory: 1.3.6.1.4.1.4203.1.9.1.2
 [startAnt] [FortressAdmin] 2016-11-17 05:30:30,068 (INFO ) Registered pre-bundled control
factory: 1.2.840.113556.1.4.473
 [startAnt] [FortressAdmin] 2016-11-17 05:30:30,068 (INFO ) Registered pre-bundled control
factory: 1.2.840.113556.1.4.474
 [startAnt] [FortressAdmin] 2016-11-17 05:30:30,069 (INFO ) Registered pre-bundled control
factory: 1.2.840.113556.1.4.841
 [startAnt] [FortressAdmin] 2016-11-17 05:30:30,069 (INFO ) Registered pre-bundled control
factory: 1.2.840.113556.1.4.417
 [startAnt] [FortressAdmin] 2016-11-17 05:30:30,070 (INFO ) Registered pre-bundled control
factory: 1.2.840.113556.1.4.1413
 [startAnt] [FortressAdmin] 2016-11-17 05:30:30,071 (INFO ) Registered pre-bundled control
factory: 1.2.840.113556.1.4.528
 [startAnt] [FortressAdmin] 2016-11-17 05:30:30,073 (INFO ) Registered pre-bundled extended
operation factory: 1.3.6.1.1.8
 [startAnt] [FortressAdmin] 2016-11-17 05:30:30,074 (INFO ) Registered pre-bundled extended
operation factory: 1.3.6.1.4.1.18060.0.1.8
 [startAnt] [FortressAdmin] 2016-11-17 05:30:30,075 (INFO ) Registered pre-bundled extended
operation factory: 1.3.6.1.4.1.18060.0.1.3
 [startAnt] [FortressAdmin] 2016-11-17 05:30:30,077 (INFO ) Registered pre-bundled extended
operation factory: 1.3.6.1.4.1.18060.0.1.6
 [startAnt] [FortressAdmin] 2016-11-17 05:30:30,077 (INFO ) Registered pre-bundled extended
operation factory: 1.3.6.1.4.1.18060.0.1.5
 [startAnt] [FortressAdmin] 2016-11-17 05:30:30,079 (INFO ) Registered pre-bundled extended
operation factory: 1.3.6.1.4.1.4203.1.11.1
 [startAnt] [FortressAdmin] 2016-11-17 05:30:30,081 (INFO ) Registered pre-bundled extended
operation factory: 1.3.6.1.4.1.4203.1.11.3
 [startAnt] [FortressAdmin] 2016-11-17 05:30:30,082 (INFO ) Registered pre-bundled extended
operation factory: 1.3.6.1.4.1.1466.20037
 [startAnt] [FortressAdmin] 2016-11-17 05:30:30,084 (INFO ) Registered pre-bundled extended
operation factory: 1.3.6.1.4.1.4203.555.1
 [startAnt] [FortressAdmin] 2016-11-17 05:30:30,086 (INFO ) Registered pre-bundled extended
operation factory: 1.3.6.1.4.1.4203.555.2
 [startAnt] [FortressAdmin] 2016-11-17 05:30:30,087 (INFO ) Registered pre-bundled extended
operation factory: 1.3.6.1.4.1.4203.555.3
 [startAnt] [FortressAdmin] 2016-11-17 05:30:30,088 (INFO ) Registered pre-bundled extended
operation factory: 1.3.6.1.4.1.4203.555.4
 [startAnt] [FortressAdmin] 2016-11-17 05:30:30,090 (INFO ) Registered pre-bundled extended
operation factory: 1.3.6.1.4.1.4203.555.5
 [startAnt] [FortressAdmin] 2016-11-17 05:30:30,091 (INFO ) Registered pre-bundled extended
operation factory: 1.3.6.1.4.1.4203.555.6
 [startAnt] [FortressAdmin] 2016-11-17 05:30:30,836 (INFO ) FORTRESS ANT TASK NAME : FortressAdmin
 [startAnt] [FortressAdmin] 2016-11-17 05:30:30,836 (INFO ) addOrgunits tenant=HOME name=default
typeName=PERM description=Default Fortress Permission OU
 [startAnt] [FortressAdmin] 2016-11-17 05:30:30,870 (INFO ) addOrgunits tenant=HOME name=app0
typeName=PERM description=Default Fortress Permission OU
 [startAnt] [FortressAdmin] 2016-11-17 05:30:30,874 (INFO ) addOrgunits tenant=HOME name=dev0
typeName=USER description=Default Fortress User OU
 [startAnt] [FortressAdmin] 2016-11-17 05:30:30,884 (INFO ) addAdminRoles tenant=HOME name=fortress-core-super-admin
description=Fortress Super User
 [startAnt] 
 [startAnt] BUILD FAILED
 [startAnt] <https://builds.apache.org/job/dir-fortress-core-docker-test/ws/ldap/setup/DelegatedAdminManagerLoad.xml>:26:
java.lang.UnsupportedClassVersionError: org/jgrapht/graph/SimpleDirectedGraph : Unsupported
major.minor version 52.0
 [startAnt] 	at java.lang.ClassLoader.defineClass1(Native Method)
 [startAnt] 	at java.lang.ClassLoader.defineClass(ClassLoader.java:800)
 [startAnt] 	at java.security.SecureClassLoader.defineClass(SecureClassLoader.java:142)
 [startAnt] 	at java.net.URLClassLoader.defineClass(URLClassLoader.java:449)
 [startAnt] 	at java.net.URLClassLoader.access$100(URLClassLoader.java:71)
 [startAnt] 	at java.net.URLClassLoader$1.run(URLClassLoader.java:361)
 [startAnt] 	at java.net.URLClassLoader$1.run(URLClassLoader.java:355)
 [startAnt] 	at java.security.AccessController.doPrivileged(Native Method)
 [startAnt] 	at java.net.URLClassLoader.findClass(URLClassLoader.java:354)
 [startAnt] 	at java.lang.ClassLoader.loadClass(ClassLoader.java:425)
 [startAnt] 	at sun.misc.Launcher$AppClassLoader.loadClass(Launcher.java:308)
 [startAnt] 	at java.lang.ClassLoader.loadClass(ClassLoader.java:358)
 [startAnt] 	at org.apache.directory.fortress.core.impl.HierUtil.toGraph(HierUtil.java:156)
 [startAnt] 	at org.apache.directory.fortress.core.impl.HierUtil.buildGraph(HierUtil.java:669)
 [startAnt] 	at org.apache.directory.fortress.core.impl.UsoUtil.loadGraph(UsoUtil.java:267)
 [startAnt] 	at org.apache.directory.fortress.core.impl.UsoUtil.getGraph(UsoUtil.java:288)
 [startAnt] 	at org.apache.directory.fortress.core.impl.UsoUtil.getChildren(UsoUtil.java:141)
 [startAnt] 	at org.apache.directory.fortress.core.impl.OrgUnitDAO.getEntityFromLdapEntry(OrgUnitDAO.java:732)
 [startAnt] 	at org.apache.directory.fortress.core.impl.OrgUnitDAO.findByKey(OrgUnitDAO.java:361)
 [startAnt] 	at org.apache.directory.fortress.core.impl.OrgUnitP.read(OrgUnitP.java:242)
 [startAnt] 	at org.apache.directory.fortress.core.impl.AdminRoleP.validateOrgs(AdminRoleP.java:414)
 [startAnt] 	at org.apache.directory.fortress.core.impl.AdminRoleP.validate(AdminRoleP.java:391)
 [startAnt] 	at org.apache.directory.fortress.core.impl.AdminRoleP.add(AdminRoleP.java:135)
 [startAnt] 	at org.apache.directory.fortress.core.impl.DelAdminMgrImpl.addRole(DelAdminMgrImpl.java:88)
 [startAnt] 	at org.apache.directory.fortress.core.ant.FortressAntTask.addAdminRoles(FortressAntTask.java:2235)
 [startAnt] 	at org.apache.directory.fortress.core.ant.FortressAntTask.execute(FortressAntTask.java:916)
 [startAnt] 	at org.apache.tools.ant.UnknownElement.execute(UnknownElement.java:293)
 [startAnt] 	at sun.reflect.NativeMethodAccessorImpl.invoke0(Native Method)
 [startAnt] 	at sun.reflect.NativeMethodAccessorImpl.invoke(NativeMethodAccessorImpl.java:57)
 [startAnt] 	at sun.reflect.DelegatingMethodAccessorImpl.invoke(DelegatingMethodAccessorImpl.java:43)
 [startAnt] 	at java.lang.reflect.Method.invoke(Method.java:606)
 [startAnt] 	at org.apache.tools.ant.dispatch.DispatchUtils.execute(DispatchUtils.java:106)
 [startAnt] 	at org.apache.tools.ant.Task.perform(Task.java:348)
 [startAnt] 	at org.apache.tools.ant.Target.execute(Target.java:435)
 [startAnt] 	at org.apache.tools.ant.Target.performTasks(Target.java:456)
 [startAnt] 	at org.apache.tools.ant.Project.executeSortedTargets(Project.java:1405)
 [startAnt] 	at org.apache.tools.ant.Project.executeTarget(Project.java:1376)
 [startAnt] 	at org.apache.tools.ant.helper.DefaultExecutor.executeTargets(DefaultExecutor.java:41)
 [startAnt] 	at org.apache.tools.ant.Project.executeTargets(Project.java:1260)
 [startAnt] 	at org.apache.tools.ant.Main.runBuild(Main.java:854)
 [startAnt] 	at org.apache.tools.ant.Main.startAnt(Main.java:236)
 [startAnt] 	at org.apache.tools.ant.launch.Launcher.run(Launcher.java:285)
 [startAnt] 	at org.apache.tools.ant.launch.Launcher.main(Launcher.java:112)
 [startAnt] 
 [startAnt] Total time: 1 second
 [startAnt] [FortressAdmin] 2016-11-17 05:30:30,907 (INFO ) loadGraph initializing USO context
[HOME]
[INFO] ------------------------------------------------------------------------
[INFO] BUILD FAILURE
[INFO] ------------------------------------------------------------------------
[INFO] Total time: 9.611 s
[INFO] Finished at: 2016-11-17T05:30:31+00:00
[INFO] Final Memory: 24M/482M
[INFO] ------------------------------------------------------------------------
[ERROR] Failed to execute goal org.apache.maven.plugins:maven-antrun-plugin:1.8:run (default)
on project fortress-core: An Ant BuildException has occured: Java returned: 1
[ERROR] around Ant part ...<java fork="true" dir="<https://builds.apache.org/job/dir-fortress-core-docker-test/ws/">
classname="org.apache.tools.ant.launch.Launcher" failonerror="true" taskname="startAnt" timeout="4000000">...
@ 5:201 in <https://builds.apache.org/job/dir-fortress-core-docker-test/ws/target/antrun/build-fortress-load.xml>
[ERROR] -> [Help 1]
[ERROR] 
[ERROR] To see the full stack trace of the errors, re-run Maven with the -e switch.
[ERROR] Re-run Maven using the -X switch to enable full debug logging.
[ERROR] 
[ERROR] For more information about the errors and possible solutions, please read the following
articles:
[ERROR] [Help 1] http://cwiki.apache.org/confluence/display/MAVEN/MojoExecutionException
Build step 'Invoke top-level Maven targets' marked build as failure
[dir-fortress-core-docker-test] $ /bin/bash /tmp/hudson4732533963204109895.sh
dir-fortress-core-test-ubuntu-openldap
dir-fortress-core-test-ubuntu-openldap
CONTAINER ID        IMAGE               COMMAND             CREATED             STATUS   
          PORTS               NAMES

Mime
View raw message