directory-notifications mailing list archives

Site index · List index
Message view « Date » · « Thread »
Top « Date » · « Thread »
From Apache Jenkins Server <jenk...@builds.apache.org>
Subject Build failed in Jenkins: dir-shared-ubuntu-deploy #1950
Date Mon, 07 Nov 2016 01:23:51 GMT
See <https://builds.apache.org/job/dir-shared-ubuntu-deploy/1950/changes>

Changes:

[elecharny] Added the .gitgnore file

------------------------------------------
[...truncated 4087 lines...]
A         ldap/schema/data/src/test/java/org/apache/directory/api
A         ldap/schema/data/src/test/java/org/apache/directory/api/ldap
A         ldap/schema/data/src/test/java/org/apache/directory/api/ldap/schema
A         ldap/schema/data/src/test/java/org/apache/directory/api/ldap/schema/extractor
A         ldap/schema/data/src/test/java/org/apache/directory/api/ldap/schema/extractor/SchemaLdifExtractorTest.java
A         ldap/schema/data/src/test/java/org/apache/directory/api/ldap/schema/loader
A         ldap/schema/data/src/test/java/org/apache/directory/api/ldap/schema/loader/SchemaManagerLoadTest.java
A         ldap/schema/data/src/test/java/org/apache/directory/api/ldap/schema/loader/SchemaManagerDelTest.java
A         ldap/schema/data/src/test/java/org/apache/directory/api/ldap/schema/loader/MatchingRuleTest.java
A         ldap/schema/data/src/test/java/org/apache/directory/api/ldap/schema/loader/JarLdifSchemaLoaderTest.java
A         ldap/schema/data/src/test/java/org/apache/directory/api/ldap/schema/loader/SchemaManagerLoadWithDepsTest.java
A         ldap/schema/data/src/test/java/org/apache/directory/api/ldap/schema/loader/SchemaManagerAddTest.java
A         ldap/schema/data/src/test/java/org/apache/directory/api/ldap/schema/loader/LdifSchemaLoaderTest.java
A         ldap/schema/data/src/test/java/org/apache/directory/api/ldap/schema/loader/SchemaManagerEnableDisableLoadTest.java
A         ldap/schema/data/pom.xml
A         ldap/schema/pom.xml
A         NOTICE
A         LICENSE
A         asn1
A         asn1/src
A         asn1/src/site
AU        asn1/src/site/site.xml
A         asn1/ber
A         asn1/ber/src
A         asn1/ber/src/main
A         asn1/ber/src/main/resources
A         asn1/ber/src/main/java
A         asn1/ber/src/main/java/org
A         asn1/ber/src/main/java/org/apache
A         asn1/ber/src/main/java/org/apache/directory
A         asn1/ber/src/main/java/org/apache/directory/api
A         asn1/ber/src/main/java/org/apache/directory/api/asn1
A         asn1/ber/src/main/java/org/apache/directory/api/asn1/actions
A         asn1/ber/src/main/java/org/apache/directory/api/asn1/actions/AbstractReadBitString.java
A         asn1/ber/src/main/java/org/apache/directory/api/asn1/actions/AbstractReadOctetString.java
A         asn1/ber/src/main/java/org/apache/directory/api/asn1/actions/CheckNotNullLength.java
A         asn1/ber/src/main/java/org/apache/directory/api/asn1/actions/AbstractReadInteger.java
A         asn1/ber/src/main/java/org/apache/directory/api/asn1/ber
AU        asn1/ber/src/main/java/org/apache/directory/api/asn1/ber/Asn1Container.java
A         asn1/ber/src/main/java/org/apache/directory/api/asn1/ber/tlv
AU        asn1/ber/src/main/java/org/apache/directory/api/asn1/ber/tlv/IntegerDecoderException.java
AU        asn1/ber/src/main/java/org/apache/directory/api/asn1/ber/tlv/IntegerDecoder.java
AU        asn1/ber/src/main/java/org/apache/directory/api/asn1/ber/tlv/BooleanDecoderException.java
A         asn1/ber/src/main/java/org/apache/directory/api/asn1/ber/tlv/LongDecoderException.java
AU        asn1/ber/src/main/java/org/apache/directory/api/asn1/ber/tlv/UniversalTag.java
AU        asn1/ber/src/main/java/org/apache/directory/api/asn1/ber/tlv/BerValue.java
AU        asn1/ber/src/main/java/org/apache/directory/api/asn1/ber/tlv/BooleanDecoder.java
A         asn1/ber/src/main/java/org/apache/directory/api/asn1/ber/tlv/LongDecoder.java
AU        asn1/ber/src/main/java/org/apache/directory/api/asn1/ber/tlv/TLV.java
AU        asn1/ber/src/main/java/org/apache/directory/api/asn1/ber/tlv/TLVBerDecoderMBean.java
AU        asn1/ber/src/main/java/org/apache/directory/api/asn1/ber/tlv/TLVStateEnum.java
AU        asn1/ber/src/main/java/org/apache/directory/api/asn1/ber/AbstractContainer.java
A         asn1/ber/src/main/java/org/apache/directory/api/asn1/ber/grammar
AU        asn1/ber/src/main/java/org/apache/directory/api/asn1/ber/grammar/GrammarTransition.java
AU        asn1/ber/src/main/java/org/apache/directory/api/asn1/ber/grammar/States.java
AU        asn1/ber/src/main/java/org/apache/directory/api/asn1/ber/grammar/GrammarAction.java
AU        asn1/ber/src/main/java/org/apache/directory/api/asn1/ber/grammar/Grammar.java
AU        asn1/ber/src/main/java/org/apache/directory/api/asn1/ber/grammar/AbstractGrammar.java
AU        asn1/ber/src/main/java/org/apache/directory/api/asn1/ber/grammar/Action.java
AU        asn1/ber/src/main/java/org/apache/directory/api/asn1/ber/Asn1Decoder.java
A         asn1/ber/src/site
AU        asn1/ber/src/site/site.xml
A         asn1/ber/src/test
A         asn1/ber/src/test/resources
A         asn1/ber/src/test/java
A         asn1/ber/src/test/java/org
A         asn1/ber/src/test/java/org/apache
A         asn1/ber/src/test/java/org/apache/directory
A         asn1/ber/src/test/java/org/apache/directory/api
A         asn1/ber/src/test/java/org/apache/directory/api/asn1
A         asn1/ber/src/test/java/org/apache/directory/api/asn1/ber
A         asn1/ber/src/test/java/org/apache/directory/api/asn1/ber/tlv
A         asn1/ber/src/test/java/org/apache/directory/api/asn1/ber/tlv/PrimitivesTest.java
AU        asn1/ber/src/test/java/org/apache/directory/api/asn1/ber/tlv/ValueTest.java
AU        asn1/ber/src/test/java/org/apache/directory/api/asn1/ber/tlv/LengthTest.java
A         asn1/ber/pom.xml
A         asn1/api
A         asn1/api/pom.xml
A         asn1/api/src
A         asn1/api/src/main
A         asn1/api/src/main/java
A         asn1/api/src/main/java/org
A         asn1/api/src/main/java/org/apache
A         asn1/api/src/main/java/org/apache/directory
A         asn1/api/src/main/java/org/apache/directory/api
A         asn1/api/src/main/java/org/apache/directory/api/asn1
A         asn1/api/src/main/java/org/apache/directory/api/asn1/util
AU        asn1/api/src/main/java/org/apache/directory/api/asn1/util/Asn1StringUtils.java
AU        asn1/api/src/main/java/org/apache/directory/api/asn1/util/Oid.java
AU        asn1/api/src/main/java/org/apache/directory/api/asn1/util/BitString.java
AU        asn1/api/src/main/java/org/apache/directory/api/asn1/EncoderException.java
AU        asn1/api/src/main/java/org/apache/directory/api/asn1/package.html
AU        asn1/api/src/main/java/org/apache/directory/api/asn1/Encoder.java
AU        asn1/api/src/main/java/org/apache/directory/api/asn1/DecoderException.java
AU        asn1/api/src/main/java/org/apache/directory/api/asn1/Decoder.java
AU        asn1/api/src/main/java/org/apache/directory/api/asn1/Asn1Object.java
A         asn1/api/src/main/resources
A         asn1/api/src/site
AU        asn1/api/src/site/site.xml
A         asn1/api/src/test
A         asn1/api/src/test/java
A         asn1/api/src/test/java/org
A         asn1/api/src/test/java/org/apache
A         asn1/api/src/test/java/org/apache/directory
A         asn1/api/src/test/java/org/apache/directory/api
A         asn1/api/src/test/java/org/apache/directory/api/asn1
A         asn1/api/src/test/java/org/apache/directory/api/asn1/util
A         asn1/api/src/test/java/org/apache/directory/api/asn1/util/BitStringTest.java
A         asn1/api/src/test/java/org/apache/directory/api/asn1/util/OidTest.java
A         asn1/api/src/test/resources
AU        asn1/api/src/test/resources/log4j.properties
A         asn1/pom.xml
A         .gitignore
A         integ-osgi
A         integ-osgi/src
A         integ-osgi/src/test
A         integ-osgi/src/test/java
A         integ-osgi/src/test/java/org
A         integ-osgi/src/test/java/org/apache
A         integ-osgi/src/test/java/org/apache/directory
A         integ-osgi/src/test/java/org/apache/directory/api
A         integ-osgi/src/test/java/org/apache/directory/api/osgi
A         integ-osgi/src/test/java/org/apache/directory/api/osgi/ApiLdapClientApiOsgiTest.java
A         integ-osgi/src/test/java/org/apache/directory/api/osgi/ApiOsgiTestBase.java
A         integ-osgi/src/test/java/org/apache/directory/api/osgi/ApiLdapExtrasSpOsgiTest.java
A         integ-osgi/src/test/java/org/apache/directory/api/osgi/ApiDsmlParserOsgiTest.java
A         integ-osgi/src/test/java/org/apache/directory/api/osgi/ApiUtilOsgiTest.java
A         integ-osgi/src/test/java/org/apache/directory/api/osgi/ApiI18nOsgiTest.java
A         integ-osgi/src/test/java/org/apache/directory/api/osgi/ApiLdapExtrasAciOsgiTest.java
A         integ-osgi/src/test/java/org/apache/directory/api/osgi/ApiDsmlEngineOsgiTest.java
A         integ-osgi/src/test/java/org/apache/directory/api/osgi/ApiLdapCodecCoreOsgiTest.java
A         integ-osgi/src/test/java/org/apache/directory/api/osgi/ApiLdapSchemaConverterOsgiTest.java
A         integ-osgi/src/test/java/org/apache/directory/api/osgi/ApiAsn1BerOsgiTest.java
A         integ-osgi/src/test/java/org/apache/directory/api/osgi/ApiLdapExtrasTriggerOsgiTest.java
A         integ-osgi/src/test/java/org/apache/directory/api/osgi/ApiLdapSchemaDataOsgiTest.java
A         integ-osgi/src/test/java/org/apache/directory/api/osgi/ApiLdapNetMinaOsgiTest.java
A         integ-osgi/src/test/java/org/apache/directory/api/osgi/ApiAsn1ApiOsgiTest.java
A         integ-osgi/src/test/java/org/apache/directory/api/osgi/ApiLdapExtrasCodecApiOsgiTest.java
A         integ-osgi/src/test/java/org/apache/directory/api/osgi/ApiLdapModelOsgiTest.java
A         integ-osgi/src/test/java/org/apache/directory/api/osgi/ApiLdapExtrasCodecOsgiTest.java
A         integ-osgi/src/test/java/org/apache/directory/api/osgi/ApiLdapExtrasUtilOsgiTest.java
A         integ-osgi/src/test/resources
A         integ-osgi/src/test/resources/logback.xml
A         integ-osgi/src/test/resources/exam.properties
A         integ-osgi/src/main
A         integ-osgi/src/main/resources
A         integ-osgi/src/main/java
A         integ-osgi/pom.xml
A         integ
A         integ/src
A         integ/src/checkstyle
AU        integ/src/checkstyle/suppressions.xml
A         integ/src/test
A         integ/src/test/java
A         integ/src/test/java/org
A         integ/src/test/java/org/apache
A         integ/src/test/java/org/apache/directory
A         integ/src/test/java/org/apache/directory/api
A         integ/src/test/java/org/apache/directory/api/ldap
A         integ/src/test/java/org/apache/directory/api/ldap/aci
AU        integ/src/test/java/org/apache/directory/api/ldap/aci/ACIItemParserTest.java
AU        integ/src/test/java/org/apache/directory/api/ldap/aci/ACIItemCheckerTest.java
A         integ/src/test/java/org/apache/directory/api/ldap/codec
A         integ/src/test/java/org/apache/directory/api/ldap/codec/api
AU        integ/src/test/java/org/apache/directory/api/ldap/codec/api/StandaloneLdapCodecServiceTest.java
A         integ/src/test/java/org/apache/directory/api/ldap/model
A         integ/src/test/java/org/apache/directory/api/ldap/model/name
AU        integ/src/test/java/org/apache/directory/api/ldap/model/name/MultiThreadedTest.java
A         integ/src/test/java/org/apache/directory/api/ldap/model/name/FastParserRdnTest.java
AU        integ/src/test/java/org/apache/directory/api/ldap/model/name/SchemaAwareDnSerializationTest.java
AU        integ/src/test/java/org/apache/directory/api/ldap/model/name/DnTest.java
AU        integ/src/test/java/org/apache/directory/api/ldap/model/name/SchemaAwareRdnSerializationTest.java
AU        integ/src/test/java/org/apache/directory/api/ldap/model/name/RdnTest.java
AU        integ/src/test/java/org/apache/directory/api/ldap/model/name/SchemaAwareRdnTest.java
AU        integ/src/test/java/org/apache/directory/api/ldap/model/name/SchemaAwareAvaSerializationTest.java
AU        integ/src/test/java/org/apache/directory/api/ldap/model/name/AvaTest.java
A         integ/src/test/java/org/apache/directory/api/ldap/schema
A         integ/src/test/java/org/apache/directory/api/ldap/schema/syntaxCheckers
AU        integ/src/test/java/org/apache/directory/api/ldap/schema/syntaxCheckers/SubtreeSpecificationSyntaxCheckerTest.java
AU        integ/src/test/java/org/apache/directory/api/ldap/schema/syntaxCheckers/ACIItemSyntaxCheckerTest.java
A         integ/src/test/java/org/apache/directory/api/ldap/entry
AU        integ/src/test/java/org/apache/directory/api/ldap/entry/SchemaAwareEntrySerializationTest.java
AU        integ/src/test/java/org/apache/directory/api/ldap/entry/SchemaAwareAttributeSerializationTest.java
AU        integ/src/test/java/org/apache/directory/api/ldap/entry/SchemaAwareEntryTest.java
AU        integ/src/test/java/org/apache/directory/api/ldap/entry/TestEntryUtils.java
AU        integ/src/test/java/org/apache/directory/api/ldap/entry/SchemaAwareAttributeTest.java
AU        integ/src/test/java/org/apache/directory/api/ldap/entry/SchemaAwareModificationSerializationTest.java
AU        integ/src/test/java/org/apache/directory/api/ldap/entry/SchemaAwareValueSerializationTest.java
A         integ/src/test/java/org/apache/directory/api/ldap/subtree
AU        integ/src/test/java/org/apache/directory/api/ldap/subtree/SubtreeSpecificationParserTest.java
A         integ/src/test/resources
AU        integ/src/test/resources/log4j.properties
A         integ/src/site
AU        integ/src/site/site.xml
A         integ/pom.xml
 U        .
At revision 1768416

Parsing POMs
ERROR: Failed to parse POMs
java.io.IOException: remote file operation failed: <https://builds.apache.org/job/dir-shared-ubuntu-deploy/ws/trunk>
at hudson.remoting.Channel@68bc7f81:ubuntu-us1: hudson.remoting.ProxyException: hudson.maven.MavenModuleSetBuild$MavenExecutionException:
org.apache.maven.project.ProjectBuildingException: Some problems were encountered while processing
the POMs:
[FATAL] Non-resolvable parent POM: Could not find artifact org.apache.directory.project:project:pom:38-SNAPSHOT
and 'parent.relativePath' points at no local POM @ line 22, column 11

	at hudson.FilePath.act(FilePath.java:1014)
	at hudson.FilePath.act(FilePath.java:996)
	at hudson.maven.MavenModuleSetBuild$MavenModuleSetBuildExecution.parsePoms(MavenModuleSetBuild.java:960)
	at hudson.maven.MavenModuleSetBuild$MavenModuleSetBuildExecution.doRun(MavenModuleSetBuild.java:679)
	at hudson.model.AbstractBuild$AbstractBuildExecution.run(AbstractBuild.java:534)
	at hudson.model.Run.execute(Run.java:1741)
	at hudson.maven.MavenModuleSetBuild.run(MavenModuleSetBuild.java:531)
	at hudson.model.ResourceController.execute(ResourceController.java:98)
	at hudson.model.Executor.run(Executor.java:410)
Caused by: hudson.remoting.ProxyException: hudson.maven.MavenModuleSetBuild$MavenExecutionException:
org.apache.maven.project.ProjectBuildingException: Some problems were encountered while processing
the POMs:
[FATAL] Non-resolvable parent POM: Could not find artifact org.apache.directory.project:project:pom:38-SNAPSHOT
and 'parent.relativePath' points at no local POM @ line 22, column 11

	at hudson.maven.MavenModuleSetBuild$PomParser.invoke(MavenModuleSetBuild.java:1364)
	at hudson.maven.MavenModuleSetBuild$PomParser.invoke(MavenModuleSetBuild.java:1098)
	at hudson.FilePath$FileCallableWrapper.call(FilePath.java:2772)
	at hudson.remoting.UserRequest.perform(UserRequest.java:153)
	at hudson.remoting.UserRequest.perform(UserRequest.java:50)
	at hudson.remoting.Request$2.run(Request.java:332)
	at hudson.remoting.InterceptingExecutorService$1.call(InterceptingExecutorService.java:68)
	at java.util.concurrent.FutureTask.run(FutureTask.java:262)
	at java.util.concurrent.ThreadPoolExecutor.runWorker(ThreadPoolExecutor.java:1145)
	at java.util.concurrent.ThreadPoolExecutor$Worker.run(ThreadPoolExecutor.java:615)
	at java.lang.Thread.run(Thread.java:745)
	at ......remote call to ubuntu-us1(Native Method)
	at hudson.remoting.Channel.attachCallSiteStackTrace(Channel.java:1416)
	at hudson.remoting.UserResponse.retrieve(UserRequest.java:253)
	at hudson.remoting.Channel.call(Channel.java:781)
	at hudson.FilePath.act(FilePath.java:1007)
	... 8 more
Caused by: hudson.remoting.ProxyException: org.apache.maven.project.ProjectBuildingException:
Some problems were encountered while processing the POMs:
[FATAL] Non-resolvable parent POM: Could not find artifact org.apache.directory.project:project:pom:38-SNAPSHOT
and 'parent.relativePath' points at no local POM @ line 22, column 11

	at org.apache.maven.project.DefaultProjectBuilder.build(DefaultProjectBuilder.java:364)
	at hudson.maven.MavenEmbedder.buildProjects(MavenEmbedder.java:361)
	at hudson.maven.MavenEmbedder.readProjects(MavenEmbedder.java:331)
	at hudson.maven.MavenModuleSetBuild$PomParser.invoke(MavenModuleSetBuild.java:1301)
	at hudson.maven.MavenModuleSetBuild$PomParser.invoke(MavenModuleSetBuild.java:1098)
	at hudson.FilePath$FileCallableWrapper.call(FilePath.java:2772)
	at hudson.remoting.UserRequest.perform(UserRequest.java:153)
	at hudson.remoting.UserRequest.perform(UserRequest.java:50)
	at hudson.remoting.Request$2.run(Request.java:332)
	at hudson.remoting.InterceptingExecutorService$1.call(InterceptingExecutorService.java:68)
	at java.util.concurrent.FutureTask.run(FutureTask.java:262)
	at java.util.concurrent.ThreadPoolExecutor.runWorker(ThreadPoolExecutor.java:1145)
	at java.util.concurrent.ThreadPoolExecutor$Worker.run(ThreadPoolExecutor.java:615)
	at java.lang.Thread.run(Thread.java:745)

Mime
View raw message