directory-notifications mailing list archives

Site index · List index
Message view « Date » · « Thread »
Top « Date » · « Thread »
From pct...@apache.org
Subject Build failed in Jenkins: directory-fortress-core #189
Date Sun, 06 Nov 2016 01:11:13 GMT
See <https://analysis.apache.org/jenkins/job/directory-fortress-core/189/>

------------------------------------------
[...truncated 146 lines...]
[INFO] [01:07:40.736] Load global repositories
[INFO] [01:07:41.226] Load global repositories (done) | time=495ms
[INFO] [01:07:41.230] Server id: 20161102064551
[INFO] [01:07:41.233] User cache: /home/jenkins/.sonar/cache
[INFO] [01:07:41.248] Install plugins
[INFO] [01:07:41.755] Install JDBC driver
[INFO] [01:07:41.764] Create JDBC datasource for jdbc:mysql://192.168.0.64:3306/sonar?useUnicode=true&amp;characterEncoding=utf8
[INFO] [01:07:44.926] Initializing Hibernate
[INFO] [01:07:48.335] Load project repositories
[INFO] [01:07:48.697] Load project repositories (done) | time=362ms
[INFO] [01:07:48.697] Load project settings
[INFO] [01:07:49.235] Load technical debt model
[INFO] [01:07:49.291] Apply project exclusions
[INFO] [01:07:55.650] -------------  Scan Apache Fortress Core
[INFO] [01:07:55.655] Load module settings
[INFO] [01:07:56.055] Load rules
[INFO] [01:07:57.726] Base dir: <https://analysis.apache.org/jenkins/job/directory-fortress-core/ws/>
[INFO] [01:07:57.726] Working dir: <https://analysis.apache.org/jenkins/job/directory-fortress-core/ws/target/sonar>
[INFO] [01:07:57.727] Source paths: pom.xml, src/main/java
[INFO] [01:07:57.727] Test paths: src/test/java
[INFO] [01:07:57.727] Binary dirs: target/classes
[INFO] [01:07:57.727] Source encoding: UTF-8, default locale: en_US
[INFO] [01:07:57.728] Index files
[INFO] [01:07:58.385] 324 files indexed
[INFO] [01:08:28.342] Quality profile for java: Apache Directory Rules
[INFO] [01:08:28.343] Quality profile for web: Apache Directory Web
[INFO] [01:08:28.343] Quality profile for xml: Default XML Profile
[WARN] [01:08:29.367] ----------------------------------------------------------------
[WARN] [01:08:29.368] Sonargraph: Skipping projectApache Fortress Core [org.apache.directory.fortress:fortress-core],
since no Sonargraph rules are activated in current SonarQube quality profile.
[WARN] [01:08:29.368] ----------------------------------------------------------------
[INFO] [01:08:29.374] Trying to guess scm provider from project layout...
[INFO] [01:08:29.375] Found SCM type: git
[INFO] [01:08:29.375] JIRA issues sensor will not run as some parameters are missing.
[INFO] [01:08:29.376] JaCoCoSensor: JaCoCo report not found : <https://analysis.apache.org/jenkins/job/directory-fortress-core/ws/target/jacoco.exec>
[INFO] [01:08:29.377] JaCoCoItSensor: JaCoCo IT report not found: <https://analysis.apache.org/jenkins/job/directory-fortress-core/ws/target/jacoco-it.exec>
[INFO] [01:08:29.388] Sensor JavaSquidSensor
[INFO] [01:08:29.684] Configured Java source version (sonar.java.source): 7
[INFO] [01:08:29.726] JavaClasspath initialization...
[INFO] [01:08:29.765] JavaClasspath initialization done: 39 ms
[INFO] [01:08:29.766] JavaTestClasspath initialization...
[INFO] [01:08:29.839] JavaTestClasspath initialization done: 73 ms
[INFO] [01:08:30.377] Java Main Files AST scan...
[INFO] [01:08:30.378] 227 source files to be analyzed
[INFO] [01:08:40.382] 90/227 files analyzed, current file: <https://analysis.apache.org/jenkins/job/directory-fortress-core/ws/src/main/java/org/apache/directory/fortress/core/cli/CommandLineInterpreter.java>
[INFO] [01:08:50.383] 185/227 files analyzed, current file: <https://analysis.apache.org/jenkins/job/directory-fortress-core/ws/src/main/java/org/apache/directory/fortress/core/model/Warning.java>
[WARN] [01:08:51.597] Class not found: org.apache.http.annotation.NotThreadSafe
[WARN] [01:08:51.603] Class not found: org.apache.http.annotation.ThreadSafe
[WARN] [01:08:51.612] Class not found: org.apache.http.annotation.Immutable
[INFO] [01:08:53.330] 227/227 source files have been analyzed
[INFO] [01:08:53.331] Java Main Files AST scan done: 22954 ms
[INFO] [01:08:53.338] Java bytecode scan...
[INFO] [01:08:57.130] Java bytecode scan done: 3792 ms
[INFO] [01:08:57.130] Java Test Files AST scan...
[INFO] [01:08:57.130] 71 source files to be analyzed
[INFO] [01:09:07.141] 53/71 files analyzed, current file: <https://analysis.apache.org/jenkins/job/directory-fortress-core/ws/src/test/java/org/apache/directory/fortress/core/impl/apacheds/FortressJUnitApachedsTest.java>
[INFO] [01:09:08.673] Java Test Files AST scan done: 11543 ms
[INFO] [01:09:08.673] 71/71 source files have been analyzed
[INFO] [01:09:08.681] Package design analysis...
[INFO] [01:09:15.200] Package design analysis done: 6519 ms
[INFO] [01:09:15.278] Sensor JavaSquidSensor (done) | time=45890ms
[INFO] [01:09:15.278] Sensor Lines Sensor
[INFO] [01:09:15.375] Sensor Lines Sensor (done) | time=97ms
[INFO] [01:09:15.376] Sensor QProfileSensor
[INFO] [01:09:15.382] Sensor QProfileSensor (done) | time=6ms
[INFO] [01:09:15.382] Sensor InitialOpenIssuesSensor
[INFO] [01:09:15.780] Sensor InitialOpenIssuesSensor (done) | time=398ms
[INFO] [01:09:15.781] Sensor ProjectLinksSensor
[INFO] [01:09:15.914] Sensor ProjectLinksSensor (done) | time=133ms
[INFO] [01:09:15.914] Sensor VersionEventsSensor
[INFO] [01:09:16.050] Sensor VersionEventsSensor (done) | time=136ms
[INFO] [01:09:16.050] Sensor Maven dependencies
[INFO] [01:09:30.328] Sensor Maven dependencies (done) | time=14278ms
[INFO] [01:09:30.328] Sensor org.sonar.plugins.findbugs.FindbugsSensor@6a0b7dc4
[INFO] [01:09:30.336] Execute Findbugs 3.0.1...
[INFO] [01:09:35.035] Findbugs output report: <https://analysis.apache.org/jenkins/job/directory-fortress-core/ws/target/sonar/findbugs-result.xml>
[INFO] [01:11:03.077] Execute Findbugs 3.0.1 done: 92741 ms
[INFO] [01:11:04.078] Sensor org.sonar.plugins.findbugs.FindbugsSensor@6a0b7dc4 (done) | time=93750ms
[INFO] [01:11:04.078] Sensor PmdSensor
[INFO] [01:11:04.087] Execute PMD 5.4.0...
[INFO] [01:11:04.137] Java version: 1.7
[INFO] [01:11:04.227] PMD configuration: <https://analysis.apache.org/jenkins/job/directory-fortress-core/ws/target/sonar/pmd.xml>
[INFO] [01:11:12.929] Execute PMD 5.4.0 done: 8842 ms
[INFO] ------------------------------------------------------------------------
[INFO] BUILD FAILURE
[INFO] ------------------------------------------------------------------------
[INFO] Total time: 3:42.190s
[INFO] Finished at: Sun Nov 06 01:11:13 UTC 2016
[INFO] Final Memory: 39M/448M
[INFO] ------------------------------------------------------------------------
[ERROR] Failed to execute goal org.codehaus.mojo:sonar-maven-plugin:2.6:sonar (default-cli)
on project fortress-core: org/jgrapht/graph/SimpleDirectedGraph : Unsupported major.minor
version 52.0 -> [Help 1]
org.apache.maven.lifecycle.LifecycleExecutionException: Failed to execute goal org.codehaus.mojo:sonar-maven-plugin:2.6:sonar
(default-cli) on project fortress-core: org/jgrapht/graph/SimpleDirectedGraph : Unsupported
major.minor version 52.0
	at org.apache.maven.lifecycle.internal.MojoExecutor.execute(MojoExecutor.java:217)
	at org.apache.maven.lifecycle.internal.MojoExecutor.execute(MojoExecutor.java:153)
	at org.apache.maven.lifecycle.internal.MojoExecutor.execute(MojoExecutor.java:145)
	at org.apache.maven.lifecycle.internal.LifecycleModuleBuilder.buildProject(LifecycleModuleBuilder.java:84)
	at org.apache.maven.lifecycle.internal.LifecycleModuleBuilder.buildProject(LifecycleModuleBuilder.java:59)
	at org.apache.maven.lifecycle.internal.LifecycleStarter.singleThreadedBuild(LifecycleStarter.java:183)
	at org.apache.maven.lifecycle.internal.LifecycleStarter.execute(LifecycleStarter.java:161)
	at org.apache.maven.DefaultMaven.doExecute(DefaultMaven.java:320)
	at org.apache.maven.DefaultMaven.execute(DefaultMaven.java:156)
	at org.apache.maven.cli.MavenCli.execute(MavenCli.java:537)
	at org.apache.maven.cli.MavenCli.doMain(MavenCli.java:196)
	at org.apache.maven.cli.MavenCli.main(MavenCli.java:141)
	at sun.reflect.NativeMethodAccessorImpl.invoke0(Native Method)
	at sun.reflect.NativeMethodAccessorImpl.invoke(NativeMethodAccessorImpl.java:57)
	at sun.reflect.DelegatingMethodAccessorImpl.invoke(DelegatingMethodAccessorImpl.java:43)
	at java.lang.reflect.Method.invoke(Method.java:606)
	at org.codehaus.plexus.classworlds.launcher.Launcher.launchEnhanced(Launcher.java:290)
	at org.codehaus.plexus.classworlds.launcher.Launcher.launch(Launcher.java:230)
	at org.codehaus.plexus.classworlds.launcher.Launcher.mainWithExitCode(Launcher.java:409)
	at org.codehaus.plexus.classworlds.launcher.Launcher.main(Launcher.java:352)
Caused by: org.apache.maven.plugin.MojoExecutionException: org/jgrapht/graph/SimpleDirectedGraph
: Unsupported major.minor version 52.0
	at org.codehaus.mojo.sonar.bootstrap.ExceptionHandling.handle(ExceptionHandling.java:41)
	at org.codehaus.mojo.sonar.bootstrap.RunnerBootstraper.execute(RunnerBootstraper.java:139)
	at org.codehaus.mojo.sonar.SonarMojo.execute(SonarMojo.java:132)
	at org.apache.maven.plugin.DefaultBuildPluginManager.executeMojo(DefaultBuildPluginManager.java:101)
	at org.apache.maven.lifecycle.internal.MojoExecutor.execute(MojoExecutor.java:209)
	... 19 more
Caused by: java.lang.UnsupportedClassVersionError: org/jgrapht/graph/SimpleDirectedGraph :
Unsupported major.minor version 52.0
	at java.lang.ClassLoader.defineClass1(Native Method)
	at java.lang.ClassLoader.defineClass(ClassLoader.java:800)
	at java.security.SecureClassLoader.defineClass(SecureClassLoader.java:142)
	at java.net.URLClassLoader.defineClass(URLClassLoader.java:449)
	at java.net.URLClassLoader.access$100(URLClassLoader.java:71)
	at java.net.URLClassLoader$1.run(URLClassLoader.java:361)
	at java.net.URLClassLoader$1.run(URLClassLoader.java:355)
	at java.security.AccessController.doPrivileged(Native Method)
	at java.net.URLClassLoader.findClass(URLClassLoader.java:354)
	at java.lang.ClassLoader.loadClass(ClassLoader.java:425)
	at java.lang.ClassLoader.loadClass(ClassLoader.java:412)
	at java.lang.ClassLoader.loadClass(ClassLoader.java:358)
	at net.sourceforge.pmd.lang.java.typeresolution.PMDASMClassLoader.loadClass(PMDASMClassLoader.java:65)
	at net.sourceforge.pmd.lang.java.symboltable.TypeSet$ExplicitImportResolver.resolve(TypeSet.java:107)
	at net.sourceforge.pmd.lang.java.symboltable.TypeSet.findClass(TypeSet.java:287)
	at net.sourceforge.pmd.lang.java.symboltable.SourceFileScope.resolveType(SourceFileScope.java:76)
	at net.sourceforge.pmd.lang.java.symboltable.ClassScope.determineParameterTypes(ClassScope.java:311)
	at net.sourceforge.pmd.lang.java.symboltable.ClassScope.findVariableHere(ClassScope.java:170)
	at net.sourceforge.pmd.lang.java.symboltable.AbstractJavaScope.contains(AbstractJavaScope.java:33)
	at net.sourceforge.pmd.lang.java.symboltable.Search.searchUpward(Search.java:50)
	at net.sourceforge.pmd.lang.java.symboltable.Search.searchUpward(Search.java:54)
	at net.sourceforge.pmd.lang.java.symboltable.Search.searchUpward(Search.java:54)
	at net.sourceforge.pmd.lang.java.symboltable.Search.searchUpward(Search.java:54)
	at net.sourceforge.pmd.lang.java.symboltable.Search.execute(Search.java:27)
	at net.sourceforge.pmd.lang.java.symboltable.OccurrenceFinder.visit(OccurrenceFinder.java:29)
	at net.sourceforge.pmd.lang.java.ast.ASTPrimaryExpression.jjtAccept(ASTPrimaryExpression.java:22)
	at net.sourceforge.pmd.lang.java.ast.AbstractJavaNode.childrenAccept(AbstractJavaNode.java:55)
	at net.sourceforge.pmd.lang.java.ast.JavaParserVisitorAdapter.visit(JavaParserVisitorAdapter.java:9)
	at net.sourceforge.pmd.lang.java.ast.JavaParserVisitorAdapter.visit(JavaParserVisitorAdapter.java:296)
	at net.sourceforge.pmd.lang.java.ast.ASTUnaryExpressionNotPlusMinus.jjtAccept(ASTUnaryExpressionNotPlusMinus.java:21)
	at net.sourceforge.pmd.lang.java.ast.AbstractJavaNode.childrenAccept(AbstractJavaNode.java:55)
	at net.sourceforge.pmd.lang.java.ast.JavaParserVisitorAdapter.visit(JavaParserVisitorAdapter.java:9)
	at net.sourceforge.pmd.lang.java.ast.JavaParserVisitorAdapter.visit(JavaParserVisitorAdapter.java:244)
	at net.sourceforge.pmd.lang.java.ast.ASTConditionalAndExpression.jjtAccept(ASTConditionalAndExpression.java:22)
	at net.sourceforge.pmd.lang.java.ast.AbstractJavaNode.childrenAccept(AbstractJavaNode.java:55)
	at net.sourceforge.pmd.lang.java.ast.JavaParserVisitorAdapter.visit(JavaParserVisitorAdapter.java:9)
	at net.sourceforge.pmd.lang.java.ast.JavaParserVisitorAdapter.visit(JavaParserVisitorAdapter.java:228)
	at net.sourceforge.pmd.lang.java.ast.ASTExpression.jjtAccept(ASTExpression.java:22)
	at net.sourceforge.pmd.lang.java.ast.AbstractJavaNode.childrenAccept(AbstractJavaNode.java:55)
	at net.sourceforge.pmd.lang.java.ast.JavaParserVisitorAdapter.visit(JavaParserVisitorAdapter.java:9)
	at net.sourceforge.pmd.lang.java.ast.JavaParserVisitorAdapter.visit(JavaParserVisitorAdapter.java:384)
	at net.sourceforge.pmd.lang.java.ast.ASTIfStatement.jjtAccept(ASTIfStatement.java:31)
	at net.sourceforge.pmd.lang.java.ast.AbstractJavaNode.childrenAccept(AbstractJavaNode.java:55)
	at net.sourceforge.pmd.lang.java.ast.JavaParserVisitorAdapter.visit(JavaParserVisitorAdapter.java:9)
	at net.sourceforge.pmd.lang.java.ast.JavaParserVisitorAdapter.visit(JavaParserVisitorAdapter.java:348)
	at net.sourceforge.pmd.lang.java.ast.ASTStatement.jjtAccept(ASTStatement.java:22)
	at net.sourceforge.pmd.lang.java.ast.AbstractJavaNode.childrenAccept(AbstractJavaNode.java:55)
	at net.sourceforge.pmd.lang.java.ast.JavaParserVisitorAdapter.visit(JavaParserVisitorAdapter.java:9)
	at net.sourceforge.pmd.lang.java.ast.JavaParserVisitorAdapter.visit(JavaParserVisitorAdapter.java:360)
	at net.sourceforge.pmd.lang.java.ast.ASTBlockStatement.jjtAccept(ASTBlockStatement.java:22)
	at net.sourceforge.pmd.lang.java.ast.AbstractJavaNode.childrenAccept(AbstractJavaNode.java:55)
	at net.sourceforge.pmd.lang.java.ast.JavaParserVisitorAdapter.visit(JavaParserVisitorAdapter.java:9)
	at net.sourceforge.pmd.lang.java.ast.JavaParserVisitorAdapter.visit(JavaParserVisitorAdapter.java:356)
	at net.sourceforge.pmd.lang.java.ast.ASTBlock.jjtAccept(ASTBlock.java:22)
	at net.sourceforge.pmd.lang.java.ast.AbstractJavaNode.childrenAccept(AbstractJavaNode.java:55)
	at net.sourceforge.pmd.lang.java.ast.JavaParserVisitorAdapter.visit(JavaParserVisitorAdapter.java:9)
	at net.sourceforge.pmd.lang.java.ast.JavaParserVisitorAdapter.visit(JavaParserVisitorAdapter.java:180)
	at net.sourceforge.pmd.lang.java.ast.ASTMethodDeclaration.jjtAccept(ASTMethodDeclaration.java:25)
	at net.sourceforge.pmd.lang.java.ast.AbstractJavaNode.childrenAccept(AbstractJavaNode.java:55)
	at net.sourceforge.pmd.lang.java.ast.JavaParserVisitorAdapter.visit(JavaParserVisitorAdapter.java:9)
	at net.sourceforge.pmd.lang.java.ast.JavaParserVisitorAdapter.visit(JavaParserVisitorAdapter.java:45)
	at net.sourceforge.pmd.lang.java.ast.ASTClassOrInterfaceBodyDeclaration.jjtAccept(ASTClassOrInterfaceBodyDeclaration.java:41)
	at net.sourceforge.pmd.lang.java.ast.AbstractJavaNode.childrenAccept(AbstractJavaNode.java:55)
	at net.sourceforge.pmd.lang.java.ast.JavaParserVisitorAdapter.visit(JavaParserVisitorAdapter.java:9)
	at net.sourceforge.pmd.lang.java.ast.JavaParserVisitorAdapter.visit(JavaParserVisitorAdapter.java:41)
	at net.sourceforge.pmd.lang.java.ast.ASTClassOrInterfaceBody.jjtAccept(ASTClassOrInterfaceBody.java:22)
	at net.sourceforge.pmd.lang.java.ast.AbstractJavaNode.childrenAccept(AbstractJavaNode.java:55)
	at net.sourceforge.pmd.lang.java.ast.JavaParserVisitorAdapter.visit(JavaParserVisitorAdapter.java:9)
	at net.sourceforge.pmd.lang.java.ast.JavaParserVisitorAdapter.visit(JavaParserVisitorAdapter.java:17)
	at net.sourceforge.pmd.lang.java.ast.ASTClassOrInterfaceDeclaration.jjtAccept(ASTClassOrInterfaceDeclaration.java:26)
	at net.sourceforge.pmd.lang.java.ast.AbstractJavaNode.childrenAccept(AbstractJavaNode.java:55)
	at net.sourceforge.pmd.lang.java.ast.JavaParserVisitorAdapter.visit(JavaParserVisitorAdapter.java:9)
	at net.sourceforge.pmd.lang.java.ast.JavaParserVisitorAdapter.visit(JavaParserVisitorAdapter.java:156)
	at net.sourceforge.pmd.lang.java.ast.ASTTypeDeclaration.jjtAccept(ASTTypeDeclaration.java:36)
	at net.sourceforge.pmd.lang.java.ast.AbstractJavaNode.childrenAccept(AbstractJavaNode.java:55)
	at net.sourceforge.pmd.lang.java.ast.JavaParserVisitorAdapter.visit(JavaParserVisitorAdapter.java:9)
	at net.sourceforge.pmd.lang.java.ast.JavaParserVisitorAdapter.visit(JavaParserVisitorAdapter.java:136)
	at net.sourceforge.pmd.lang.java.ast.ASTCompilationUnit.jjtAccept(ASTCompilationUnit.java:42)
	at net.sourceforge.pmd.lang.java.symboltable.SymbolFacade.initializeWith(SymbolFacade.java:16)
	at net.sourceforge.pmd.lang.java.AbstractJavaHandler$4.start(AbstractJavaHandler.java:79)
	at net.sourceforge.pmd.SourceCodeProcessor.symbolFacade(SourceCodeProcessor.java:100)
	at net.sourceforge.pmd.SourceCodeProcessor.processSource(SourceCodeProcessor.java:139)
	at net.sourceforge.pmd.SourceCodeProcessor.processSourceCode(SourceCodeProcessor.java:76)
	at net.sourceforge.pmd.SourceCodeProcessor.processSourceCode(SourceCodeProcessor.java:43)
	at org.sonar.plugins.pmd.PmdTemplate.process(PmdTemplate.java:82)
	at org.sonar.plugins.pmd.PmdExecutor.executeRules(PmdExecutor.java:120)
	at org.sonar.plugins.pmd.PmdExecutor.executePmd(PmdExecutor.java:90)
	at org.sonar.plugins.pmd.PmdExecutor.execute(PmdExecutor.java:75)
	at org.sonar.plugins.pmd.PmdSensor.analyse(PmdSensor.java:67)
	at org.sonar.batch.phases.SensorsExecutor.executeSensor(SensorsExecutor.java:59)
	at org.sonar.batch.phases.SensorsExecutor.execute(SensorsExecutor.java:51)
	at org.sonar.batch.phases.DatabaseModePhaseExecutor.execute(DatabaseModePhaseExecutor.java:120)
	at org.sonar.batch.scan.ModuleScanContainer.doAfterStart(ModuleScanContainer.java:264)
	at org.sonar.api.platform.ComponentContainer.startComponents(ComponentContainer.java:92)
	at org.sonar.api.platform.ComponentContainer.execute(ComponentContainer.java:77)
	at org.sonar.batch.scan.ProjectScanContainer.scan(ProjectScanContainer.java:235)
	at org.sonar.batch.scan.ProjectScanContainer.scanRecursively(ProjectScanContainer.java:230)
	at org.sonar.batch.scan.ProjectScanContainer.doAfterStart(ProjectScanContainer.java:220)
	at org.sonar.api.platform.ComponentContainer.startComponents(ComponentContainer.java:92)
	at org.sonar.api.platform.ComponentContainer.execute(ComponentContainer.java:77)
	at org.sonar.batch.scan.ScanTask.scan(ScanTask.java:57)
	at org.sonar.batch.scan.ScanTask.execute(ScanTask.java:45)
	at org.sonar.batch.bootstrap.TaskContainer.doAfterStart(TaskContainer.java:135)
	at org.sonar.api.platform.ComponentContainer.startComponents(ComponentContainer.java:92)
	at org.sonar.api.platform.ComponentContainer.execute(ComponentContainer.java:77)
	at org.sonar.batch.bootstrap.GlobalContainer.executeTask(GlobalContainer.java:158)
	at org.sonar.batch.bootstrapper.Batch.executeTask(Batch.java:95)
	at org.sonar.batch.bootstrapper.Batch.execute(Batch.java:67)
	at org.sonar.runner.batch.IsolatedLauncher.execute(IsolatedLauncher.java:48)
	at sun.reflect.NativeMethodAccessorImpl.invoke0(Native Method)
	at sun.reflect.NativeMethodAccessorImpl.invoke(NativeMethodAccessorImpl.java:57)
	at sun.reflect.DelegatingMethodAccessorImpl.invoke(DelegatingMethodAccessorImpl.java:43)
	at java.lang.reflect.Method.invoke(Method.java:606)
	at org.sonar.runner.impl.BatchLauncher$1.delegateExecution(BatchLauncher.java:87)
	at org.sonar.runner.impl.BatchLauncher$1.run(BatchLauncher.java:75)
	at java.security.AccessController.doPrivileged(Native Method)
	at org.sonar.runner.impl.BatchLauncher.doExecute(BatchLauncher.java:69)
	at org.sonar.runner.impl.BatchLauncher.execute(BatchLauncher.java:50)
	at org.sonar.runner.api.EmbeddedRunner.doExecute(EmbeddedRunner.java:102)
	at org.sonar.runner.api.Runner.execute(Runner.java:100)
	at org.codehaus.mojo.sonar.bootstrap.RunnerBootstraper.execute(RunnerBootstraper.java:135)
	... 22 more
[ERROR] 
[ERROR] Re-run Maven using the -X switch to enable full debug logging.
[ERROR] 
[ERROR] For more information about the errors and possible solutions, please read the following
articles:
[ERROR] [Help 1] http://cwiki.apache.org/confluence/display/MAVEN/MojoExecutionException
Sonar analysis completed: FAILURE
Build step 'Sonar' changed build result to FAILURE
Build step 'Sonar' marked build as failure

Mime
View raw message