directory-notifications mailing list archives

Site index · List index
Message view « Date » · « Thread »
Top « Date » · « Thread »
From pct...@apache.org
Subject Build failed in Jenkins: directory-fortress-realm #285
Date Sun, 06 Nov 2016 02:30:58 GMT
See <https://analysis.apache.org/jenkins/job/directory-fortress-realm/285/>

------------------------------------------
Started by timer
Building in workspace <https://analysis.apache.org/jenkins/job/directory-fortress-realm/ws/>
Checkout:workspace / <https://analysis.apache.org/jenkins/job/directory-fortress-realm/ws/>
- hudson.remoting.LocalChannel@47bd29aa
Using strategy: Default
Last Built Revision: Revision dfc871f31899f7ecf8a53c57f85d72c31a2f35c3 (origin/HEAD, origin/master)
Fetching changes from 1 remote Git repository
Fetching upstream changes from origin
Seen branch in repository origin/1.0-RC41
Seen branch in repository origin/HEAD
Seen branch in repository origin/master
Seen 3 remote branches
Commencing build of Revision dfc871f31899f7ecf8a53c57f85d72c31a2f35c3 (origin/HEAD, origin/master)
Checking out Revision dfc871f31899f7ecf8a53c57f85d72c31a2f35c3 (origin/HEAD, origin/master)
Warning : There are multiple branch changesets here
Parsing POMs
[workspace] $ /x1/jenkins/jenkins-master/jenkins-home/tools/hudson.model.JDK/jdk1.7.0_65/bin/java
-Xms256m -Xmx512m -XX:+UseCompressedOops -XX:MaxPermSize=256m -cp /x1/jenkins/jenkins-master/jenkins-home/plugins/maven-plugin/WEB-INF/lib/maven3-agent-1.6.jar:/x1/jenkins/jenkins-master/jenkins-home/tools/hudson.tasks.Maven_MavenInstallation/maven-3.0.5/boot/plexus-classworlds-2.4.jar
org.jvnet.hudson.maven3.agent.Maven3Main /x1/jenkins/jenkins-master/jenkins-home/tools/hudson.tasks.Maven_MavenInstallation/maven-3.0.5
/x1/jenkins/jenkins-master/catalina-base/webapps/jenkins/WEB-INF/lib/remoting-2.36.jar /x1/jenkins/jenkins-master/jenkins-home/plugins/maven-plugin/WEB-INF/lib/maven3-interceptor-1.6.jar
/x1/jenkins/jenkins-master/jenkins-home/plugins/maven-plugin/WEB-INF/lib/maven3-interceptor-commons-1.6.jar
60065
<===[JENKINS REMOTING CAPACITY]===>   channel started
log4j:WARN No appenders could be found for logger (org.apache.commons.beanutils.converters.BooleanConverter).
log4j:WARN Please initialize the log4j system properly.
Executing Maven:  -B -f <https://analysis.apache.org/jenkins/job/directory-fortress-realm/ws/pom.xml>
clean install -U -DskipTests -fae
[INFO] Scanning for projects...
[INFO] ------------------------------------------------------------------------
[INFO] Reactor Build Order:
[INFO] 
[INFO] Apache Fortress Realm
[INFO] Apache Fortress Realm Proxy
[INFO] Apache Fortress Realm Implementation
[INFO]                                                                         
[INFO] ------------------------------------------------------------------------
[INFO] Building Apache Fortress Realm 2.0.0-RC2-SNAPSHOT
[INFO] ------------------------------------------------------------------------
[INFO] 
[INFO] --- maven-clean-plugin:2.6.1:clean (default-clean) @ fortress-realm ---
[INFO] Deleting <https://analysis.apache.org/jenkins/job/directory-fortress-realm/ws/target>
[INFO] 
[INFO] --- maven-remote-resources-plugin:1.5:process (default) @ fortress-realm ---
[INFO] 
[INFO] --- maven-site-plugin:3.4:attach-descriptor (attach-descriptor) @ fortress-realm ---
[INFO] 
[INFO] --- tools-maven-plugin:1.4:verify-legal-files (verify-legal-files) @ fortress-realm
---
[INFO] 
[INFO] --- maven-source-plugin:2.4:jar-no-fork (attach-sources) @ fortress-realm ---
[INFO] 
[INFO] --- maven-install-plugin:2.5.2:install (default-install) @ fortress-realm ---
[INFO] Installing <https://analysis.apache.org/jenkins/job/directory-fortress-realm/ws/pom.xml>
to /x1/jenkins/mvn-repo/org/apache/directory/fortress/fortress-realm/2.0.0-RC2-SNAPSHOT/fortress-realm-2.0.0-RC2-SNAPSHOT.pom
[INFO]                                                                         
[INFO] ------------------------------------------------------------------------
[INFO] Building Apache Fortress Realm Proxy 2.0.0-RC2-SNAPSHOT
[INFO] ------------------------------------------------------------------------
[INFO] 
[INFO] --- maven-clean-plugin:2.6.1:clean (default-clean) @ fortress-realm-proxy ---
[INFO] Deleting <https://analysis.apache.org/jenkins/job/directory-fortress-realm/ws/proxy/target>
[INFO] 
[INFO] --- maven-remote-resources-plugin:1.5:process (default) @ fortress-realm-proxy ---
[INFO] 
[INFO] --- maven-resources-plugin:2.7:resources (default-resources) @ fortress-realm-proxy
---
[INFO] Using 'UTF-8' encoding to copy filtered resources.
[INFO] skip non existing resourceDirectory <https://analysis.apache.org/jenkins/job/directory-fortress-realm/ws/proxy/src/main/resources>
[INFO] Copying 3 resources
[INFO] 
[INFO] --- maven-compiler-plugin:3.3:compile (default-compile) @ fortress-realm-proxy ---
[INFO] Changes detected - recompiling the module!
[INFO] Compiling 4 source files to <https://analysis.apache.org/jenkins/job/directory-fortress-realm/ws/proxy/target/classes>
[INFO] 
[INFO] --- maven-resources-plugin:2.7:testResources (default-testResources) @ fortress-realm-proxy
---
[INFO] Using 'UTF-8' encoding to copy filtered resources.
[INFO] skip non existing resourceDirectory <https://analysis.apache.org/jenkins/job/directory-fortress-realm/ws/proxy/src/test/resources>
[INFO] Copying 3 resources
[INFO] 
[INFO] --- maven-compiler-plugin:3.3:testCompile (default-testCompile) @ fortress-realm-proxy
---
[INFO] No sources to compile
[INFO] 
[INFO] --- maven-surefire-plugin:2.18.1:test (default-test) @ fortress-realm-proxy ---
[INFO] Tests are skipped.
[INFO] 
[INFO] --- maven-jar-plugin:2.6:jar (default-jar) @ fortress-realm-proxy ---
[INFO] Building jar: <https://analysis.apache.org/jenkins/job/directory-fortress-realm/ws/proxy/target/fortress-realm-proxy-2.0.0-RC2-SNAPSHOT.jar>
[INFO] 
[INFO] --- maven-site-plugin:3.4:attach-descriptor (attach-descriptor) @ fortress-realm-proxy
---
[INFO] 
[INFO] --- maven-jar-plugin:2.6:test-jar (default) @ fortress-realm-proxy ---
[INFO] Building jar: <https://analysis.apache.org/jenkins/job/directory-fortress-realm/ws/proxy/target/fortress-realm-proxy-2.0.0-RC2-SNAPSHOT-tests.jar>
[INFO] 
[INFO] --- tools-maven-plugin:1.4:verify-legal-files (verify-legal-files) @ fortress-realm-proxy
---
[INFO] Checking legal files in: fortress-realm-proxy-2.0.0-RC2-SNAPSHOT.jar
[INFO] Checking legal files in: fortress-realm-proxy-2.0.0-RC2-SNAPSHOT-tests.jar
[INFO] 
[INFO] --- maven-source-plugin:2.4:jar-no-fork (attach-sources) @ fortress-realm-proxy ---
[INFO] Building jar: <https://analysis.apache.org/jenkins/job/directory-fortress-realm/ws/proxy/target/fortress-realm-proxy-2.0.0-RC2-SNAPSHOT-sources.jar>
[INFO] 
[INFO] --- maven-install-plugin:2.5.2:install (default-install) @ fortress-realm-proxy ---
[INFO] Installing <https://analysis.apache.org/jenkins/job/directory-fortress-realm/ws/proxy/target/fortress-realm-proxy-2.0.0-RC2-SNAPSHOT.jar>
to /x1/jenkins/mvn-repo/org/apache/directory/fortress/fortress-realm-proxy/2.0.0-RC2-SNAPSHOT/fortress-realm-proxy-2.0.0-RC2-SNAPSHOT.jar
[INFO] Installing <https://analysis.apache.org/jenkins/job/directory-fortress-realm/ws/proxy/pom.xml>
to /x1/jenkins/mvn-repo/org/apache/directory/fortress/fortress-realm-proxy/2.0.0-RC2-SNAPSHOT/fortress-realm-proxy-2.0.0-RC2-SNAPSHOT.pom
[INFO] Installing <https://analysis.apache.org/jenkins/job/directory-fortress-realm/ws/proxy/target/fortress-realm-proxy-2.0.0-RC2-SNAPSHOT-tests.jar>
to /x1/jenkins/mvn-repo/org/apache/directory/fortress/fortress-realm-proxy/2.0.0-RC2-SNAPSHOT/fortress-realm-proxy-2.0.0-RC2-SNAPSHOT-tests.jar
[INFO] Installing <https://analysis.apache.org/jenkins/job/directory-fortress-realm/ws/proxy/target/fortress-realm-proxy-2.0.0-RC2-SNAPSHOT-sources.jar>
to /x1/jenkins/mvn-repo/org/apache/directory/fortress/fortress-realm-proxy/2.0.0-RC2-SNAPSHOT/fortress-realm-proxy-2.0.0-RC2-SNAPSHOT-sources.jar
[INFO]                                                                         
[INFO] ------------------------------------------------------------------------
[INFO] Building Apache Fortress Realm Implementation 2.0.0-RC2-SNAPSHOT
[INFO] ------------------------------------------------------------------------
Downloading: http://repo.maven.apache.org/maven2/org/apache/directory/fortress/fortress-core/2.0.0-RC1/fortress-core-2.0.0-RC1.pom
[WARNING] The POM for org.apache.directory.fortress:fortress-core:jar:2.0.0-RC1 is missing,
no dependency information available
Downloading: http://repo.maven.apache.org/maven2/org/apache/directory/fortress/fortress-core/2.0.0-RC1/fortress-core-2.0.0-RC1.jar
[INFO] ------------------------------------------------------------------------
[INFO] Reactor Summary:
[INFO] 
[INFO] Apache Fortress Realm ............................. SUCCESS [5.619s]
[INFO] Apache Fortress Realm Proxy ....................... SUCCESS [3.542s]
[INFO] Apache Fortress Realm Implementation .............. FAILURE [1.249s]
[INFO] ------------------------------------------------------------------------
[INFO] BUILD FAILURE
[INFO] ------------------------------------------------------------------------
[INFO] Total time: 12.788s
[INFO] Finished at: Sun Nov 06 02:30:57 UTC 2016
[INFO] Final Memory: 25M/315M
[INFO] ------------------------------------------------------------------------
Waiting for Jenkins to finish collecting data
[ERROR] Failed to execute goal on project fortress-realm-impl: Could not resolve dependencies
for project org.apache.directory.fortress:fortress-realm-impl:jar:2.0.0-RC2-SNAPSHOT: Could
not find artifact org.apache.directory.fortress:fortress-core:jar:2.0.0-RC1 in central (http://repo.maven.apache.org/maven2)
-> [Help 1]
[ERROR] 
[ERROR] To see the full stack trace of the errors, re-run Maven with the -e switch.
[ERROR] Re-run Maven using the -X switch to enable full debug logging.
[ERROR] 
[ERROR] For more information about the errors and possible solutions, please read the following
articles:
[ERROR] [Help 1] http://cwiki.apache.org/confluence/display/MAVEN/DependencyResolutionException
[ERROR] 
[ERROR] After correcting the problems, you can resume the build with the command
[ERROR]   mvn <goals> -rf :fortress-realm-impl
[JENKINS] Archiving <https://analysis.apache.org/jenkins/job/directory-fortress-realm/ws/pom.xml>
to org.apache.directory.fortress/fortress-realm/2.0.0-RC2-SNAPSHOT/fortress-realm-2.0.0-RC2-SNAPSHOT.pom
[JENKINS] Archiving <https://analysis.apache.org/jenkins/job/directory-fortress-realm/ws/impl/pom.xml>
to org.apache.directory.fortress/fortress-realm-impl/2.0.0-RC2-SNAPSHOT/fortress-realm-impl-2.0.0-RC2-SNAPSHOT.pom
[JENKINS] Archiving <https://analysis.apache.org/jenkins/job/directory-fortress-realm/ws/proxy/pom.xml>
to org.apache.directory.fortress/fortress-realm-proxy/2.0.0-RC2-SNAPSHOT/fortress-realm-proxy-2.0.0-RC2-SNAPSHOT.pom
[JENKINS] Archiving <https://analysis.apache.org/jenkins/job/directory-fortress-realm/ws/proxy/target/fortress-realm-proxy-2.0.0-RC2-SNAPSHOT.jar>
to org.apache.directory.fortress/fortress-realm-proxy/2.0.0-RC2-SNAPSHOT/fortress-realm-proxy-2.0.0-RC2-SNAPSHOT.jar
[JENKINS] Archiving <https://analysis.apache.org/jenkins/job/directory-fortress-realm/ws/proxy/target/fortress-realm-proxy-2.0.0-RC2-SNAPSHOT-tests.jar>
to org.apache.directory.fortress/fortress-realm-proxy/2.0.0-RC2-SNAPSHOT/fortress-realm-proxy-2.0.0-RC2-SNAPSHOT-tests.jar
[JENKINS] Archiving <https://analysis.apache.org/jenkins/job/directory-fortress-realm/ws/proxy/target/fortress-realm-proxy-2.0.0-RC2-SNAPSHOT-sources.jar>
to org.apache.directory.fortress/fortress-realm-proxy/2.0.0-RC2-SNAPSHOT/fortress-realm-proxy-2.0.0-RC2-SNAPSHOT-sources.jar
Sending e-mails to: notifications@directory.apache.org
channel stopped
Skipping sonar analysis due to bad build status FAILURE

Mime
View raw message