directory-notifications mailing list archives

Site index · List index
Message view « Date » · « Thread »
Top « Date » · « Thread »
From Apache Jenkins Server <jenk...@builds.apache.org>
Subject Build failed in Jenkins: dir-studio-ui-tests #214
Date Mon, 14 Nov 2016 09:03:10 GMT
See <https://builds.apache.org/job/dir-studio-ui-tests/214/>

------------------------------------------
[...truncated 4600 lines...]
[INFO] --- maven-resources-plugin:3.0.1:resources (default-resources) @ org.apache.directory.studio.test.integration.core
---
[INFO] Using 'UTF-8' encoding to copy filtered resources.
[INFO] skip non existing resourceDirectory <https://builds.apache.org/job/dir-studio-ui-tests/ws/trunk/tests/test.integration.core/src/main/resources>
[INFO] Copying 3 resources
[INFO] 
[INFO] --- tycho-compiler-plugin:0.24.0:compile (default-compile) @ org.apache.directory.studio.test.integration.core
---
[INFO] Compiling 5 source files to <https://builds.apache.org/job/dir-studio-ui-tests/ws/trunk/tests/test.integration.core/target/classes>
[INFO] 
[INFO] --- maven-resources-plugin:3.0.1:testResources (default-testResources) @ org.apache.directory.studio.test.integration.core
---
[INFO] Using 'UTF-8' encoding to copy filtered resources.
[INFO] skip non existing resourceDirectory <https://builds.apache.org/job/dir-studio-ui-tests/ws/trunk/tests/test.integration.core/src/test/resources>
[INFO] Copying 3 resources
[INFO] 
[INFO] --- target-platform-configuration:0.24.0:target-platform (default-target-platform)
@ org.apache.directory.studio.test.integration.core ---
[INFO] 
[INFO] --- tycho-packaging-plugin:0.24.0:package-plugin (default-package-plugin) @ org.apache.directory.studio.test.integration.core
---
[INFO] Building jar: <https://builds.apache.org/job/dir-studio-ui-tests/ws/trunk/tests/test.integration.core/target/org.apache.directory.studio.test.integration.core-2.0.0-SNAPSHOT.jar>
[INFO] 
[INFO] --- tycho-p2-plugin:0.24.0:p2-metadata-default (default-p2-metadata-default) @ org.apache.directory.studio.test.integration.core
---
[INFO] 
[INFO] --- maven-site-plugin:3.4:attach-descriptor (attach-descriptor) @ org.apache.directory.studio.test.integration.core
---
[INFO] 
[INFO] --- tycho-surefire-plugin:0.24.0:test (default-test) @ org.apache.directory.studio.test.integration.core
---
[INFO] Expected eclipse log file: <https://builds.apache.org/job/dir-studio-ui-tests/ws/trunk/tests/test.integration.core/target/work/data/.metadata/.log>
[INFO] Command line:
	[/usr/local/asfpackages/java/jdk1.8.0_102/jre/bin/java, -Dosgi.noShutdown=false, -Dosgi.os=linux,
-Dosgi.ws=gtk, -Dosgi.arch=x86_64, -Dosgi.clean=true, -jar, <https://builds.apache.org/job/dir-studio-ui-tests/ws/.repository/p2/osgi/bundle/org.eclipse.equinox.launcher/1.3.100.v20150511-1540/org.eclipse.equinox.launcher-1.3.100.v20150511-1540.jar,>
-data, <https://builds.apache.org/job/dir-studio-ui-tests/ws/trunk/tests/test.integration.core/target/work/data,>
-install, <https://builds.apache.org/job/dir-studio-ui-tests/ws/trunk/tests/test.integration.core/target/work,>
-configuration, <https://builds.apache.org/job/dir-studio-ui-tests/ws/trunk/tests/test.integration.core/target/work/configuration,>
-application, org.eclipse.tycho.surefire.osgibooter.headlesstest, -testproperties, <https://builds.apache.org/job/dir-studio-ui-tests/ws/trunk/tests/test.integration.core/target/surefire.properties]>

-------------------------------------------------------
 T E S T S
-------------------------------------------------------
Running org.apache.directory.studio.test.integration.core.SchemaTest
Tests run: 1, Failures: 0, Errors: 0, Skipped: 0, Time elapsed: 6.613 sec - in org.apache.directory.studio.test.integration.core.SchemaTest
testDefaultSchema(org.apache.directory.studio.test.integration.core.SchemaTest)  Time elapsed:
1.234 sec
Running org.apache.directory.studio.test.integration.core.DirectoryApiConnectionWrapperTest
Tests run: 7, Failures: 0, Errors: 0, Skipped: 0, Time elapsed: 3.781 sec - in org.apache.directory.studio.test.integration.core.DirectoryApiConnectionWrapperTest
testInitializeAttributesRunnable(org.apache.directory.studio.test.integration.core.DirectoryApiConnectionWrapperTest)
 Time elapsed: 1.383 sec
testBind(org.apache.directory.studio.test.integration.core.DirectoryApiConnectionWrapperTest)
 Time elapsed: 0.006 sec
testConnectFailures(org.apache.directory.studio.test.integration.core.DirectoryApiConnectionWrapperTest)
 Time elapsed: 0.053 sec
testConcurrentUseAndCloseOfConnection(org.apache.directory.studio.test.integration.core.DirectoryApiConnectionWrapperTest)
 Time elapsed: 0.332 sec
testConnect(org.apache.directory.studio.test.integration.core.DirectoryApiConnectionWrapperTest)
 Time elapsed: 0.002 sec
testBindFailures(org.apache.directory.studio.test.integration.core.DirectoryApiConnectionWrapperTest)
 Time elapsed: 0.007 sec
testSearch(org.apache.directory.studio.test.integration.core.DirectoryApiConnectionWrapperTest)
 Time elapsed: 0.004 sec
Running org.apache.directory.studio.test.integration.core.JNDIConnectionWrapperTest
Tests run: 5, Failures: 0, Errors: 0, Skipped: 0, Time elapsed: 1.935 sec - in org.apache.directory.studio.test.integration.core.JNDIConnectionWrapperTest
testBind(org.apache.directory.studio.test.integration.core.JNDIConnectionWrapperTest)  Time
elapsed: 0.069 sec
testConnectFailures(org.apache.directory.studio.test.integration.core.JNDIConnectionWrapperTest)
 Time elapsed: 0.002 sec
testConnect(org.apache.directory.studio.test.integration.core.JNDIConnectionWrapperTest) 
Time elapsed: 0.005 sec
testBindFailures(org.apache.directory.studio.test.integration.core.JNDIConnectionWrapperTest)
 Time elapsed: 0.012 sec
testSearch(org.apache.directory.studio.test.integration.core.JNDIConnectionWrapperTest)  Time
elapsed: 0.015 sec

Results :

Tests run: 13, Failures: 0, Errors: 0, Skipped: 0

[INFO] All tests passed!
[JENKINS] Recording test results
[INFO] 
[INFO] --- tools-maven-plugin:1.4:verify-legal-files (verify-legal-files) @ org.apache.directory.studio.test.integration.core
---
[INFO] Checking legal files in: org.apache.directory.studio.test.integration.core-2.0.0-SNAPSHOT.jar
[INFO] 
[INFO] --- maven-install-plugin:2.5.2:install (default-install) @ org.apache.directory.studio.test.integration.core
---
[INFO] Installing <https://builds.apache.org/job/dir-studio-ui-tests/ws/trunk/tests/test.integration.core/target/org.apache.directory.studio.test.integration.core-2.0.0-SNAPSHOT.jar>
to <https://builds.apache.org/job/dir-studio-ui-tests/ws/.repository/org/apache/directory/studio/org.apache.directory.studio.test.integration.core/2.0.0-SNAPSHOT/org.apache.directory.studio.test.integration.core-2.0.0-SNAPSHOT.jar>
[INFO] Installing <https://builds.apache.org/job/dir-studio-ui-tests/ws/trunk/tests/test.integration.core/pom.xml>
to <https://builds.apache.org/job/dir-studio-ui-tests/ws/.repository/org/apache/directory/studio/org.apache.directory.studio.test.integration.core/2.0.0-SNAPSHOT/org.apache.directory.studio.test.integration.core-2.0.0-SNAPSHOT.pom>
[INFO] Installing <https://builds.apache.org/job/dir-studio-ui-tests/ws/trunk/tests/test.integration.core/target/p2content.xml>
to <https://builds.apache.org/job/dir-studio-ui-tests/ws/.repository/org/apache/directory/studio/org.apache.directory.studio.test.integration.core/2.0.0-SNAPSHOT/org.apache.directory.studio.test.integration.core-2.0.0-SNAPSHOT-p2metadata.xml>
[INFO] Installing <https://builds.apache.org/job/dir-studio-ui-tests/ws/trunk/tests/test.integration.core/target/p2artifacts.xml>
to <https://builds.apache.org/job/dir-studio-ui-tests/ws/.repository/org/apache/directory/studio/org.apache.directory.studio.test.integration.core/2.0.0-SNAPSHOT/org.apache.directory.studio.test.integration.core-2.0.0-SNAPSHOT-p2artifacts.xml>
[INFO] 
[INFO] --- tycho-p2-plugin:0.24.0:update-local-index (default-update-local-index) @ org.apache.directory.studio.test.integration.core
---
[JENKINS] Archiving disabled
[INFO]                                                                         
[INFO] ------------------------------------------------------------------------
[INFO] Building Apache Directory Studio UI Integration Tests 2.0.0-SNAPSHOT
[INFO] ------------------------------------------------------------------------
[INFO] 
[INFO] --- maven-clean-plugin:3.0.0:clean (default-clean) @ org.apache.directory.studio.test.integration.ui
---
[INFO] Deleting <https://builds.apache.org/job/dir-studio-ui-tests/ws/trunk/tests/test.integration.ui/target>
[INFO] 
[INFO] --- tycho-packaging-plugin:0.24.0:build-qualifier (default-build-qualifier) @ org.apache.directory.studio.test.integration.ui
---
[INFO] The project's OSGi version is 2.0.0.v20161114
[INFO] 
[INFO] --- tycho-packaging-plugin:0.24.0:validate-id (default-validate-id) @ org.apache.directory.studio.test.integration.ui
---
[INFO] 
[INFO] --- tycho-packaging-plugin:0.24.0:validate-version (default-validate-version) @ org.apache.directory.studio.test.integration.ui
---
[INFO] 
[INFO] --- maven-remote-resources-plugin:1.5:process (process-resource-bundles) @ org.apache.directory.studio.test.integration.ui
---
[INFO] 
[INFO] --- maven-resources-plugin:3.0.1:resources (default-resources) @ org.apache.directory.studio.test.integration.ui
---
[INFO] Using 'UTF-8' encoding to copy filtered resources.
[INFO] Copying 6 resources
[INFO] Copying 3 resources
[INFO] 
[INFO] --- tycho-compiler-plugin:0.24.0:compile (default-compile) @ org.apache.directory.studio.test.integration.ui
---
[INFO] Compiling 75 source files to <https://builds.apache.org/job/dir-studio-ui-tests/ws/trunk/tests/test.integration.ui/target/classes>
[INFO] 
[INFO] --- maven-resources-plugin:3.0.1:testResources (default-testResources) @ org.apache.directory.studio.test.integration.ui
---
[INFO] Using 'UTF-8' encoding to copy filtered resources.
[INFO] skip non existing resourceDirectory <https://builds.apache.org/job/dir-studio-ui-tests/ws/trunk/tests/test.integration.ui/src/test/resources>
[INFO] Copying 3 resources
[INFO] 
[INFO] --- target-platform-configuration:0.24.0:target-platform (default-target-platform)
@ org.apache.directory.studio.test.integration.ui ---
[INFO] 
[INFO] --- tycho-packaging-plugin:0.24.0:package-plugin (default-package-plugin) @ org.apache.directory.studio.test.integration.ui
---
[INFO] Building jar: <https://builds.apache.org/job/dir-studio-ui-tests/ws/trunk/tests/test.integration.ui/target/org.apache.directory.studio.test.integration.ui-2.0.0-SNAPSHOT.jar>
[INFO] 
[INFO] --- tycho-p2-plugin:0.24.0:p2-metadata-default (default-p2-metadata-default) @ org.apache.directory.studio.test.integration.ui
---
[INFO] 
[INFO] --- maven-site-plugin:3.4:attach-descriptor (attach-descriptor) @ org.apache.directory.studio.test.integration.ui
---
[INFO] 
[INFO] --- tycho-surefire-plugin:0.24.0:test (default-test) @ org.apache.directory.studio.test.integration.ui
---
[INFO] Expected eclipse log file: <https://builds.apache.org/job/dir-studio-ui-tests/ws/trunk/tests/test.integration.ui/target/work/data/.metadata/.log>
[INFO] Command line:
	[/usr/local/asfpackages/java/jdk1.8.0_102/jre/bin/java, -Dosgi.noShutdown=false, -Dosgi.os=linux,
-Dosgi.ws=gtk, -Dosgi.arch=x86_64, -Dosgi.clean=true, -jar, <https://builds.apache.org/job/dir-studio-ui-tests/ws/.repository/p2/osgi/bundle/org.eclipse.equinox.launcher/1.3.100.v20150511-1540/org.eclipse.equinox.launcher-1.3.100.v20150511-1540.jar,>
-data, <https://builds.apache.org/job/dir-studio-ui-tests/ws/trunk/tests/test.integration.ui/target/work/data,>
-install, <https://builds.apache.org/job/dir-studio-ui-tests/ws/trunk/tests/test.integration.ui/target/work,>
-configuration, <https://builds.apache.org/job/dir-studio-ui-tests/ws/trunk/tests/test.integration.ui/target/work/configuration,>
-application, org.eclipse.tycho.surefire.osgibooter.uitest, -testproperties, <https://builds.apache.org/job/dir-studio-ui-tests/ws/trunk/tests/test.integration.ui/target/surefire.properties,>
-testApplication, org.apache.directory.studio.rcp.application, -product, org.apache.directory.studio.rcp.product,
-nouithread, -nl, en, -debug, debugoptions]
Configuration location:
    <https://builds.apache.org/job/dir-studio-ui-tests/ws/trunk/tests/test.integration.ui/target/work/configuration/>
Configuration file:
    <https://builds.apache.org/job/dir-studio-ui-tests/ws/trunk/tests/test.integration.ui/target/work/configuration/config.ini>
loaded
Install location:
    <https://builds.apache.org/job/dir-studio-ui-tests/ws/trunk/tests/test.integration.ui/target/work/>
Framework located:
    <https://builds.apache.org/job/dir-studio-ui-tests/ws/.repository/p2/osgi/bundle/org.eclipse.osgi/3.10.102.v20160118-1700/org.eclipse.osgi-3.10.102.v20160118-1700.jar>
Framework classpath:
    <https://builds.apache.org/job/dir-studio-ui-tests/ws/.repository/p2/osgi/bundle/org.eclipse.osgi/3.10.102.v20160118-1700/org.eclipse.osgi-3.10.102.v20160118-1700.jar>
Debug options:
    <https://builds.apache.org/job/dir-studio-ui-tests/ws/trunk/tests/test.integration.ui/debugoptions>
loaded
Time to load bundles: 1897
Starting application: 3372
Launching application org.apache.directory.studio.rcp.application...
An error has occurred. See the log file
<https://builds.apache.org/job/dir-studio-ui-tests/ws/trunk/tests/test.integration.ui/target/work/data/.metadata/.log.>
[JENKINS] Recording test results
[JENKINS] Archiving disabled
[JENKINS] Archiving disabled
[JENKINS] Archiving disabled
[JENKINS] Archiving disabled
[JENKINS] Archiving disabled
[JENKINS] Archiving disabled
[JENKINS] Archiving disabled
[JENKINS] Archiving disabled
[JENKINS] Archiving disabled
[JENKINS] Archiving disabled
[JENKINS] Archiving disabled
[JENKINS] Archiving disabled
[JENKINS] Archiving disabled
[JENKINS] Archiving disabled
[JENKINS] Archiving disabled
[JENKINS] Archiving disabled
[JENKINS] Archiving disabled
[JENKINS] Archiving disabled
[JENKINS] Archiving disabled
[JENKINS] Archiving disabled
[JENKINS] Archiving disabled
[JENKINS] Archiving disabled
[JENKINS] Archiving disabled
[JENKINS] Archiving disabled
[JENKINS] Archiving disabled
[JENKINS] Archiving disabled
[JENKINS] Archiving disabled
[JENKINS] Archiving disabled
[JENKINS] Archiving disabled
[JENKINS] Archiving disabled
[JENKINS] Archiving disabled
[JENKINS] Archiving disabled
[JENKINS] Archiving disabled
[JENKINS] Archiving disabled
[JENKINS] Archiving disabled
[JENKINS] Archiving disabled
[JENKINS] Archiving disabled
[JENKINS] Archiving disabled
[JENKINS] Archiving disabled
[JENKINS] Archiving disabled
[JENKINS] Archiving disabled
[JENKINS] Archiving disabled
[JENKINS] Archiving disabled
[JENKINS] Archiving disabled
[JENKINS] Archiving disabled
[JENKINS] Archiving disabled
[JENKINS] Archiving disabled
[JENKINS] Archiving disabled
[JENKINS] Archiving disabled
[INFO] ------------------------------------------------------------------------
[INFO] Reactor Summary:
[INFO] 
[INFO] Apache Directory Studio Parent .................... SUCCESS [  9.850 s]
[INFO] Apache Directory Studio Target Platform for Eclipse  SUCCESS [  5.483 s]
[INFO] Apache Directory Studio Plugins ................... SUCCESS [ 12.026 s]
[INFO] Apache Directory Studio Common UI ................. SUCCESS [ 11.055 s]
[INFO] Apache Directory Studio Common Core ............... SUCCESS [ 10.702 s]
[INFO] Apache Directory Studio LDIF Parser ............... SUCCESS [02:13 min]
[INFO] Apache Directory Studio Connection Core ........... SUCCESS [ 11.031 s]
[INFO] Apache Directory Studio Connection UI ............. SUCCESS [  8.537 s]
[INFO] Apache Directory Studio LDAP Browser Core ......... SUCCESS [ 20.485 s]
[INFO] Apache Directory Studio LDAP Browser Common ....... SUCCESS [ 14.896 s]
[INFO] Apache Directory Studio Value Editors ............. SUCCESS [  9.257 s]
[INFO] Apache Directory Studio ACI Item Editor ........... SUCCESS [ 10.926 s]
[INFO] Apache Directory Studio ApacheDS Configuration .... SUCCESS [ 12.761 s]
[INFO] Apache Directory Studio LDIF Editor ............... SUCCESS [  9.863 s]
[INFO] Apache Directory Studio LDAP Browser UI ........... SUCCESS [ 10.974 s]
[INFO] Apache Directory Studio LDAP Servers .............. SUCCESS [ 10.108 s]
[INFO] Apache Directory Studio ApacheDS LDAP Server Adapter  SUCCESS [ 10.753 s]
[INFO] Apache Directory Studio RCP ....................... SUCCESS [ 11.683 s]
[INFO] Apache Directory Studio Schema Editor ............. SUCCESS [ 15.973 s]
[INFO] Apache Directory Studio OpenLDAP Common UI ........ SUCCESS [ 13.632 s]
[INFO] Apache Directory Studio OpenLDAP Syncrepl ......... SUCCESS [ 13.148 s]
[INFO] Apache Directory Studio OpenLDAP Configuration Editor  SUCCESS [ 17.244 s]
[INFO] Apache Directory Studio OpenLDAP ACL Configuration Editor  SUCCESS [ 13.158 s]
[INFO] Apache Directory Studio Template Editor ........... SUCCESS [ 11.022 s]
[INFO] Apache Directory Studio Combined Editor ........... SUCCESS [  9.930 s]
[INFO] Apache Directory Studio SLF4J to Eclipse Log Binding  SUCCESS [  8.536 s]
[INFO] Apache Directory Studio Help Plugins .............. SUCCESS [  3.976 s]
[INFO] Apache Directory Studio Apache DS Help ............ SUCCESS [ 23.250 s]
[INFO] Apache Directory Studio LDAP Browser Help ......... SUCCESS [ 41.419 s]
[INFO] Apache Directory Studio LDIF Editor Help .......... SUCCESS [ 35.854 s]
[INFO] Apache Directory Studio RCP Help .................. SUCCESS [ 16.462 s]
[INFO] Apache Directory Studio Schema Editor Help ........ SUCCESS [ 18.199 s]
[INFO] Apache Directory Studio Feature Plugins ........... SUCCESS [  4.567 s]
[INFO] Apache Directory Studio ApacheDS Feature .......... SUCCESS [  5.951 s]
[INFO] Apache Directory Studio LDAP Browser Feature ...... SUCCESS [  8.032 s]
[INFO] Apache Directory Studio LDIF Editor Feature ....... SUCCESS [ 11.132 s]
[INFO] Apache Directory Studio RCP Feature ............... SUCCESS [  7.255 s]
[INFO] Apache Directory Studio Schema Editor Feature ..... SUCCESS [  8.231 s]
[INFO] Apache Directory Studio OpenLDAP Feature .......... SUCCESS [  7.257 s]
[INFO] Apache Directory Studio National Language Support Feature  SUCCESS [  8.359 s]
[INFO] Apache Directory Studio Test Plugins .............. SUCCESS [  3.021 s]
[INFO] Apache Directory Studio Core Integration Tests .... SUCCESS [ 27.897 s]
[INFO] Apache Directory Studio UI Integration Tests ...... FAILURE [ 14.684 s]
[INFO] Apache Directory Studio P2 Repositories ........... SKIPPED
[INFO] Apache Directory Studio P2 Repository Dependencies  SKIPPED
[INFO] Apache Directory Studio P2 Repository Eclipse ..... SKIPPED
[INFO] Apache Directory Studio Product ................... SKIPPED
[INFO] Apache Directory Studio Installers ................ SKIPPED
[INFO] ------------------------------------------------------------------------
[INFO] BUILD FAILURE
[INFO] ------------------------------------------------------------------------
[INFO] Total time: 17:44 min
[INFO] Finished at: 2016-11-14T09:02:21+00:00
[INFO] Final Memory: 128M/672M
[INFO] ------------------------------------------------------------------------
[ERROR] Failed to execute goal org.eclipse.tycho:tycho-surefire-plugin:0.24.0:test (default-test)
on project org.apache.directory.studio.test.integration.ui: An unexpected error occured while
launching the test runtime (return code 13). See log for details. -> [Help 1]
[ERROR] 
[ERROR] To see the full stack trace of the errors, re-run Maven with the -e switch.
[ERROR] Re-run Maven using the -X switch to enable full debug logging.
[ERROR] 
[ERROR] For more information about the errors and possible solutions, please read the following
articles:
[ERROR] [Help 1] http://cwiki.apache.org/confluence/display/MAVEN/MojoFailureException
[ERROR] 
[ERROR] After correcting the problems, you can resume the build with the command
[ERROR]   mvn <goals> -rf :org.apache.directory.studio.test.integration.ui
channel stopped
[dir-studio-ui-tests] $ /bin/bash /tmp/hudson6738007314916547250.sh
Xvfb stopping

Mime
View raw message