directory-notifications mailing list archives

Site index · List index
Message view « Date » · « Thread »
Top « Date » · « Thread »
From Apache Jenkins Server <jenk...@builds.apache.org>
Subject Build failed in Jenkins: dir-shared-ubuntu-deploy #1954
Date Sat, 12 Nov 2016 01:41:05 GMT
See <https://builds.apache.org/job/dir-shared-ubuntu-deploy/1954/changes>

Changes:

[elecharny] Fixed the Checkstyle issues found by the ew version of the checkstyle plugin.

[elecharny] Used the latest project and skin versions

------------------------------------------
[...truncated 5244 lines...]
[INFO] Downloading: https://repo.maven.apache.org/maven2/org/apache/maven/doxia/doxia-integration-tools/1.6/doxia-integration-tools-1.6.jar
[INFO] Downloaded: https://repo.maven.apache.org/maven2/org/apache/struts/struts-core/1.3.8/struts-core-1.3.8.jar
(322 KB at 1466.6 KB/sec)
[INFO] Downloading: https://repo.maven.apache.org/maven2/commons-io/commons-io/1.4/commons-io-1.4.jar
[INFO] Downloaded: https://repo.maven.apache.org/maven2/dom4j/dom4j/1.1/dom4j-1.1.jar (447
KB at 2019.0 KB/sec)
[INFO] Downloading: https://repo.maven.apache.org/maven2/org/codehaus/plexus/plexus-resources/1.0.1/plexus-resources-1.0.1.jar
[INFO] Downloaded: https://repo.maven.apache.org/maven2/org/apache/maven/doxia/doxia-integration-tools/1.6/doxia-integration-tools-1.6.jar
(44 KB at 192.8 KB/sec)
[INFO] Downloading: https://repo.maven.apache.org/maven2/org/codehaus/plexus/plexus-utils/3.0.20/plexus-utils-3.0.20.jar
[INFO] Downloaded: https://repo.maven.apache.org/maven2/org/apache/struts/struts-tiles/1.3.8/struts-tiles-1.3.8.jar
(117 KB at 510.3 KB/sec)
[INFO] Downloading: https://repo.maven.apache.org/maven2/org/codehaus/plexus/plexus-interpolation/1.21/plexus-interpolation-1.21.jar
[INFO] Downloaded: https://repo.maven.apache.org/maven2/org/apache/struts/struts-taglib/1.3.8/struts-taglib-1.3.8.jar
(246 KB at 1049.7 KB/sec)
[INFO] Downloading: https://repo.maven.apache.org/maven2/org/codehaus/plexus/plexus-velocity/1.1.8/plexus-velocity-1.1.8.jar
[INFO] Downloaded: https://repo.maven.apache.org/maven2/org/codehaus/plexus/plexus-resources/1.0.1/plexus-resources-1.0.1.jar
(22 KB at 90.2 KB/sec)
[INFO] Downloading: https://repo.maven.apache.org/maven2/commons-collections/commons-collections/3.2.1/commons-collections-3.2.1.jar
[INFO] Downloaded: https://repo.maven.apache.org/maven2/commons-io/commons-io/1.4/commons-io-1.4.jar
(107 KB at 447.4 KB/sec)
[INFO] Downloaded: https://repo.maven.apache.org/maven2/org/codehaus/plexus/plexus-interpolation/1.21/plexus-interpolation-1.21.jar
(61 KB at 246.9 KB/sec)
[INFO] Downloaded: https://repo.maven.apache.org/maven2/org/codehaus/plexus/plexus-velocity/1.1.8/plexus-velocity-1.1.8.jar
(8 KB at 31.0 KB/sec)
[INFO] Downloaded: https://repo.maven.apache.org/maven2/org/codehaus/plexus/plexus-utils/3.0.20/plexus-utils-3.0.20.jar
(238 KB at 945.9 KB/sec)
[INFO] Downloaded: https://repo.maven.apache.org/maven2/commons-collections/commons-collections/3.2.1/commons-collections-3.2.1.jar
(562 KB at 2065.8 KB/sec)
[WARNING] Error injecting: org.apache.maven.plugin.checkstyle.CheckstyleViolationCheckMojo
java.lang.UnsupportedClassVersionError: com/puppycrawl/tools/checkstyle/api/AuditListener
: Unsupported major.minor version 52.0
	at java.lang.ClassLoader.defineClass1(Native Method)
	at java.lang.ClassLoader.defineClass(ClassLoader.java:800)
	at java.security.SecureClassLoader.defineClass(SecureClassLoader.java:142)
	at java.net.URLClassLoader.defineClass(URLClassLoader.java:449)
	at java.net.URLClassLoader.access$100(URLClassLoader.java:71)
	at java.net.URLClassLoader$1.run(URLClassLoader.java:361)
	at java.net.URLClassLoader$1.run(URLClassLoader.java:355)
	at java.security.AccessController.doPrivileged(Native Method)
	at java.net.URLClassLoader.findClass(URLClassLoader.java:354)
	at org.codehaus.plexus.classworlds.realm.ClassRealm.loadClassFromSelf(ClassRealm.java:401)
	at org.codehaus.plexus.classworlds.strategy.SelfFirstStrategy.loadClass(SelfFirstStrategy.java:42)
	at org.codehaus.plexus.classworlds.realm.ClassRealm.unsynchronizedLoadClass(ClassRealm.java:271)
	at org.codehaus.plexus.classworlds.realm.ClassRealm.loadClass(ClassRealm.java:247)
	at org.codehaus.plexus.classworlds.realm.ClassRealm.loadClass(ClassRealm.java:239)
	at java.lang.Class.getDeclaredConstructors0(Native Method)
	at java.lang.Class.privateGetDeclaredConstructors(Class.java:2595)
	at java.lang.Class.getDeclaredConstructors(Class.java:1914)
	at com.google.inject.spi.InjectionPoint.forConstructorOf(InjectionPoint.java:245)
	at com.google.inject.internal.ConstructorBindingImpl.create(ConstructorBindingImpl.java:99)
	at com.google.inject.internal.InjectorImpl.createUninitializedBinding(InjectorImpl.java:658)
	at com.google.inject.internal.InjectorImpl.createJustInTimeBinding(InjectorImpl.java:882)
	at com.google.inject.internal.InjectorImpl.createJustInTimeBindingRecursive(InjectorImpl.java:805)
	at com.google.inject.internal.InjectorImpl.getJustInTimeBinding(InjectorImpl.java:282)
	at com.google.inject.internal.InjectorImpl.getBindingOrThrow(InjectorImpl.java:214)
	at com.google.inject.internal.InjectorImpl.getProviderOrThrow(InjectorImpl.java:1006)
	at com.google.inject.internal.InjectorImpl.getProvider(InjectorImpl.java:1038)
	at com.google.inject.internal.InjectorImpl.getProvider(InjectorImpl.java:1001)
	at com.google.inject.internal.InjectorImpl.getInstance(InjectorImpl.java:1051)
	at org.eclipse.sisu.space.AbstractDeferredClass.get(AbstractDeferredClass.java:48)
	at com.google.inject.internal.ProviderInternalFactory.provision(ProviderInternalFactory.java:81)
	at com.google.inject.internal.InternalFactoryToInitializableAdapter.provision(InternalFactoryToInitializableAdapter.java:53)
	at com.google.inject.internal.ProviderInternalFactory$1.call(ProviderInternalFactory.java:65)
	at com.google.inject.internal.ProvisionListenerStackCallback$Provision.provision(ProvisionListenerStackCallback.java:115)
	at org.eclipse.sisu.bean.BeanScheduler$Activator.onProvision(BeanScheduler.java:176)
	at com.google.inject.internal.ProvisionListenerStackCallback$Provision.provision(ProvisionListenerStackCallback.java:126)
	at com.google.inject.internal.ProvisionListenerStackCallback.provision(ProvisionListenerStackCallback.java:68)
	at com.google.inject.internal.ProviderInternalFactory.circularGet(ProviderInternalFactory.java:63)
	at com.google.inject.internal.InternalFactoryToInitializableAdapter.get(InternalFactoryToInitializableAdapter.java:45)
	at com.google.inject.internal.InjectorImpl$2$1.call(InjectorImpl.java:1016)
	at com.google.inject.internal.InjectorImpl.callInContext(InjectorImpl.java:1092)
	at com.google.inject.internal.InjectorImpl$2.get(InjectorImpl.java:1012)
	at org.eclipse.sisu.inject.Guice4$1.get(Guice4.java:162)
	at org.eclipse.sisu.inject.LazyBeanEntry.getValue(LazyBeanEntry.java:81)
	at org.eclipse.sisu.plexus.LazyPlexusBean.getValue(LazyPlexusBean.java:51)
	at org.codehaus.plexus.DefaultPlexusContainer.lookup(DefaultPlexusContainer.java:263)
	at org.codehaus.plexus.DefaultPlexusContainer.lookup(DefaultPlexusContainer.java:255)
	at org.apache.maven.plugin.internal.DefaultMavenPluginManager.getConfiguredMojo(DefaultMavenPluginManager.java:517)
	at org.apache.maven.plugin.DefaultBuildPluginManager.executeMojo(DefaultBuildPluginManager.java:121)
	at org.apache.maven.lifecycle.internal.MojoExecutor.execute(MojoExecutor.java:207)
	at org.apache.maven.lifecycle.internal.MojoExecutor.execute(MojoExecutor.java:153)
	at org.apache.maven.lifecycle.internal.MojoExecutor.execute(MojoExecutor.java:145)
	at org.apache.maven.lifecycle.internal.LifecycleModuleBuilder.buildProject(LifecycleModuleBuilder.java:116)
	at org.apache.maven.lifecycle.internal.LifecycleModuleBuilder.buildProject(LifecycleModuleBuilder.java:80)
	at org.apache.maven.lifecycle.internal.builder.singlethreaded.SingleThreadedBuilder.build(SingleThreadedBuilder.java:51)
	at org.apache.maven.lifecycle.internal.LifecycleStarter.execute(LifecycleStarter.java:128)
	at org.apache.maven.DefaultMaven.doExecute(DefaultMaven.java:307)
	at org.apache.maven.DefaultMaven.doExecute(DefaultMaven.java:193)
	at org.apache.maven.DefaultMaven.execute(DefaultMaven.java:106)
	at org.jvnet.hudson.maven3.launcher.Maven32Launcher.main(Maven32Launcher.java:132)
	at sun.reflect.NativeMethodAccessorImpl.invoke0(Native Method)
	at sun.reflect.NativeMethodAccessorImpl.invoke(NativeMethodAccessorImpl.java:57)
	at sun.reflect.DelegatingMethodAccessorImpl.invoke(DelegatingMethodAccessorImpl.java:43)
	at java.lang.reflect.Method.invoke(Method.java:606)
	at org.codehaus.plexus.classworlds.launcher.Launcher.launchStandard(Launcher.java:330)
	at org.codehaus.plexus.classworlds.launcher.Launcher.launch(Launcher.java:238)
	at jenkins.maven3.agent.Maven32Main.launch(Maven32Main.java:186)
	at sun.reflect.NativeMethodAccessorImpl.invoke0(Native Method)
	at sun.reflect.NativeMethodAccessorImpl.invoke(NativeMethodAccessorImpl.java:57)
	at sun.reflect.DelegatingMethodAccessorImpl.invoke(DelegatingMethodAccessorImpl.java:43)
	at java.lang.reflect.Method.invoke(Method.java:606)
	at hudson.maven.Maven3Builder.call(Maven3Builder.java:136)
	at hudson.maven.Maven3Builder.call(Maven3Builder.java:71)
	at hudson.remoting.UserRequest.perform(UserRequest.java:153)
	at hudson.remoting.UserRequest.perform(UserRequest.java:50)
	at hudson.remoting.Request$2.run(Request.java:332)
	at hudson.remoting.InterceptingExecutorService$1.call(InterceptingExecutorService.java:68)
	at java.util.concurrent.FutureTask.run(FutureTask.java:262)
	at java.util.concurrent.ThreadPoolExecutor.runWorker(ThreadPoolExecutor.java:1145)
	at java.util.concurrent.ThreadPoolExecutor$Worker.run(ThreadPoolExecutor.java:615)
	at java.lang.Thread.run(Thread.java:745)
[PMD] No report found for mojo check
[INFO] ------------------------------------------------------------------------
[INFO] Reactor Summary:
[INFO] 
[INFO] Apache Directory LDAP API .......................... FAILURE [ 11.419 s]
[INFO] Apache Directory LDAP API I18n ..................... SKIPPED
[INFO] Apache Directory LDAP API Utilities ................ SKIPPED
[INFO] Apache Directory API ASN.1 Parent .................. SKIPPED
[INFO] Apache Directory API ASN.1 API ..................... SKIPPED
[INFO] Apache Directory API ASN.1 BER ..................... SKIPPED
[INFO] Apache Directory LDAP API Parent ................... SKIPPED
[INFO] Apache Directory LDAP API Model .................... SKIPPED
[INFO] Apache Directory LDAP API Codec Parent ............. SKIPPED
[INFO] Apache Directory LDAP API Codec Core ............... SKIPPED
[INFO] Apache Directory LDAP API Net Parent ............... SKIPPED
[INFO] Apache Directory LDAP API Network MINA ............. SKIPPED
[INFO] Apache Directory LDAP API Extras ................... SKIPPED
[INFO] Apache Directory LDAP API Extras Codec API ......... SKIPPED
[INFO] Apache Directory LDAP API Extras Codec ............. SKIPPED
[INFO] Apache Directory LDAP API Codec Standalone ......... SKIPPED
[INFO] Apache Directory LDAP API DSML Parent .............. SKIPPED
[INFO] Apache Directory LDAP API DSML Parser .............. SKIPPED
[INFO] Apache Directory LDAP API Extras ACI ............... SKIPPED
[INFO] Apache Directory LDAP API Schema Parent ............ SKIPPED
[INFO] Apache Directory LDAP API Schema Data .............. SKIPPED
[INFO] Apache Directory LDAP API Client Parent ............ SKIPPED
[INFO] Apache Directory LDAP API Client API ............... SKIPPED
[INFO] Apache Directory LDAP API DSML Engine .............. SKIPPED
[INFO] Apache Directory LDAP API Extras Util .............. SKIPPED
[INFO] Apache Directory LDAP API Extras Stored Procedures . SKIPPED
[INFO] Apache Directory LDAP API Extras Trigger ........... SKIPPED
[INFO] Apache Directory LDAP API Schema Converter ......... SKIPPED
[INFO] Apache Directory API All ........................... SKIPPED
[INFO] Apache Directory LDAP API Client All ............... SKIPPED
[INFO] Apache Directory API Integration Tests ............. SKIPPED
[INFO] Apache Directory API OSGi Integration Tests ........ SKIPPED
[INFO] Apache Directory LDAP API Distribution ............. SKIPPED
[INFO] ------------------------------------------------------------------------
[INFO] BUILD FAILURE
[INFO] ------------------------------------------------------------------------
[INFO] Total time: 32.750 s
[INFO] Finished at: 2016-11-12T01:37:31+00:00
[INFO] Final Memory: 32M/491M
[INFO] ------------------------------------------------------------------------
Waiting for Jenkins to finish collecting data
[ERROR] Failed to execute goal org.apache.maven.plugins:maven-checkstyle-plugin:2.17:check
(validate) on project api-parent: Execution validate of goal org.apache.maven.plugins:maven-checkstyle-plugin:2.17:check
failed: An API incompatibility was encountered while executing org.apache.maven.plugins:maven-checkstyle-plugin:2.17:check:
java.lang.UnsupportedClassVersionError: com/puppycrawl/tools/checkstyle/api/AuditListener
: Unsupported major.minor version 52.0
[ERROR] -----------------------------------------------------
[ERROR] realm =    plugin>org.apache.maven.plugins:maven-checkstyle-plugin:2.17
[ERROR] strategy = org.codehaus.plexus.classworlds.strategy.SelfFirstStrategy
[ERROR] urls[0] = <https://builds.apache.org/job/dir-shared-ubuntu-deploy/ws/.repository/org/apache/maven/plugins/maven-checkstyle-plugin/2.17/maven-checkstyle-plugin-2.17.jar>
[ERROR] urls[1] = <https://builds.apache.org/job/dir-shared-ubuntu-deploy/ws/.repository/com/puppycrawl/tools/checkstyle/7.2/checkstyle-7.2.jar>
[ERROR] urls[2] = <https://builds.apache.org/job/dir-shared-ubuntu-deploy/ws/.repository/antlr/antlr/2.7.7/antlr-2.7.7.jar>
[ERROR] urls[3] = <https://builds.apache.org/job/dir-shared-ubuntu-deploy/ws/.repository/org/antlr/antlr4-runtime/4.5.3/antlr4-runtime-4.5.3.jar>
[ERROR] urls[4] = <https://builds.apache.org/job/dir-shared-ubuntu-deploy/ws/.repository/commons-beanutils/commons-beanutils/1.9.3/commons-beanutils-1.9.3.jar>
[ERROR] urls[5] = <https://builds.apache.org/job/dir-shared-ubuntu-deploy/ws/.repository/commons-logging/commons-logging/1.2/commons-logging-1.2.jar>
[ERROR] urls[6] = <https://builds.apache.org/job/dir-shared-ubuntu-deploy/ws/.repository/commons-cli/commons-cli/1.3.1/commons-cli-1.3.1.jar>
[ERROR] urls[7] = <https://builds.apache.org/job/dir-shared-ubuntu-deploy/ws/.repository/com/google/guava/guava/19.0/guava-19.0.jar>
[ERROR] urls[8] = file:/usr/local/asfpackages/java/jdk1.7.0_80/jre/../lib/tools.jar
[ERROR] urls[9] = <https://builds.apache.org/job/dir-shared-ubuntu-deploy/ws/.repository/org/apache/directory/buildtools/checkstyle-configuration/0.3/checkstyle-configuration-0.3.jar>
[ERROR] urls[10] = <https://builds.apache.org/job/dir-shared-ubuntu-deploy/ws/.repository/org/slf4j/slf4j-jdk14/1.5.6/slf4j-jdk14-1.5.6.jar>
[ERROR] urls[11] = <https://builds.apache.org/job/dir-shared-ubuntu-deploy/ws/.repository/org/slf4j/jcl-over-slf4j/1.5.6/jcl-over-slf4j-1.5.6.jar>
[ERROR] urls[12] = <https://builds.apache.org/job/dir-shared-ubuntu-deploy/ws/.repository/junit/junit/3.8.1/junit-3.8.1.jar>
[ERROR] urls[13] = <https://builds.apache.org/job/dir-shared-ubuntu-deploy/ws/.repository/org/codehaus/plexus/plexus-interactivity-api/1.0-alpha-4/plexus-interactivity-api-1.0-alpha-4.jar>
[ERROR] urls[14] = <https://builds.apache.org/job/dir-shared-ubuntu-deploy/ws/.repository/backport-util-concurrent/backport-util-concurrent/3.1/backport-util-concurrent-3.1.jar>
[ERROR] urls[15] = <https://builds.apache.org/job/dir-shared-ubuntu-deploy/ws/.repository/org/sonatype/plexus/plexus-sec-dispatcher/1.3/plexus-sec-dispatcher-1.3.jar>
[ERROR] urls[16] = <https://builds.apache.org/job/dir-shared-ubuntu-deploy/ws/.repository/org/sonatype/plexus/plexus-cipher/1.4/plexus-cipher-1.4.jar>
[ERROR] urls[17] = <https://builds.apache.org/job/dir-shared-ubuntu-deploy/ws/.repository/org/apache/maven/reporting/maven-reporting-api/3.0/maven-reporting-api-3.0.jar>
[ERROR] urls[18] = <https://builds.apache.org/job/dir-shared-ubuntu-deploy/ws/.repository/org/apache/maven/reporting/maven-reporting-impl/2.3/maven-reporting-impl-2.3.jar>
[ERROR] urls[19] = <https://builds.apache.org/job/dir-shared-ubuntu-deploy/ws/.repository/org/apache/maven/shared/maven-shared-utils/0.6/maven-shared-utils-0.6.jar>
[ERROR] urls[20] = <https://builds.apache.org/job/dir-shared-ubuntu-deploy/ws/.repository/com/google/code/findbugs/jsr305/2.0.1/jsr305-2.0.1.jar>
[ERROR] urls[21] = <https://builds.apache.org/job/dir-shared-ubuntu-deploy/ws/.repository/org/apache/maven/doxia/doxia-core/1.2/doxia-core-1.2.jar>
[ERROR] urls[22] = <https://builds.apache.org/job/dir-shared-ubuntu-deploy/ws/.repository/xerces/xercesImpl/2.9.1/xercesImpl-2.9.1.jar>
[ERROR] urls[23] = <https://builds.apache.org/job/dir-shared-ubuntu-deploy/ws/.repository/xml-apis/xml-apis/1.3.04/xml-apis-1.3.04.jar>
[ERROR] urls[24] = <https://builds.apache.org/job/dir-shared-ubuntu-deploy/ws/.repository/org/apache/httpcomponents/httpclient/4.0.2/httpclient-4.0.2.jar>
[ERROR] urls[25] = <https://builds.apache.org/job/dir-shared-ubuntu-deploy/ws/.repository/org/apache/httpcomponents/httpcore/4.0.1/httpcore-4.0.1.jar>
[ERROR] urls[26] = <https://builds.apache.org/job/dir-shared-ubuntu-deploy/ws/.repository/commons-codec/commons-codec/1.3/commons-codec-1.3.jar>
[ERROR] urls[27] = <https://builds.apache.org/job/dir-shared-ubuntu-deploy/ws/.repository/commons-validator/commons-validator/1.3.1/commons-validator-1.3.1.jar>
[ERROR] urls[28] = <https://builds.apache.org/job/dir-shared-ubuntu-deploy/ws/.repository/commons-digester/commons-digester/1.6/commons-digester-1.6.jar>
[ERROR] urls[29] = <https://builds.apache.org/job/dir-shared-ubuntu-deploy/ws/.repository/org/apache/maven/doxia/doxia-sink-api/1.4/doxia-sink-api-1.4.jar>
[ERROR] urls[30] = <https://builds.apache.org/job/dir-shared-ubuntu-deploy/ws/.repository/org/apache/maven/doxia/doxia-logging-api/1.4/doxia-logging-api-1.4.jar>
[ERROR] urls[31] = <https://builds.apache.org/job/dir-shared-ubuntu-deploy/ws/.repository/org/apache/maven/doxia/doxia-decoration-model/1.4/doxia-decoration-model-1.4.jar>
[ERROR] urls[32] = <https://builds.apache.org/job/dir-shared-ubuntu-deploy/ws/.repository/org/apache/maven/doxia/doxia-site-renderer/1.4/doxia-site-renderer-1.4.jar>
[ERROR] urls[33] = <https://builds.apache.org/job/dir-shared-ubuntu-deploy/ws/.repository/org/apache/maven/doxia/doxia-module-xhtml/1.4/doxia-module-xhtml-1.4.jar>
[ERROR] urls[34] = <https://builds.apache.org/job/dir-shared-ubuntu-deploy/ws/.repository/org/apache/maven/doxia/doxia-module-fml/1.4/doxia-module-fml-1.4.jar>
[ERROR] urls[35] = <https://builds.apache.org/job/dir-shared-ubuntu-deploy/ws/.repository/org/codehaus/plexus/plexus-i18n/1.0-beta-7/plexus-i18n-1.0-beta-7.jar>
[ERROR] urls[36] = <https://builds.apache.org/job/dir-shared-ubuntu-deploy/ws/.repository/org/apache/velocity/velocity-tools/2.0/velocity-tools-2.0.jar>
[ERROR] urls[37] = <https://builds.apache.org/job/dir-shared-ubuntu-deploy/ws/.repository/commons-chain/commons-chain/1.1/commons-chain-1.1.jar>
[ERROR] urls[38] = <https://builds.apache.org/job/dir-shared-ubuntu-deploy/ws/.repository/dom4j/dom4j/1.1/dom4j-1.1.jar>
[ERROR] urls[39] = <https://builds.apache.org/job/dir-shared-ubuntu-deploy/ws/.repository/sslext/sslext/1.2-0/sslext-1.2-0.jar>
[ERROR] urls[40] = <https://builds.apache.org/job/dir-shared-ubuntu-deploy/ws/.repository/org/apache/struts/struts-core/1.3.8/struts-core-1.3.8.jar>
[ERROR] urls[41] = <https://builds.apache.org/job/dir-shared-ubuntu-deploy/ws/.repository/org/apache/struts/struts-taglib/1.3.8/struts-taglib-1.3.8.jar>
[ERROR] urls[42] = <https://builds.apache.org/job/dir-shared-ubuntu-deploy/ws/.repository/org/apache/struts/struts-tiles/1.3.8/struts-tiles-1.3.8.jar>
[ERROR] urls[43] = <https://builds.apache.org/job/dir-shared-ubuntu-deploy/ws/.repository/org/apache/maven/doxia/doxia-integration-tools/1.6/doxia-integration-tools-1.6.jar>
[ERROR] urls[44] = <https://builds.apache.org/job/dir-shared-ubuntu-deploy/ws/.repository/commons-io/commons-io/1.4/commons-io-1.4.jar>
[ERROR] urls[45] = <https://builds.apache.org/job/dir-shared-ubuntu-deploy/ws/.repository/org/codehaus/plexus/plexus-component-annotations/1.5.5/plexus-component-annotations-1.5.5.jar>
[ERROR] urls[46] = <https://builds.apache.org/job/dir-shared-ubuntu-deploy/ws/.repository/org/codehaus/plexus/plexus-resources/1.0.1/plexus-resources-1.0.1.jar>
[ERROR] urls[47] = <https://builds.apache.org/job/dir-shared-ubuntu-deploy/ws/.repository/org/codehaus/plexus/plexus-utils/3.0.20/plexus-utils-3.0.20.jar>
[ERROR] urls[48] = <https://builds.apache.org/job/dir-shared-ubuntu-deploy/ws/.repository/org/codehaus/plexus/plexus-interpolation/1.21/plexus-interpolation-1.21.jar>
[ERROR] urls[49] = <https://builds.apache.org/job/dir-shared-ubuntu-deploy/ws/.repository/org/codehaus/plexus/plexus-velocity/1.1.8/plexus-velocity-1.1.8.jar>
[ERROR] urls[50] = <https://builds.apache.org/job/dir-shared-ubuntu-deploy/ws/.repository/org/apache/velocity/velocity/1.5/velocity-1.5.jar>
[ERROR] urls[51] = <https://builds.apache.org/job/dir-shared-ubuntu-deploy/ws/.repository/commons-lang/commons-lang/2.1/commons-lang-2.1.jar>
[ERROR] urls[52] = <https://builds.apache.org/job/dir-shared-ubuntu-deploy/ws/.repository/oro/oro/2.0.8/oro-2.0.8.jar>
[ERROR] urls[53] = <https://builds.apache.org/job/dir-shared-ubuntu-deploy/ws/.repository/commons-collections/commons-collections/3.2.1/commons-collections-3.2.1.jar>
[ERROR] Number of foreign imports: 1
[ERROR] import: Entry[import  from realm ClassRealm[project>org.apache.directory.api:api-parent:1.0.0-RC3-SNAPSHOT,
parent: ClassRealm[maven.api, parent: null]]]
[ERROR] 
[ERROR] -----------------------------------------------------
[ERROR] -> [Help 1]
[ERROR] 
[ERROR] To see the full stack trace of the errors, re-run Maven with the -e switch.
[ERROR] Re-run Maven using the -X switch to enable full debug logging.
[ERROR] 
[ERROR] For more information about the errors and possible solutions, please read the following
articles:
[ERROR] [Help 1] http://cwiki.apache.org/confluence/display/MAVEN/PluginContainerException
[JENKINS] Archiving <https://builds.apache.org/job/dir-shared-ubuntu-deploy/ws/trunk/distribution/pom.xml>
to org.apache.directory.api/apache-ldap-api/1.0.0-RC3-SNAPSHOT/apache-ldap-api-1.0.0-RC3-SNAPSHOT.pom
[JENKINS] Archiving <https://builds.apache.org/job/dir-shared-ubuntu-deploy/ws/trunk/all/pom.xml>
to org.apache.directory.api/api-all/1.0.0-RC3-SNAPSHOT/api-all-1.0.0-RC3-SNAPSHOT.pom
[JENKINS] Archiving <https://builds.apache.org/job/dir-shared-ubuntu-deploy/ws/trunk/ldap/client/api/pom.xml>
to org.apache.directory.api/api-ldap-client-api/1.0.0-RC3-SNAPSHOT/api-ldap-client-api-1.0.0-RC3-SNAPSHOT.pom
[JENKINS] Archiving <https://builds.apache.org/job/dir-shared-ubuntu-deploy/ws/trunk/ldap/client/all/pom.xml>
to org.apache.directory.api/api-ldap-client-all/1.0.0-RC3-SNAPSHOT/api-ldap-client-all-1.0.0-RC3-SNAPSHOT.pom
[JENKINS] Archiving <https://builds.apache.org/job/dir-shared-ubuntu-deploy/ws/trunk/dsml/parser/pom.xml>
to org.apache.directory.api/api-dsml-parser/1.0.0-RC3-SNAPSHOT/api-dsml-parser-1.0.0-RC3-SNAPSHOT.pom
[JENKINS] Archiving <https://builds.apache.org/job/dir-shared-ubuntu-deploy/ws/trunk/util/pom.xml>
to org.apache.directory.api/api-util/1.0.0-RC3-SNAPSHOT/api-util-1.0.0-RC3-SNAPSHOT.pom
[JENKINS] Archiving <https://builds.apache.org/job/dir-shared-ubuntu-deploy/ws/trunk/ldap/extras/codec-api/pom.xml>
to org.apache.directory.api/api-ldap-extras-codec-api/1.0.0-RC3-SNAPSHOT/api-ldap-extras-codec-api-1.0.0-RC3-SNAPSHOT.pom
[JENKINS] Archiving <https://builds.apache.org/job/dir-shared-ubuntu-deploy/ws/trunk/pom.xml>
to org.apache.directory.api/api-parent/1.0.0-RC3-SNAPSHOT/api-parent-1.0.0-RC3-SNAPSHOT.pom
[JENKINS] Archiving <https://builds.apache.org/job/dir-shared-ubuntu-deploy/ws/trunk/ldap/schema/pom.xml>
to org.apache.directory.api/api-ldap-schema-parent/1.0.0-RC3-SNAPSHOT/api-ldap-schema-parent-1.0.0-RC3-SNAPSHOT.pom
[JENKINS] Archiving <https://builds.apache.org/job/dir-shared-ubuntu-deploy/ws/trunk/ldap/pom.xml>
to org.apache.directory.api/api-ldap-parent/1.0.0-RC3-SNAPSHOT/api-ldap-parent-1.0.0-RC3-SNAPSHOT.pom
[JENKINS] Archiving <https://builds.apache.org/job/dir-shared-ubuntu-deploy/ws/trunk/ldap/model/pom.xml>
to org.apache.directory.api/api-ldap-model/1.0.0-RC3-SNAPSHOT/api-ldap-model-1.0.0-RC3-SNAPSHOT.pom
[JENKINS] Archiving <https://builds.apache.org/job/dir-shared-ubuntu-deploy/ws/trunk/integ/pom.xml>
to org.apache.directory.api/api-integ/1.0.0-RC3-SNAPSHOT/api-integ-1.0.0-RC3-SNAPSHOT.pom
[JENKINS] Archiving <https://builds.apache.org/job/dir-shared-ubuntu-deploy/ws/trunk/ldap/extras/codec/pom.xml>
to org.apache.directory.api/api-ldap-extras-codec/1.0.0-RC3-SNAPSHOT/api-ldap-extras-codec-1.0.0-RC3-SNAPSHOT.pom
[JENKINS] Archiving <https://builds.apache.org/job/dir-shared-ubuntu-deploy/ws/trunk/asn1/pom.xml>
to org.apache.directory.api/api-asn1-parent/1.0.0-RC3-SNAPSHOT/api-asn1-parent-1.0.0-RC3-SNAPSHOT.pom
[JENKINS] Archiving <https://builds.apache.org/job/dir-shared-ubuntu-deploy/ws/trunk/ldap/schema/data/pom.xml>
to org.apache.directory.api/api-ldap-schema-data/1.0.0-RC3-SNAPSHOT/api-ldap-schema-data-1.0.0-RC3-SNAPSHOT.pom
[JENKINS] Archiving <https://builds.apache.org/job/dir-shared-ubuntu-deploy/ws/trunk/dsml/engine/pom.xml>
to org.apache.directory.api/api-dsml-engine/1.0.0-RC3-SNAPSHOT/api-dsml-engine-1.0.0-RC3-SNAPSHOT.pom
[JENKINS] Archiving <https://builds.apache.org/job/dir-shared-ubuntu-deploy/ws/trunk/ldap/extras/sp/pom.xml>
to org.apache.directory.api/api-ldap-extras-sp/1.0.0-RC3-SNAPSHOT/api-ldap-extras-sp-1.0.0-RC3-SNAPSHOT.pom
[JENKINS] Archiving <https://builds.apache.org/job/dir-shared-ubuntu-deploy/ws/trunk/dsml/pom.xml>
to org.apache.directory.api/api-dsml-parent/1.0.0-RC3-SNAPSHOT/api-dsml-parent-1.0.0-RC3-SNAPSHOT.pom
[JENKINS] Archiving <https://builds.apache.org/job/dir-shared-ubuntu-deploy/ws/trunk/integ-osgi/pom.xml>
to org.apache.directory.api/api-integ-osgi/1.0.0-RC3-SNAPSHOT/api-integ-osgi-1.0.0-RC3-SNAPSHOT.pom
[JENKINS] Archiving <https://builds.apache.org/job/dir-shared-ubuntu-deploy/ws/trunk/asn1/api/pom.xml>
to org.apache.directory.api/api-asn1-api/1.0.0-RC3-SNAPSHOT/api-asn1-api-1.0.0-RC3-SNAPSHOT.pom
[JENKINS] Archiving <https://builds.apache.org/job/dir-shared-ubuntu-deploy/ws/trunk/ldap/net/mina/pom.xml>
to org.apache.directory.api/api-ldap-net-mina/1.0.0-RC3-SNAPSHOT/api-ldap-net-mina-1.0.0-RC3-SNAPSHOT.pom
[JENKINS] Archiving <https://builds.apache.org/job/dir-shared-ubuntu-deploy/ws/trunk/ldap/codec/pom.xml>
to org.apache.directory.api/api-ldap-codec-parent/1.0.0-RC3-SNAPSHOT/api-ldap-codec-parent-1.0.0-RC3-SNAPSHOT.pom
[JENKINS] Archiving <https://builds.apache.org/job/dir-shared-ubuntu-deploy/ws/trunk/ldap/net/pom.xml>
to org.apache.directory.api/api-ldap-net-parent/1.0.0-RC3-SNAPSHOT/api-ldap-net-parent-1.0.0-RC3-SNAPSHOT.pom
[JENKINS] Archiving <https://builds.apache.org/job/dir-shared-ubuntu-deploy/ws/trunk/ldap/schema/converter/pom.xml>
to org.apache.directory.api/api-ldap-schema-converter/1.0.0-RC3-SNAPSHOT/api-ldap-schema-converter-1.0.0-RC3-SNAPSHOT.pom
[JENKINS] Archiving <https://builds.apache.org/job/dir-shared-ubuntu-deploy/ws/trunk/ldap/client/pom.xml>
to org.apache.directory.api/api-ldap-client-parent/1.0.0-RC3-SNAPSHOT/api-ldap-client-parent-1.0.0-RC3-SNAPSHOT.pom
[JENKINS] Archiving <https://builds.apache.org/job/dir-shared-ubuntu-deploy/ws/trunk/asn1/ber/pom.xml>
to org.apache.directory.api/api-asn1-ber/1.0.0-RC3-SNAPSHOT/api-asn1-ber-1.0.0-RC3-SNAPSHOT.pom
[JENKINS] Archiving <https://builds.apache.org/job/dir-shared-ubuntu-deploy/ws/trunk/ldap/extras/pom.xml>
to org.apache.directory.api/api-ldap-extras-parent/1.0.0-RC3-SNAPSHOT/api-ldap-extras-parent-1.0.0-RC3-SNAPSHOT.pom
[JENKINS] Archiving <https://builds.apache.org/job/dir-shared-ubuntu-deploy/ws/trunk/ldap/extras/util/pom.xml>
to org.apache.directory.api/api-ldap-extras-util/1.0.0-RC3-SNAPSHOT/api-ldap-extras-util-1.0.0-RC3-SNAPSHOT.pom
[JENKINS] Archiving <https://builds.apache.org/job/dir-shared-ubuntu-deploy/ws/trunk/ldap/codec/core/pom.xml>
to org.apache.directory.api/api-ldap-codec-core/1.0.0-RC3-SNAPSHOT/api-ldap-codec-core-1.0.0-RC3-SNAPSHOT.pom
[JENKINS] Archiving <https://builds.apache.org/job/dir-shared-ubuntu-deploy/ws/trunk/ldap/codec/standalone/pom.xml>
to org.apache.directory.api/api-ldap-codec-standalone/1.0.0-RC3-SNAPSHOT/api-ldap-codec-standalone-1.0.0-RC3-SNAPSHOT.pom
[JENKINS] Archiving <https://builds.apache.org/job/dir-shared-ubuntu-deploy/ws/trunk/ldap/extras/trigger/pom.xml>
to org.apache.directory.api/api-ldap-extras-trigger/1.0.0-RC3-SNAPSHOT/api-ldap-extras-trigger-1.0.0-RC3-SNAPSHOT.pom
[JENKINS] Archiving <https://builds.apache.org/job/dir-shared-ubuntu-deploy/ws/trunk/i18n/pom.xml>
to org.apache.directory.api/api-i18n/1.0.0-RC3-SNAPSHOT/api-i18n-1.0.0-RC3-SNAPSHOT.pom
[JENKINS] Archiving <https://builds.apache.org/job/dir-shared-ubuntu-deploy/ws/trunk/ldap/extras/aci/pom.xml>
to org.apache.directory.api/api-ldap-extras-aci/1.0.0-RC3-SNAPSHOT/api-ldap-extras-aci-1.0.0-RC3-SNAPSHOT.pom
Sending e-mails to: notifications@directory.apache.org
channel stopped

Mime
View raw message