directory-notifications mailing list archives

Site index · List index
Message view « Date » · « Thread »
Top « Date » · « Thread »
Subject Build failed in Jenkins: directory-fortress-enmasse #482
Date Fri, 04 Nov 2016 16:21:55 GMT
See <>

Started by upstream project "maven-plugins" build number 963
originally caused by:
 Started by an SCM change
Building in workspace <>
Checkout:workspace / <>
- hudson.remoting.LocalChannel@234a51b7
Using strategy: Default
Last Built Revision: Revision 12d6e9975a3a669dd6deada41684bd8ad0f22fbc (origin/master, origin/HEAD)
Fetching changes from 1 remote Git repository
Fetching upstream changes from origin
Seen branch in repository origin/1.0-RC41
Seen branch in repository origin/HEAD
Seen branch in repository origin/master
Seen 3 remote branches
Commencing build of Revision 12d6e9975a3a669dd6deada41684bd8ad0f22fbc (origin/master, origin/HEAD)
Checking out Revision 12d6e9975a3a669dd6deada41684bd8ad0f22fbc (origin/master, origin/HEAD)
Warning : There are multiple branch changesets here
Parsing POMs
[workspace] $ /x1/jenkins/jenkins-master/jenkins-home/tools/hudson.model.JDK/jdk1.7.0_65/bin/java
-Xms256m -Xmx512m -XX:+UseCompressedOops -XX:MaxPermSize=256m -cp /x1/jenkins/jenkins-master/jenkins-home/plugins/maven-plugin/WEB-INF/lib/maven3-agent-1.6.jar:/x1/jenkins/jenkins-master/jenkins-home/tools/hudson.tasks.Maven_MavenInstallation/maven-3.0.5/boot/plexus-classworlds-2.4.jar
org.jvnet.hudson.maven3.agent.Maven3Main /x1/jenkins/jenkins-master/jenkins-home/tools/hudson.tasks.Maven_MavenInstallation/maven-3.0.5
/x1/jenkins/jenkins-master/catalina-base/webapps/jenkins/WEB-INF/lib/remoting-2.36.jar /x1/jenkins/jenkins-master/jenkins-home/plugins/maven-plugin/WEB-INF/lib/maven3-interceptor-1.6.jar
<===[JENKINS REMOTING CAPACITY]===>   channel started
log4j:WARN No appenders could be found for logger (org.apache.commons.beanutils.converters.BooleanConverter).
log4j:WARN Please initialize the log4j system properly.
Executing Maven:  -B -f <>
clean install -U -DskipTests -fae
[INFO] Scanning for projects...
[WARNING] Some problems were encountered while building the effective model for
[WARNING] 'build.plugins.plugin.version' for org.codehaus.mojo:tomcat-maven-plugin is missing.
@ line 280, column 15
[WARNING] 'reporting.plugins.plugin.version' for org.apache.maven.plugins:maven-javadoc-plugin
is missing. @ line 405, column 15
[WARNING] It is highly recommended to fix these problems because they threaten the stability
of your build.
[WARNING] For this reason, future Maven versions might no longer support building such malformed
[INFO] ------------------------------------------------------------------------
[INFO] Building Apache Fortress Rest 2.0.0-RC2-SNAPSHOT
[INFO] ------------------------------------------------------------------------
(439 B at 1.1 KB/sec)
[WARNING] The POM for is missing,
no dependency information available
[INFO] ------------------------------------------------------------------------
[INFO] ------------------------------------------------------------------------
[INFO] Total time: 10.587s
[INFO] Finished at: Fri Nov 04 16:21:54 UTC 2016
[INFO] Final Memory: 13M/246M
[INFO] ------------------------------------------------------------------------
Waiting for Jenkins to finish collecting data
[ERROR] Failed to execute goal on project fortress-rest: Could not resolve dependencies for
project Could not find
artifact in maven2 (
-> [Help 1]
[ERROR] To see the full stack trace of the errors, re-run Maven with the -e switch.
[ERROR] Re-run Maven using the -X switch to enable full debug logging.
[ERROR] For more information about the errors and possible solutions, please read the following
[ERROR] [Help 1]
[JENKINS] Archiving <>
Sending e-mails to:
channel stopped
Skipping sonar analysis due to bad build status FAILURE

View raw message