directory-notifications mailing list archives

Site index · List index
Message view « Date » · « Thread »
Top « Date » · « Thread »
From pct...@apache.org
Subject Build failed in Jenkins: directory-fortress-enmasse #365
Date Sat, 01 Oct 2016 16:33:37 GMT
See <https://analysis.apache.org/jenkins/job/directory-fortress-enmasse/365/>

------------------------------------------
Started by upstream project "maven-plugins" build number 941
originally caused by:
 Started by an SCM change
Building in workspace <https://analysis.apache.org/jenkins/job/directory-fortress-enmasse/ws/>
Checkout:workspace / <https://analysis.apache.org/jenkins/job/directory-fortress-enmasse/ws/>
- hudson.remoting.LocalChannel@711aef7d
Using strategy: Default
Last Built Revision: Revision d825f1d411d1ab761e96fde62716b6cc6778c70c (origin/master, origin/HEAD)
Fetching changes from 1 remote Git repository
Fetching upstream changes from origin
Seen branch in repository origin/1.0-RC41
Seen branch in repository origin/HEAD
Seen branch in repository origin/master
Seen 3 remote branches
Commencing build of Revision d825f1d411d1ab761e96fde62716b6cc6778c70c (origin/master, origin/HEAD)
Checking out Revision d825f1d411d1ab761e96fde62716b6cc6778c70c (origin/master, origin/HEAD)
Warning : There are multiple branch changesets here
Parsing POMs
[workspace] $ /x1/jenkins/jenkins-master/jenkins-home/tools/hudson.model.JDK/jdk1.7.0_65/bin/java
-Xms256m -Xmx512m -XX:+UseCompressedOops -XX:MaxPermSize=256m -cp /x1/jenkins/jenkins-master/jenkins-home/plugins/maven-plugin/WEB-INF/lib/maven3-agent-1.6.jar:/x1/jenkins/jenkins-master/jenkins-home/tools/hudson.tasks.Maven_MavenInstallation/maven-3.0.5/boot/plexus-classworlds-2.4.jar
org.jvnet.hudson.maven3.agent.Maven3Main /x1/jenkins/jenkins-master/jenkins-home/tools/hudson.tasks.Maven_MavenInstallation/maven-3.0.5
/x1/jenkins/jenkins-master/catalina-base/webapps/jenkins/WEB-INF/lib/remoting-2.36.jar /x1/jenkins/jenkins-master/jenkins-home/plugins/maven-plugin/WEB-INF/lib/maven3-interceptor-1.6.jar
/x1/jenkins/jenkins-master/jenkins-home/plugins/maven-plugin/WEB-INF/lib/maven3-interceptor-commons-1.6.jar
52364
<===[JENKINS REMOTING CAPACITY]===>   channel started
log4j:WARN No appenders could be found for logger (org.apache.commons.beanutils.converters.BooleanConverter).
log4j:WARN Please initialize the log4j system properly.
Executing Maven:  -B -f <https://analysis.apache.org/jenkins/job/directory-fortress-enmasse/ws/pom.xml>
clean install -U -DskipTests -fae
[INFO] Scanning for projects...
[WARNING] 
[WARNING] Some problems were encountered while building the effective model for org.apache.directory.fortress:fortress-rest:war:1.0.2-SNAPSHOT
[WARNING] 'build.plugins.plugin.version' for org.codehaus.mojo:tomcat-maven-plugin is missing.
@ line 280, column 15
[WARNING] 'reporting.plugins.plugin.version' for org.apache.maven.plugins:maven-javadoc-plugin
is missing. @ line 405, column 15
[WARNING] 
[WARNING] It is highly recommended to fix these problems because they threaten the stability
of your build.
[WARNING] 
[WARNING] For this reason, future Maven versions might no longer support building such malformed
projects.
[WARNING] 
[INFO]                                                                         
[INFO] ------------------------------------------------------------------------
[INFO] Building Apache Fortress Rest 1.0.2-SNAPSHOT
[INFO] ------------------------------------------------------------------------
Downloading: http://repo.maven.apache.org/maven2/org/codehaus/mojo/tomcat-maven-plugin/maven-metadata.xml
Downloaded: http://repo.maven.apache.org/maven2/org/codehaus/mojo/tomcat-maven-plugin/maven-metadata.xml
(439 B at 1.4 KB/sec)
Downloading: http://repository.apache.org/snapshots/org/apache/directory/fortress/fortress-realm-impl/1.0.2-SNAPSHOT/maven-metadata.xml
Downloading: http://repo1.maven.org/maven2/org/apache/directory/fortress/fortress-realm-impl/1.0.2-SNAPSHOT/maven-metadata.xml
Downloading: http://repo1.maven.org/maven2/org/apache/directory/fortress/fortress-realm/1.0.2-SNAPSHOT/maven-metadata.xml
Downloading: http://repository.apache.org/snapshots/org/apache/directory/fortress/fortress-realm/1.0.2-SNAPSHOT/maven-metadata.xml
[INFO] 
[INFO] --- maven-clean-plugin:2.6.1:clean (default-clean) @ fortress-rest ---
[INFO] Deleting <https://analysis.apache.org/jenkins/job/directory-fortress-enmasse/ws/target>
[INFO] 
[INFO] --- maven-remote-resources-plugin:1.5:process (default) @ fortress-rest ---
[INFO] 
[INFO] --- maven-resources-plugin:2.7:resources (default-resources) @ fortress-rest ---
[INFO] Using 'UTF-8' encoding to copy filtered resources.
[INFO] Copying 6 resources
[INFO] Copying 3 resources
[INFO] 
[INFO] --- maven-compiler-plugin:3.3:compile (default-compile) @ fortress-rest ---
[INFO] Changes detected - recompiling the module!
[INFO] Compiling 15 source files to <https://analysis.apache.org/jenkins/job/directory-fortress-enmasse/ws/target/classes>
[INFO] -------------------------------------------------------------
[ERROR] COMPILATION ERROR : 
[INFO] -------------------------------------------------------------
[ERROR] <https://analysis.apache.org/jenkins/job/directory-fortress-enmasse/ws/src/main/java/org/apache/directory/fortress/rest/FortressServiceImpl.java>:[1018,24]
cannot find symbol
  symbol:   variable RBAC_CREATE_GROUP_SESSION
  location: class org.apache.directory.fortress.core.rest.HttpIds
[ERROR] <https://analysis.apache.org/jenkins/job/directory-fortress-enmasse/ws/src/main/java/org/apache/directory/fortress/rest/FortressServiceImpl.java>:[1807,24]
cannot find symbol
  symbol:   variable GROUP_READ
  location: class org.apache.directory.fortress.core.rest.HttpIds
[ERROR] <https://analysis.apache.org/jenkins/job/directory-fortress-enmasse/ws/src/main/java/org/apache/directory/fortress/rest/FortressServiceImpl.java>:[1819,24]
cannot find symbol
  symbol:   variable GROUP_ADD
  location: class org.apache.directory.fortress.core.rest.HttpIds
[ERROR] <https://analysis.apache.org/jenkins/job/directory-fortress-enmasse/ws/src/main/java/org/apache/directory/fortress/rest/FortressServiceImpl.java>:[1832,24]
cannot find symbol
  symbol:   variable GROUP_DELETE
  location: class org.apache.directory.fortress.core.rest.HttpIds
[ERROR] <https://analysis.apache.org/jenkins/job/directory-fortress-enmasse/ws/src/main/java/org/apache/directory/fortress/rest/FortressServiceImpl.java>:[1845,24]
cannot find symbol
  symbol:   variable GROUP_UPDATE
  location: class org.apache.directory.fortress.core.rest.HttpIds
[ERROR] <https://analysis.apache.org/jenkins/job/directory-fortress-enmasse/ws/src/main/java/org/apache/directory/fortress/rest/FortressServiceImpl.java>:[1857,24]
cannot find symbol
  symbol:   variable GROUP_ROLE_ASGNED
  location: class org.apache.directory.fortress.core.rest.HttpIds
[ERROR] <https://analysis.apache.org/jenkins/job/directory-fortress-enmasse/ws/src/main/java/org/apache/directory/fortress/rest/FortressServiceImpl.java>:[1869,24]
cannot find symbol
  symbol:   variable GROUP_ASGNED
  location: class org.apache.directory.fortress.core.rest.HttpIds
[ERROR] <https://analysis.apache.org/jenkins/job/directory-fortress-enmasse/ws/src/main/java/org/apache/directory/fortress/rest/FortressServiceImpl.java>:[1881,24]
cannot find symbol
  symbol:   variable GROUP_ROLE_ASGN
  location: class org.apache.directory.fortress.core.rest.HttpIds
[ERROR] <https://analysis.apache.org/jenkins/job/directory-fortress-enmasse/ws/src/main/java/org/apache/directory/fortress/rest/FortressServiceImpl.java>:[1893,24]
cannot find symbol
  symbol:   variable GROUP_ROLE_DEASGN
  location: class org.apache.directory.fortress.core.rest.HttpIds
[ERROR] <https://analysis.apache.org/jenkins/job/directory-fortress-enmasse/ws/src/main/java/org/apache/directory/fortress/rest/AccessMgrImpl.java>:[111,43]
method createSession in interface org.apache.directory.fortress.core.AccessMgr cannot be applied
to given types;
  required: org.apache.directory.fortress.core.model.User,boolean
  found: org.apache.directory.fortress.core.model.Group
  reason: actual and formal argument lists differ in length
[ERROR] <https://analysis.apache.org/jenkins/job/directory-fortress-enmasse/ws/src/main/java/org/apache/directory/fortress/rest/GroupMgrImpl.java>:[135,42]
cannot find symbol
  symbol:   method roleGroups(org.apache.directory.fortress.core.model.Role)
  location: variable groupMgr of type org.apache.directory.fortress.core.GroupMgr
[ERROR] <https://analysis.apache.org/jenkins/job/directory-fortress-enmasse/ws/src/main/java/org/apache/directory/fortress/rest/GroupMgrImpl.java>:[170,49]
cannot find symbol
  symbol:   method groupRoles(org.apache.directory.fortress.core.model.Group)
  location: variable groupMgr of type org.apache.directory.fortress.core.GroupMgr
[INFO] 12 errors 
[INFO] -------------------------------------------------------------
[INFO] ------------------------------------------------------------------------
[INFO] BUILD FAILURE
[INFO] ------------------------------------------------------------------------
[INFO] Total time: 49.913s
[INFO] Finished at: Sat Oct 01 16:33:36 UTC 2016
[INFO] Final Memory: 24M/314M
[INFO] ------------------------------------------------------------------------
Waiting for Jenkins to finish collecting data
[ERROR] Failed to execute goal org.apache.maven.plugins:maven-compiler-plugin:3.3:compile
(default-compile) on project fortress-rest: Compilation failure: Compilation failure:
[ERROR] <https://analysis.apache.org/jenkins/job/directory-fortress-enmasse/ws/src/main/java/org/apache/directory/fortress/rest/FortressServiceImpl.java>:[1018,24]
cannot find symbol
[ERROR] symbol:   variable RBAC_CREATE_GROUP_SESSION
[ERROR] location: class org.apache.directory.fortress.core.rest.HttpIds
[ERROR] <https://analysis.apache.org/jenkins/job/directory-fortress-enmasse/ws/src/main/java/org/apache/directory/fortress/rest/FortressServiceImpl.java>:[1807,24]
cannot find symbol
[ERROR] symbol:   variable GROUP_READ
[ERROR] location: class org.apache.directory.fortress.core.rest.HttpIds
[ERROR] <https://analysis.apache.org/jenkins/job/directory-fortress-enmasse/ws/src/main/java/org/apache/directory/fortress/rest/FortressServiceImpl.java>:[1819,24]
cannot find symbol
[ERROR] symbol:   variable GROUP_ADD
[ERROR] location: class org.apache.directory.fortress.core.rest.HttpIds
[ERROR] <https://analysis.apache.org/jenkins/job/directory-fortress-enmasse/ws/src/main/java/org/apache/directory/fortress/rest/FortressServiceImpl.java>:[1832,24]
cannot find symbol
[ERROR] symbol:   variable GROUP_DELETE
[ERROR] location: class org.apache.directory.fortress.core.rest.HttpIds
[ERROR] <https://analysis.apache.org/jenkins/job/directory-fortress-enmasse/ws/src/main/java/org/apache/directory/fortress/rest/FortressServiceImpl.java>:[1845,24]
cannot find symbol
[ERROR] symbol:   variable GROUP_UPDATE
[ERROR] location: class org.apache.directory.fortress.core.rest.HttpIds
[ERROR] <https://analysis.apache.org/jenkins/job/directory-fortress-enmasse/ws/src/main/java/org/apache/directory/fortress/rest/FortressServiceImpl.java>:[1857,24]
cannot find symbol
[ERROR] symbol:   variable GROUP_ROLE_ASGNED
[ERROR] location: class org.apache.directory.fortress.core.rest.HttpIds
[ERROR] <https://analysis.apache.org/jenkins/job/directory-fortress-enmasse/ws/src/main/java/org/apache/directory/fortress/rest/FortressServiceImpl.java>:[1869,24]
cannot find symbol
[ERROR] symbol:   variable GROUP_ASGNED
[ERROR] location: class org.apache.directory.fortress.core.rest.HttpIds
[ERROR] <https://analysis.apache.org/jenkins/job/directory-fortress-enmasse/ws/src/main/java/org/apache/directory/fortress/rest/FortressServiceImpl.java>:[1881,24]
cannot find symbol
[ERROR] symbol:   variable GROUP_ROLE_ASGN
[JENKINS] Archiving <https://analysis.apache.org/jenkins/job/directory-fortress-enmasse/ws/pom.xml>
to org.apache.directory.fortress/fortress-rest/1.0.2-SNAPSHOT/fortress-rest-1.0.2-SNAPSHOT.pom
[ERROR] location: class org.apache.directory.fortress.core.rest.HttpIds
[ERROR] <https://analysis.apache.org/jenkins/job/directory-fortress-enmasse/ws/src/main/java/org/apache/directory/fortress/rest/FortressServiceImpl.java>:[1893,24]
cannot find symbol
[ERROR] symbol:   variable GROUP_ROLE_DEASGN
[ERROR] location: class org.apache.directory.fortress.core.rest.HttpIds
[ERROR] <https://analysis.apache.org/jenkins/job/directory-fortress-enmasse/ws/src/main/java/org/apache/directory/fortress/rest/AccessMgrImpl.java>:[111,43]
method createSession in interface org.apache.directory.fortress.core.AccessMgr cannot be applied
to given types;
[ERROR] required: org.apache.directory.fortress.core.model.User,boolean
[ERROR] found: org.apache.directory.fortress.core.model.Group
[ERROR] reason: actual and formal argument lists differ in length
[ERROR] <https://analysis.apache.org/jenkins/job/directory-fortress-enmasse/ws/src/main/java/org/apache/directory/fortress/rest/GroupMgrImpl.java>:[135,42]
cannot find symbol
[ERROR] symbol:   method roleGroups(org.apache.directory.fortress.core.model.Role)
[ERROR] location: variable groupMgr of type org.apache.directory.fortress.core.GroupMgr
[ERROR] <https://analysis.apache.org/jenkins/job/directory-fortress-enmasse/ws/src/main/java/org/apache/directory/fortress/rest/GroupMgrImpl.java>:[170,49]
cannot find symbol
[ERROR] symbol:   method groupRoles(org.apache.directory.fortress.core.model.Group)
[ERROR] location: variable groupMgr of type org.apache.directory.fortress.core.GroupMgr
[ERROR] -> [Help 1]
[ERROR] 
[ERROR] To see the full stack trace of the errors, re-run Maven with the -e switch.
[ERROR] Re-run Maven using the -X switch to enable full debug logging.
[ERROR] 
[ERROR] For more information about the errors and possible solutions, please read the following
articles:
[ERROR] [Help 1] http://cwiki.apache.org/confluence/display/MAVEN/MojoFailureException
Sending e-mails to: notifications@directory.apache.org
channel stopped
Skipping sonar analysis due to bad build status FAILURE

Mime
View raw message