directory-notifications mailing list archives

Site index · List index
Message view « Date » · « Thread »
Top « Date » · « Thread »
From pct...@apache.org
Subject Build failed in Jenkins: directory-kerby #152
Date Mon, 05 Sep 2016 06:26:34 GMT
See <https://analysis.apache.org/jenkins/job/directory-kerby/152/>

------------------------------------------
[...truncated 2271 lines...]
[JENKINS] Archiving <https://analysis.apache.org/jenkins/job/directory-kerby/ws/kerby-kerb/kerb-identity-test/target/kerb-identity-test-1.0.0-RC3-SNAPSHOT-sources.jar>
to org.apache.kerby/kerb-identity-test/1.0.0-RC3-SNAPSHOT/kerb-identity-test-1.0.0-RC3-SNAPSHOT-sources.jar
[JENKINS] Archiving <https://analysis.apache.org/jenkins/job/directory-kerby/ws/kerby-backend/json-backend/pom.xml>
to org.apache.kerby/json-backend/1.0.0-RC3-SNAPSHOT/json-backend-1.0.0-RC3-SNAPSHOT.pom
[JENKINS] Archiving <https://analysis.apache.org/jenkins/job/directory-kerby/ws/kerby-backend/json-backend/target/json-backend-1.0.0-RC3-SNAPSHOT.jar>
to org.apache.kerby/json-backend/1.0.0-RC3-SNAPSHOT/json-backend-1.0.0-RC3-SNAPSHOT.jar
[JENKINS] Archiving <https://analysis.apache.org/jenkins/job/directory-kerby/ws/kerby-backend/json-backend/target/json-backend-1.0.0-RC3-SNAPSHOT-sources.jar>
to org.apache.kerby/json-backend/1.0.0-RC3-SNAPSHOT/json-backend-1.0.0-RC3-SNAPSHOT-sources.jar
[JENKINS] Archiving <https://analysis.apache.org/jenkins/job/directory-kerby/ws/kerby-kerb/kerb-client-api-all/pom.xml>
to org.apache.kerby/kerb-client-api-all/1.0.0-RC3-SNAPSHOT/kerb-client-api-all-1.0.0-RC3-SNAPSHOT.pom
[JENKINS] Archiving <https://analysis.apache.org/jenkins/job/directory-kerby/ws/kerby-kerb/kerb-client-api-all/target/kerb-client-api-all-1.0.0-RC3-SNAPSHOT.jar>
to org.apache.kerby/kerb-client-api-all/1.0.0-RC3-SNAPSHOT/kerb-client-api-all-1.0.0-RC3-SNAPSHOT.jar
[JENKINS] Archiving <https://analysis.apache.org/jenkins/job/directory-kerby/ws/kerby-kerb/kerb-client-api-all/target/kerb-client-api-all-1.0.0-RC3-SNAPSHOT-sources.jar>
to org.apache.kerby/kerb-client-api-all/1.0.0-RC3-SNAPSHOT/kerb-client-api-all-1.0.0-RC3-SNAPSHOT-sources.jar
[JENKINS] Archiving <https://analysis.apache.org/jenkins/job/directory-kerby/ws/kerby-tool/client-tool/pom.xml>
to org.apache.kerby/client-tool/1.0.0-RC3-SNAPSHOT/client-tool-1.0.0-RC3-SNAPSHOT.pom
[JENKINS] Archiving <https://analysis.apache.org/jenkins/job/directory-kerby/ws/kerby-tool/client-tool/target/client-tool-1.0.0-RC3-SNAPSHOT.jar>
to org.apache.kerby/client-tool/1.0.0-RC3-SNAPSHOT/client-tool-1.0.0-RC3-SNAPSHOT.jar
[JENKINS] Archiving <https://analysis.apache.org/jenkins/job/directory-kerby/ws/kerby-tool/client-tool/target/client-tool-1.0.0-RC3-SNAPSHOT-sources.jar>
to org.apache.kerby/client-tool/1.0.0-RC3-SNAPSHOT/client-tool-1.0.0-RC3-SNAPSHOT-sources.jar
[JENKINS] Archiving <https://analysis.apache.org/jenkins/job/directory-kerby/ws/kerby-dist/pom.xml>
to org.apache.kerby/kerby-dist/1.0.0-RC3-SNAPSHOT/kerby-dist-1.0.0-RC3-SNAPSHOT.pom
[JENKINS] Archiving <https://analysis.apache.org/jenkins/job/directory-kerby/ws/kerby-backend/zookeeper-backend/pom.xml>
to org.apache.kerby/zookeeper-backend/1.0.0-RC3-SNAPSHOT/zookeeper-backend-1.0.0-RC3-SNAPSHOT.pom
[JENKINS] Archiving <https://analysis.apache.org/jenkins/job/directory-kerby/ws/kerby-backend/zookeeper-backend/target/zookeeper-backend-1.0.0-RC3-SNAPSHOT.jar>
to org.apache.kerby/zookeeper-backend/1.0.0-RC3-SNAPSHOT/zookeeper-backend-1.0.0-RC3-SNAPSHOT.jar
[JENKINS] Archiving <https://analysis.apache.org/jenkins/job/directory-kerby/ws/kerby-backend/zookeeper-backend/target/zookeeper-backend-1.0.0-RC3-SNAPSHOT-sources.jar>
to org.apache.kerby/zookeeper-backend/1.0.0-RC3-SNAPSHOT/zookeeper-backend-1.0.0-RC3-SNAPSHOT-sources.jar
[JENKINS] Archiving <https://analysis.apache.org/jenkins/job/directory-kerby/ws/kerby-kerb/kerb-client/pom.xml>
to org.apache.kerby/kerb-client/1.0.0-RC3-SNAPSHOT/kerb-client-1.0.0-RC3-SNAPSHOT.pom
[JENKINS] Archiving <https://analysis.apache.org/jenkins/job/directory-kerby/ws/kerby-kerb/kerb-client/target/kerb-client-1.0.0-RC3-SNAPSHOT.jar>
to org.apache.kerby/kerb-client/1.0.0-RC3-SNAPSHOT/kerb-client-1.0.0-RC3-SNAPSHOT.jar
[JENKINS] Archiving <https://analysis.apache.org/jenkins/job/directory-kerby/ws/kerby-kerb/kerb-client/target/kerb-client-1.0.0-RC3-SNAPSHOT-sources.jar>
to org.apache.kerby/kerb-client/1.0.0-RC3-SNAPSHOT/kerb-client-1.0.0-RC3-SNAPSHOT-sources.jar
[JENKINS] Archiving <https://analysis.apache.org/jenkins/job/directory-kerby/ws/kerby-common/pom.xml>
to org.apache.kerby/kerby-common/1.0.0-RC3-SNAPSHOT/kerby-common-1.0.0-RC3-SNAPSHOT.pom
[JENKINS] Archiving <https://analysis.apache.org/jenkins/job/directory-kerby/ws/kerby-backend/mavibot-backend/pom.xml>
to org.apache.kerby/mavibot-backend/1.0.0-RC3-SNAPSHOT/mavibot-backend-1.0.0-RC3-SNAPSHOT.pom
[JENKINS] Archiving <https://analysis.apache.org/jenkins/job/directory-kerby/ws/kerby-backend/mavibot-backend/target/mavibot-backend-1.0.0-RC3-SNAPSHOT.jar>
to org.apache.kerby/mavibot-backend/1.0.0-RC3-SNAPSHOT/mavibot-backend-1.0.0-RC3-SNAPSHOT.jar
[JENKINS] Archiving <https://analysis.apache.org/jenkins/job/directory-kerby/ws/kerby-backend/mavibot-backend/target/mavibot-backend-1.0.0-RC3-SNAPSHOT-sources.jar>
to org.apache.kerby/mavibot-backend/1.0.0-RC3-SNAPSHOT/mavibot-backend-1.0.0-RC3-SNAPSHOT-sources.jar
[JENKINS] Archiving <https://analysis.apache.org/jenkins/job/directory-kerby/ws/kerby-common/kerby-util/pom.xml>
to org.apache.kerby/kerby-util/1.0.0-RC3-SNAPSHOT/kerby-util-1.0.0-RC3-SNAPSHOT.pom
[JENKINS] Archiving <https://analysis.apache.org/jenkins/job/directory-kerby/ws/kerby-common/kerby-util/target/kerby-util-1.0.0-RC3-SNAPSHOT.jar>
to org.apache.kerby/kerby-util/1.0.0-RC3-SNAPSHOT/kerby-util-1.0.0-RC3-SNAPSHOT.jar
[JENKINS] Archiving <https://analysis.apache.org/jenkins/job/directory-kerby/ws/kerby-common/kerby-util/target/kerby-util-1.0.0-RC3-SNAPSHOT-sources.jar>
to org.apache.kerby/kerby-util/1.0.0-RC3-SNAPSHOT/kerby-util-1.0.0-RC3-SNAPSHOT-sources.jar
[JENKINS] Archiving <https://analysis.apache.org/jenkins/job/directory-kerby/ws/kerby-kerb/integration-test/pom.xml>
to org.apache.kerby/integration-test/1.0.0-RC3-SNAPSHOT/integration-test-1.0.0-RC3-SNAPSHOT.pom
[JENKINS] Archiving <https://analysis.apache.org/jenkins/job/directory-kerby/ws/kerby-kerb/integration-test/target/integration-test-1.0.0-RC3-SNAPSHOT.jar>
to org.apache.kerby/integration-test/1.0.0-RC3-SNAPSHOT/integration-test-1.0.0-RC3-SNAPSHOT.jar
[JENKINS] Archiving <https://analysis.apache.org/jenkins/job/directory-kerby/ws/kerby-kerb/integration-test/target/integration-test-1.0.0-RC3-SNAPSHOT-sources.jar>
to org.apache.kerby/integration-test/1.0.0-RC3-SNAPSHOT/integration-test-1.0.0-RC3-SNAPSHOT-sources.jar
[JENKINS] Archiving <https://analysis.apache.org/jenkins/job/directory-kerby/ws/kerby-common/kerby-asn1/pom.xml>
to org.apache.kerby/kerby-asn1/1.0.0-RC3-SNAPSHOT/kerby-asn1-1.0.0-RC3-SNAPSHOT.pom
[JENKINS] Archiving <https://analysis.apache.org/jenkins/job/directory-kerby/ws/kerby-common/kerby-asn1/target/kerby-asn1-1.0.0-RC3-SNAPSHOT.jar>
to org.apache.kerby/kerby-asn1/1.0.0-RC3-SNAPSHOT/kerby-asn1-1.0.0-RC3-SNAPSHOT.jar
[JENKINS] Archiving <https://analysis.apache.org/jenkins/job/directory-kerby/ws/kerby-common/kerby-asn1/target/kerby-asn1-1.0.0-RC3-SNAPSHOT-sources.jar>
to org.apache.kerby/kerby-asn1/1.0.0-RC3-SNAPSHOT/kerby-asn1-1.0.0-RC3-SNAPSHOT-sources.jar
[JENKINS] Archiving <https://analysis.apache.org/jenkins/job/directory-kerby/ws/kerby-kerb/kerb-server-api-all/pom.xml>
to org.apache.kerby/kerb-server-api-all/1.0.0-RC3-SNAPSHOT/kerb-server-api-all-1.0.0-RC3-SNAPSHOT.pom
[JENKINS] Archiving <https://analysis.apache.org/jenkins/job/directory-kerby/ws/kerby-kerb/kerb-server-api-all/target/kerb-server-api-all-1.0.0-RC3-SNAPSHOT.jar>
to org.apache.kerby/kerb-server-api-all/1.0.0-RC3-SNAPSHOT/kerb-server-api-all-1.0.0-RC3-SNAPSHOT.jar
[JENKINS] Archiving <https://analysis.apache.org/jenkins/job/directory-kerby/ws/kerby-kerb/kerb-server-api-all/target/kerb-server-api-all-1.0.0-RC3-SNAPSHOT-sources.jar>
to org.apache.kerby/kerb-server-api-all/1.0.0-RC3-SNAPSHOT/kerb-server-api-all-1.0.0-RC3-SNAPSHOT-sources.jar
[JENKINS] Archiving <https://analysis.apache.org/jenkins/job/directory-kerby/ws/kerby-kerb/kerb-util/pom.xml>
to org.apache.kerby/kerb-util/1.0.0-RC3-SNAPSHOT/kerb-util-1.0.0-RC3-SNAPSHOT.pom
[JENKINS] Archiving <https://analysis.apache.org/jenkins/job/directory-kerby/ws/kerby-kerb/kerb-util/target/kerb-util-1.0.0-RC3-SNAPSHOT.jar>
to org.apache.kerby/kerb-util/1.0.0-RC3-SNAPSHOT/kerb-util-1.0.0-RC3-SNAPSHOT.jar
[JENKINS] Archiving <https://analysis.apache.org/jenkins/job/directory-kerby/ws/kerby-kerb/kerb-util/target/kerb-util-1.0.0-RC3-SNAPSHOT-sources.jar>
to org.apache.kerby/kerb-util/1.0.0-RC3-SNAPSHOT/kerb-util-1.0.0-RC3-SNAPSHOT-sources.jar
[JENKINS] Archiving <https://analysis.apache.org/jenkins/job/directory-kerby/ws/kerby-kdc-test/pom.xml>
to org.apache.kerby/kerby-kdc-test/1.0.0-RC3-SNAPSHOT/kerby-kdc-test-1.0.0-RC3-SNAPSHOT.pom
[JENKINS] Archiving <https://analysis.apache.org/jenkins/job/directory-kerby/ws/kerby-kdc-test/target/kerby-kdc-test-1.0.0-RC3-SNAPSHOT.jar>
to org.apache.kerby/kerby-kdc-test/1.0.0-RC3-SNAPSHOT/kerby-kdc-test-1.0.0-RC3-SNAPSHOT.jar
[JENKINS] Archiving <https://analysis.apache.org/jenkins/job/directory-kerby/ws/kerby-kdc-test/target/kerby-kdc-test-1.0.0-RC3-SNAPSHOT-sources.jar>
to org.apache.kerby/kerby-kdc-test/1.0.0-RC3-SNAPSHOT/kerby-kdc-test-1.0.0-RC3-SNAPSHOT-sources.jar
[JENKINS] Archiving <https://analysis.apache.org/jenkins/job/directory-kerby/ws/kerby-provider/pom.xml>
to org.apache.kerby/kerby-provider/1.0.0-RC3-SNAPSHOT/kerby-provider-1.0.0-RC3-SNAPSHOT.pom
[JENKINS] Archiving <https://analysis.apache.org/jenkins/job/directory-kerby/ws/kerby-kerb/kerb-admin/pom.xml>
to org.apache.kerby/kerb-admin/1.0.0-RC3-SNAPSHOT/kerb-admin-1.0.0-RC3-SNAPSHOT.pom
[JENKINS] Archiving <https://analysis.apache.org/jenkins/job/directory-kerby/ws/kerby-kerb/kerb-admin/target/kerb-admin-1.0.0-RC3-SNAPSHOT.jar>
to org.apache.kerby/kerb-admin/1.0.0-RC3-SNAPSHOT/kerb-admin-1.0.0-RC3-SNAPSHOT.jar
[JENKINS] Archiving <https://analysis.apache.org/jenkins/job/directory-kerby/ws/kerby-kerb/kerb-admin/target/kerb-admin-1.0.0-RC3-SNAPSHOT-sources.jar>
to org.apache.kerby/kerb-admin/1.0.0-RC3-SNAPSHOT/kerb-admin-1.0.0-RC3-SNAPSHOT-sources.jar
[JENKINS] Archiving <https://analysis.apache.org/jenkins/job/directory-kerby/ws/kerby-dist/kdc-dist/pom.xml>
to org.apache.kerby/kdc-dist/1.0.0-RC3-SNAPSHOT/kdc-dist-1.0.0-RC3-SNAPSHOT.pom
[JENKINS] Archiving <https://analysis.apache.org/jenkins/job/directory-kerby/ws/kerby-backend/ldap-backend/pom.xml>
to org.apache.kerby/ldap-backend/1.0.0-RC3-SNAPSHOT/ldap-backend-1.0.0-RC3-SNAPSHOT.pom
[JENKINS] Archiving <https://analysis.apache.org/jenkins/job/directory-kerby/ws/kerby-backend/ldap-backend/target/ldap-backend-1.0.0-RC3-SNAPSHOT.jar>
to org.apache.kerby/ldap-backend/1.0.0-RC3-SNAPSHOT/ldap-backend-1.0.0-RC3-SNAPSHOT.jar
[JENKINS] Archiving <https://analysis.apache.org/jenkins/job/directory-kerby/ws/kerby-backend/ldap-backend/target/ldap-backend-1.0.0-RC3-SNAPSHOT-sources.jar>
to org.apache.kerby/ldap-backend/1.0.0-RC3-SNAPSHOT/ldap-backend-1.0.0-RC3-SNAPSHOT-sources.jar
[JENKINS] Archiving <https://analysis.apache.org/jenkins/job/directory-kerby/ws/kerby-kerb/kerb-simplekdc/pom.xml>
to org.apache.kerby/kerb-simplekdc/1.0.0-RC3-SNAPSHOT/kerb-simplekdc-1.0.0-RC3-SNAPSHOT.pom
[JENKINS] Archiving <https://analysis.apache.org/jenkins/job/directory-kerby/ws/kerby-kerb/kerb-simplekdc/target/kerb-simplekdc-1.0.0-RC3-SNAPSHOT.jar>
to org.apache.kerby/kerb-simplekdc/1.0.0-RC3-SNAPSHOT/kerb-simplekdc-1.0.0-RC3-SNAPSHOT.jar
[JENKINS] Archiving <https://analysis.apache.org/jenkins/job/directory-kerby/ws/kerby-kerb/kerb-simplekdc/target/kerb-simplekdc-1.0.0-RC3-SNAPSHOT-sources.jar>
to org.apache.kerby/kerb-simplekdc/1.0.0-RC3-SNAPSHOT/kerb-simplekdc-1.0.0-RC3-SNAPSHOT-sources.jar
[JENKINS] Archiving <https://analysis.apache.org/jenkins/job/directory-kerby/ws/kerby-tool/pom.xml>
to org.apache.kerby/kerby-tool/1.0.0-RC3-SNAPSHOT/kerby-tool-1.0.0-RC3-SNAPSHOT.pom
channel stopped
[workspace] $ /x1/jenkins/jenkins-master/jenkins-home/tools/hudson.tasks.Maven_MavenInstallation/maven-3.0.5/bin/mvn
-f <https://analysis.apache.org/jenkins/job/directory-kerby/ws/pom.xml> -e -B org.codehaus.mojo:sonar-maven-plugin:2.6:sonar
-Dsonar.jdbc.driver=com.mysql.jdbc.Driver -Dsonar.jdbc.url=jdbc:mysql://192.168.0.64:3306/sonar?useUnicode=true&amp;characterEncoding=utf8
******** ******** -Dsonar.host.url=http://localhost:9090 ******** ********
[INFO] Error stacktraces are turned on.
[INFO] Scanning for projects...
[INFO] ------------------------------------------------------------------------
[INFO] Reactor Build Order:
[INFO] 
[INFO] Apache Kerby Project
[INFO] Kerby-common Project
[INFO] Kerby ASN1 Project
[INFO] Kerby Config
[INFO] Kerby Util
[INFO] Kerby XDR Project
[INFO] Kerby PKIX Project
[INFO] Kerby-kerb Project
[INFO] Kerby-kerb core
[INFO] Kerby-kerb Crypto
[INFO] Kerby-kerb Common
[INFO] Kerby-kerb Util
[INFO] Kerby-kerb Identity
[INFO] Kerby-kerb Identity Test
[INFO] Kerby-kerb Client
[INFO] Kerby-kerb Server
[INFO] Kerby-kerb Admin
[INFO] Kerb Simple Kdc
[INFO] Kerby-kerb server all
[INFO] Kerby KDC Server
[INFO] Kerb Kdc Test
[INFO] Kerby providers
[INFO] Token provider
[INFO] Kerb Integration Test
[INFO] Kerby-kerb Admin Server
[INFO] Kerby-kerb client api all
[INFO] Kdc Tool Project
[INFO] Client Tool
[INFO] KDC Tool
[INFO] Kerby Backend
[INFO] Json identity backend
[INFO] Zookeeper identity backend
[INFO] Ldap identity backend
[INFO] Kerby Kdc Test
[INFO] Mavibot based backend
[INFO] Kerby Distribution
[INFO] KDC Dist
[INFO] Tool Dist
[INFO] Kerby benchmark
[INFO]                                                                         
[INFO] ------------------------------------------------------------------------
[INFO] Building Apache Kerby Project 1.0.0-RC3-SNAPSHOT
[INFO] ------------------------------------------------------------------------
[INFO] 
[INFO] --- sonar-maven-plugin:2.6:sonar (default-cli) @ kerby-all ---
[INFO] SonarQube version: 5.1
INFO: Default locale: "en_US", source code encoding: "UTF-8"
INFO: Work directory: <https://analysis.apache.org/jenkins/job/directory-kerby/ws/target/sonar>
INFO: SonarQube Server 5.1
[INFO] [06:25:03.696] Load global repositories
[INFO] [06:25:04.131] Load global repositories (done) | time=439ms
[INFO] [06:25:04.138] Server id: 20160830065906
[INFO] [06:25:04.141] User cache: /home/jenkins/.sonar/cache
[INFO] [06:25:04.156] Install plugins
[INFO] [06:25:05.138] Install JDBC driver
[INFO] [06:25:05.161] Create JDBC datasource for jdbc:mysql://192.168.0.64:3306/sonar?useUnicode=true&amp;characterEncoding=utf8
[INFO] [06:25:09.278] Initializing Hibernate
[INFO] [06:25:14.547] Load project repositories
[INFO] [06:25:15.091] Load project repositories (done) | time=544ms
[INFO] [06:25:15.091] Load project settings
[INFO] [06:25:15.774] Load technical debt model
[INFO] [06:25:15.826] Apply project exclusions
[INFO] ------------------------------------------------------------------------
[INFO] Reactor Summary:
[INFO] 
[INFO] Apache Kerby Project .............................. FAILURE [1:43.281s]
[INFO] Kerby-common Project .............................. SKIPPED
[INFO] Kerby ASN1 Project ................................ SKIPPED
[INFO] Kerby Config ...................................... SKIPPED
[INFO] Kerby Util ........................................ SKIPPED
[INFO] Kerby XDR Project ................................. SKIPPED
[INFO] Kerby PKIX Project ................................ SKIPPED
[INFO] Kerby-kerb Project ................................ SKIPPED
[INFO] Kerby-kerb core ................................... SKIPPED
[INFO] Kerby-kerb Crypto ................................. SKIPPED
[INFO] Kerby-kerb Common ................................. SKIPPED
[INFO] Kerby-kerb Util ................................... SKIPPED
[INFO] Kerby-kerb Identity ............................... SKIPPED
[INFO] Kerby-kerb Identity Test .......................... SKIPPED
[INFO] Kerby-kerb Client ................................. SKIPPED
[INFO] Kerby-kerb Server ................................. SKIPPED
[INFO] Kerby-kerb Admin .................................. SKIPPED
[INFO] Kerb Simple Kdc ................................... SKIPPED
[INFO] Kerby-kerb server all ............................. SKIPPED
[INFO] Kerby KDC Server .................................. SKIPPED
[INFO] Kerb Kdc Test ..................................... SKIPPED
[INFO] Kerby providers ................................... SKIPPED
[INFO] Token provider .................................... SKIPPED
[INFO] Kerb Integration Test ............................. SKIPPED
[INFO] Kerby-kerb Admin Server ........................... SKIPPED
[INFO] Kerby-kerb client api all ......................... SKIPPED
[INFO] Kdc Tool Project .................................. SKIPPED
[INFO] Client Tool ....................................... SKIPPED
[INFO] KDC Tool .......................................... SKIPPED
[INFO] Kerby Backend ..................................... SKIPPED
[INFO] Json identity backend ............................. SKIPPED
[INFO] Zookeeper identity backend ........................ SKIPPED
[INFO] Ldap identity backend ............................. SKIPPED
[INFO] Kerby Kdc Test .................................... SKIPPED
[INFO] Mavibot based backend ............................. SKIPPED
[INFO] Kerby Distribution ................................ SKIPPED
[INFO] KDC Dist .......................................... SKIPPED
[INFO] Tool Dist ......................................... SKIPPED
[INFO] Kerby benchmark ................................... SKIPPED
[INFO] ------------------------------------------------------------------------
[INFO] BUILD FAILURE
[INFO] ------------------------------------------------------------------------
[INFO] Total time: 1:45.855s
[INFO] Finished at: Mon Sep 05 06:26:33 UTC 2016
[INFO] Final Memory: 26M/303M
[INFO] ------------------------------------------------------------------------
[ERROR] Failed to execute goal org.codehaus.mojo:sonar-maven-plugin:2.6:sonar (default-cli)
on project kerby-all: null: MojoExecutionException: NullPointerException -> [Help 1]
org.apache.maven.lifecycle.LifecycleExecutionException: Failed to execute goal org.codehaus.mojo:sonar-maven-plugin:2.6:sonar
(default-cli) on project kerby-all: null
	at org.apache.maven.lifecycle.internal.MojoExecutor.execute(MojoExecutor.java:217)
	at org.apache.maven.lifecycle.internal.MojoExecutor.execute(MojoExecutor.java:153)
	at org.apache.maven.lifecycle.internal.MojoExecutor.execute(MojoExecutor.java:145)
	at org.apache.maven.lifecycle.internal.LifecycleModuleBuilder.buildProject(LifecycleModuleBuilder.java:84)
	at org.apache.maven.lifecycle.internal.LifecycleModuleBuilder.buildProject(LifecycleModuleBuilder.java:59)
	at org.apache.maven.lifecycle.internal.LifecycleStarter.singleThreadedBuild(LifecycleStarter.java:183)
	at org.apache.maven.lifecycle.internal.LifecycleStarter.execute(LifecycleStarter.java:161)
	at org.apache.maven.DefaultMaven.doExecute(DefaultMaven.java:320)
	at org.apache.maven.DefaultMaven.execute(DefaultMaven.java:156)
	at org.apache.maven.cli.MavenCli.execute(MavenCli.java:537)
	at org.apache.maven.cli.MavenCli.doMain(MavenCli.java:196)
	at org.apache.maven.cli.MavenCli.main(MavenCli.java:141)
	at sun.reflect.NativeMethodAccessorImpl.invoke0(Native Method)
	at sun.reflect.NativeMethodAccessorImpl.invoke(NativeMethodAccessorImpl.java:57)
	at sun.reflect.DelegatingMethodAccessorImpl.invoke(DelegatingMethodAccessorImpl.java:43)
	at java.lang.reflect.Method.invoke(Method.java:606)
	at org.codehaus.plexus.classworlds.launcher.Launcher.launchEnhanced(Launcher.java:290)
	at org.codehaus.plexus.classworlds.launcher.Launcher.launch(Launcher.java:230)
	at org.codehaus.plexus.classworlds.launcher.Launcher.mainWithExitCode(Launcher.java:409)
	at org.codehaus.plexus.classworlds.launcher.Launcher.main(Launcher.java:352)
Caused by: org.apache.maven.plugin.MojoExecutionException
	at org.codehaus.mojo.sonar.bootstrap.ExceptionHandling.handle(ExceptionHandling.java:41)
	at org.codehaus.mojo.sonar.bootstrap.RunnerBootstraper.execute(RunnerBootstraper.java:139)
	at org.codehaus.mojo.sonar.SonarMojo.execute(SonarMojo.java:132)
	at org.apache.maven.plugin.DefaultBuildPluginManager.executeMojo(DefaultBuildPluginManager.java:101)
	at org.apache.maven.lifecycle.internal.MojoExecutor.execute(MojoExecutor.java:209)
	... 19 more
Caused by: java.lang.NullPointerException
	at org.sonar.core.persistence.SemaphoreDao.createLock(SemaphoreDao.java:127)
	at org.sonar.core.persistence.SemaphoreDao.acquire(SemaphoreDao.java:59)
	at org.sonar.core.persistence.SemaphoresImpl.acquire(SemaphoresImpl.java:39)
	at org.sonar.batch.scan.ProjectLock.acquire(ProjectLock.java:75)
	at org.sonar.batch.scan.ProjectLock.start(ProjectLock.java:52)
	at sun.reflect.NativeMethodAccessorImpl.invoke0(Native Method)
	at sun.reflect.NativeMethodAccessorImpl.invoke(NativeMethodAccessorImpl.java:57)
	at sun.reflect.DelegatingMethodAccessorImpl.invoke(DelegatingMethodAccessorImpl.java:43)
	at java.lang.reflect.Method.invoke(Method.java:606)
	at org.picocontainer.lifecycle.ReflectionLifecycleStrategy.invokeMethod(ReflectionLifecycleStrategy.java:110)
	at org.picocontainer.lifecycle.ReflectionLifecycleStrategy.start(ReflectionLifecycleStrategy.java:89)
	at org.picocontainer.injectors.AbstractInjectionFactory$LifecycleAdapter.start(AbstractInjectionFactory.java:84)
	at org.picocontainer.behaviors.AbstractBehavior.start(AbstractBehavior.java:169)
	at org.picocontainer.behaviors.Stored$RealComponentLifecycle.start(Stored.java:132)
	at org.picocontainer.behaviors.Stored.start(Stored.java:110)
	at org.picocontainer.DefaultPicoContainer.potentiallyStartAdapter(DefaultPicoContainer.java:1015)
	at org.picocontainer.DefaultPicoContainer.startAdapters(DefaultPicoContainer.java:1008)
	at org.picocontainer.DefaultPicoContainer.start(DefaultPicoContainer.java:766)
	at org.sonar.api.platform.ComponentContainer.startComponents(ComponentContainer.java:91)
	at org.sonar.api.platform.ComponentContainer.execute(ComponentContainer.java:77)
	at org.sonar.batch.scan.ScanTask.scan(ScanTask.java:57)
	at org.sonar.batch.scan.ScanTask.execute(ScanTask.java:45)
	at org.sonar.batch.bootstrap.TaskContainer.doAfterStart(TaskContainer.java:135)
	at org.sonar.api.platform.ComponentContainer.startComponents(ComponentContainer.java:92)
	at org.sonar.api.platform.ComponentContainer.execute(ComponentContainer.java:77)
	at org.sonar.batch.bootstrap.GlobalContainer.executeTask(GlobalContainer.java:158)
	at org.sonar.batch.bootstrapper.Batch.executeTask(Batch.java:95)
	at org.sonar.batch.bootstrapper.Batch.execute(Batch.java:67)
	at org.sonar.runner.batch.IsolatedLauncher.execute(IsolatedLauncher.java:48)
	at sun.reflect.NativeMethodAccessorImpl.invoke0(Native Method)
	at sun.reflect.NativeMethodAccessorImpl.invoke(NativeMethodAccessorImpl.java:57)
	at sun.reflect.DelegatingMethodAccessorImpl.invoke(DelegatingMethodAccessorImpl.java:43)
	at java.lang.reflect.Method.invoke(Method.java:606)
	at org.sonar.runner.impl.BatchLauncher$1.delegateExecution(BatchLauncher.java:87)
	at org.sonar.runner.impl.BatchLauncher$1.run(BatchLauncher.java:75)
	at java.security.AccessController.doPrivileged(Native Method)
	at org.sonar.runner.impl.BatchLauncher.doExecute(BatchLauncher.java:69)
	at org.sonar.runner.impl.BatchLauncher.execute(BatchLauncher.java:50)
	at org.sonar.runner.api.EmbeddedRunner.doExecute(EmbeddedRunner.java:102)
	at org.sonar.runner.api.Runner.execute(Runner.java:100)
	at org.codehaus.mojo.sonar.bootstrap.RunnerBootstraper.execute(RunnerBootstraper.java:135)
	... 22 more
[ERROR] 
[ERROR] Re-run Maven using the -X switch to enable full debug logging.
[ERROR] 
[ERROR] For more information about the errors and possible solutions, please read the following
articles:
[ERROR] [Help 1] http://cwiki.apache.org/confluence/display/MAVEN/MojoExecutionException
Sonar analysis completed: FAILURE
Build step 'Sonar' changed build result to FAILURE
Build step 'Sonar' marked build as failure

Mime
View raw message