directory-notifications mailing list archives

Site index · List index
Message view « Date » · « Thread »
Top « Date » · « Thread »
From Apache Jenkins Server <jenk...@builds.apache.org>
Subject Build failed in Jenkins: dir-apacheds-ubuntu-deploy #1928
Date Mon, 15 Aug 2016 12:44:17 GMT
See <https://builds.apache.org/job/dir-apacheds-ubuntu-deploy/1928/>

------------------------------------------
[...truncated 2741 lines...]
Tests run: 10, Failures: 0, Errors: 0, Skipped: 0, Time elapsed: 0.01 sec - in org.apache.directory.shared.kerberos.codec.PrincipalNameDecoderTest
Running org.apache.directory.shared.kerberos.codec.AdIfRelevantDecoderTest
Tests run: 1, Failures: 0, Errors: 0, Skipped: 0, Time elapsed: 0 sec - in org.apache.directory.shared.kerberos.codec.AdIfRelevantDecoderTest
Running org.apache.directory.shared.kerberos.codec.ChecksumDecoderTest
Tests run: 4, Failures: 0, Errors: 0, Skipped: 0, Time elapsed: 0 sec - in org.apache.directory.shared.kerberos.codec.ChecksumDecoderTest
Running org.apache.directory.shared.kerberos.codec.KdcRepDecoderTest
Tests run: 4, Failures: 0, Errors: 0, Skipped: 0, Time elapsed: 0.009 sec - in org.apache.directory.shared.kerberos.codec.KdcRepDecoderTest
Running org.apache.directory.shared.kerberos.codec.KrbPrivDecoderTest
Tests run: 1, Failures: 0, Errors: 0, Skipped: 0, Time elapsed: 0.012 sec - in org.apache.directory.shared.kerberos.codec.KrbPrivDecoderTest
Running org.apache.directory.shared.kerberos.codec.EncKdcRepPartDecoderTest
Tests run: 9, Failures: 0, Errors: 0, Skipped: 0, Time elapsed: 0.038 sec - in org.apache.directory.shared.kerberos.codec.EncKdcRepPartDecoderTest
Running org.apache.directory.shared.kerberos.codec.EncTgsRepPartDecoderTest
Tests run: 3, Failures: 0, Errors: 0, Skipped: 0, Time elapsed: 0.007 sec - in org.apache.directory.shared.kerberos.codec.EncTgsRepPartDecoderTest
Running org.apache.directory.shared.kerberos.codec.EncKrbCredPartDecoderTest
Tests run: 2, Failures: 0, Errors: 0, Skipped: 0, Time elapsed: 0.016 sec - in org.apache.directory.shared.kerberos.codec.EncKrbCredPartDecoderTest
Running org.apache.directory.shared.kerberos.codec.EncKrbPrivPartDecoderTest
Tests run: 6, Failures: 0, Errors: 0, Skipped: 0, Time elapsed: 0.006 sec - in org.apache.directory.shared.kerberos.codec.EncKrbPrivPartDecoderTest
Running org.apache.directory.shared.kerberos.codec.KrbErrorDecoderTest
Tests run: 11, Failures: 0, Errors: 0, Skipped: 0, Time elapsed: 0.031 sec - in org.apache.directory.shared.kerberos.codec.KrbErrorDecoderTest
Running org.apache.directory.shared.kerberos.codec.EncAsRepPartDecoderTest
Tests run: 3, Failures: 0, Errors: 0, Skipped: 0, Time elapsed: 0.07 sec - in org.apache.directory.shared.kerberos.codec.EncAsRepPartDecoderTest
Running org.apache.directory.shared.kerberos.codec.TransitedEncodingDecoderTest
Tests run: 7, Failures: 0, Errors: 0, Skipped: 0, Time elapsed: 0.007 sec - in org.apache.directory.shared.kerberos.codec.TransitedEncodingDecoderTest
Running org.apache.directory.shared.kerberos.codec.EncryptedDataDecoderTest
Tests run: 10, Failures: 0, Errors: 0, Skipped: 0, Time elapsed: 0.044 sec - in org.apache.directory.shared.kerberos.codec.EncryptedDataDecoderTest
Running org.apache.directory.shared.kerberos.codec.AsRepDecoderTest
Tests run: 5, Failures: 0, Errors: 0, Skipped: 0, Time elapsed: 0.012 sec - in org.apache.directory.shared.kerberos.codec.AsRepDecoderTest
Running org.apache.directory.shared.kerberos.codec.ETypeInfoEntryDecoderTest
Tests run: 9, Failures: 0, Errors: 0, Skipped: 0, Time elapsed: 0.005 sec - in org.apache.directory.shared.kerberos.codec.ETypeInfoEntryDecoderTest
Running org.apache.directory.shared.kerberos.codec.AdAndOrDecoderTest
Tests run: 8, Failures: 0, Errors: 0, Skipped: 0, Time elapsed: 0.011 sec - in org.apache.directory.shared.kerberos.codec.AdAndOrDecoderTest
Running org.apache.directory.shared.kerberos.codec.PaDataDecoderTest
Tests run: 4, Failures: 0, Errors: 0, Skipped: 0, Time elapsed: 0.003 sec - in org.apache.directory.shared.kerberos.codec.PaDataDecoderTest
Running org.apache.directory.shared.kerberos.codec.AuthorizationDataDecoderTest
Tests run: 9, Failures: 0, Errors: 0, Skipped: 0, Time elapsed: 0.006 sec - in org.apache.directory.shared.kerberos.codec.AuthorizationDataDecoderTest
Running org.apache.directory.shared.kerberos.codec.EncryptionKeyDecoderTest
Tests run: 8, Failures: 0, Errors: 0, Skipped: 0, Time elapsed: 0.009 sec - in org.apache.directory.shared.kerberos.codec.EncryptionKeyDecoderTest
Running org.apache.directory.shared.kerberos.codec.MethodDataDecoderTest
Tests run: 3, Failures: 0, Errors: 0, Skipped: 0, Time elapsed: 0.009 sec - in org.apache.directory.shared.kerberos.codec.MethodDataDecoderTest
Running org.apache.directory.shared.kerberos.codec.HostAddressesDecoderTest
Tests run: 3, Failures: 0, Errors: 0, Skipped: 0, Time elapsed: 0.003 sec - in org.apache.directory.shared.kerberos.codec.HostAddressesDecoderTest
Running org.apache.directory.shared.kerberos.codec.ApRepDecoderTest
Tests run: 6, Failures: 0, Errors: 0, Skipped: 0, Time elapsed: 0.008 sec - in org.apache.directory.shared.kerberos.codec.ApRepDecoderTest
Running org.apache.directory.shared.kerberos.codec.KrbSafeBodyDecoderTest
Tests run: 6, Failures: 0, Errors: 0, Skipped: 0, Time elapsed: 0.01 sec - in org.apache.directory.shared.kerberos.codec.KrbSafeBodyDecoderTest
Running org.apache.directory.shared.kerberos.codec.HostAddressDecoderTest
Tests run: 8, Failures: 0, Errors: 0, Skipped: 0, Time elapsed: 0.006 sec - in org.apache.directory.shared.kerberos.codec.HostAddressDecoderTest
Running org.apache.directory.shared.kerberos.codec.KerberosMessageDecoderTest
Tests run: 1, Failures: 0, Errors: 0, Skipped: 0, Time elapsed: 0.014 sec - in org.apache.directory.shared.kerberos.codec.KerberosMessageDecoderTest
Running org.apache.directory.shared.kerberos.codec.ChangePasswdDataDecoderTest
Tests run: 4, Failures: 0, Errors: 0, Skipped: 0, Time elapsed: 0.011 sec - in org.apache.directory.shared.kerberos.codec.ChangePasswdDataDecoderTest
Running org.apache.directory.shared.kerberos.codec.LastReqDecoderTest
Tests run: 6, Failures: 0, Errors: 0, Skipped: 0, Time elapsed: 0.004 sec - in org.apache.directory.shared.kerberos.codec.LastReqDecoderTest
Running org.apache.directory.shared.kerberos.codec.KdcReqBodyDecoderTest
Tests run: 6, Failures: 0, Errors: 0, Skipped: 0, Time elapsed: 0.008 sec - in org.apache.directory.shared.kerberos.codec.KdcReqBodyDecoderTest
Running org.apache.directory.shared.kerberos.codec.KrbSafeDecoderTest
Tests run: 2, Failures: 0, Errors: 0, Skipped: 0, Time elapsed: 0.006 sec - in org.apache.directory.shared.kerberos.codec.KrbSafeDecoderTest
Running org.apache.directory.shared.kerberos.codec.TgsRepDecoderTest
Tests run: 4, Failures: 0, Errors: 0, Skipped: 0, Time elapsed: 0.006 sec - in org.apache.directory.shared.kerberos.codec.TgsRepDecoderTest
Running org.apache.directory.shared.kerberos.codec.ApReqDecoderTest
Tests run: 4, Failures: 0, Errors: 0, Skipped: 1, Time elapsed: 0.011 sec - in org.apache.directory.shared.kerberos.codec.ApReqDecoderTest
Running org.apache.directory.shared.kerberos.codec.EncApRepPartDecoderTest
Tests run: 9, Failures: 0, Errors: 0, Skipped: 0, Time elapsed: 0.015 sec - in org.apache.directory.shared.kerberos.codec.EncApRepPartDecoderTest
Running org.apache.directory.shared.kerberos.codec.KrbCredDecoderTest
Tests run: 1, Failures: 0, Errors: 0, Skipped: 0, Time elapsed: 0.004 sec - in org.apache.directory.shared.kerberos.codec.KrbCredDecoderTest
Running org.apache.directory.shared.kerberos.codec.AdMandatoryForKdcDecoderTest
Tests run: 1, Failures: 0, Errors: 0, Skipped: 0, Time elapsed: 0.001 sec - in org.apache.directory.shared.kerberos.codec.AdMandatoryForKdcDecoderTest
Running org.apache.directory.shared.kerberos.codec.PaEncTimestampDecoderTest
Tests run: 1, Failures: 0, Errors: 0, Skipped: 0, Time elapsed: 0.002 sec - in org.apache.directory.shared.kerberos.codec.PaEncTimestampDecoderTest
Running org.apache.directory.shared.kerberos.codec.AuthenticatorDecoderTest
Tests run: 6, Failures: 0, Errors: 0, Skipped: 0, Time elapsed: 0.014 sec - in org.apache.directory.shared.kerberos.codec.AuthenticatorDecoderTest
Running org.apache.directory.shared.kerberos.codec.TypedDataDecoderTest
Tests run: 6, Failures: 0, Errors: 0, Skipped: 0, Time elapsed: 0.006 sec - in org.apache.directory.shared.kerberos.codec.TypedDataDecoderTest

Results :

Tests run: 376, Failures: 0, Errors: 0, Skipped: 1

[JENKINS] Recording test results
[INFO] 
[INFO] --- maven-bundle-plugin:2.5.3:bundle (default-bundle) @ apacheds-kerberos-codec ---
[INFO] 
[INFO] --- maven-site-plugin:3.4:attach-descriptor (attach-descriptor) @ apacheds-kerberos-codec
---
[INFO] 
[INFO] --- tools-maven-plugin:1.4:verify-legal-files (verify-legal-files) @ apacheds-kerberos-codec
---
[INFO] Checking legal files in: apacheds-kerberos-codec-2.0.0-M24-SNAPSHOT.jar
[INFO] 
[INFO] >>> maven-source-plugin:2.4:jar (attach-sources) > generate-sources @ apacheds-kerberos-codec
>>>
[INFO] 
[INFO] --- maven-checkstyle-plugin:2.16:check (validate) @ apacheds-kerberos-codec ---
[WARNING] Failed to getClass for org.apache.maven.plugin.source.SourceJarMojo
[INFO] 
[INFO] <<< maven-source-plugin:2.4:jar (attach-sources) < generate-sources @ apacheds-kerberos-codec
<<<
[INFO] 
[INFO] --- maven-source-plugin:2.4:jar (attach-sources) @ apacheds-kerberos-codec ---
[INFO] Building jar: <https://builds.apache.org/job/dir-apacheds-ubuntu-deploy/ws/trunk/kerberos-codec/target/apacheds-kerberos-codec-2.0.0-M24-SNAPSHOT-sources.jar>
[INFO] 
[INFO] --- maven-install-plugin:2.5.2:install (default-install) @ apacheds-kerberos-codec
---
[INFO] Installing <https://builds.apache.org/job/dir-apacheds-ubuntu-deploy/ws/trunk/kerberos-codec/target/apacheds-kerberos-codec-2.0.0-M24-SNAPSHOT.jar>
to /home/jenkins/jenkins-slave/maven-repositories/0/org/apache/directory/server/apacheds-kerberos-codec/2.0.0-M24-SNAPSHOT/apacheds-kerberos-codec-2.0.0-M24-SNAPSHOT.jar
[INFO] Installing <https://builds.apache.org/job/dir-apacheds-ubuntu-deploy/ws/trunk/kerberos-codec/pom.xml>
to /home/jenkins/jenkins-slave/maven-repositories/0/org/apache/directory/server/apacheds-kerberos-codec/2.0.0-M24-SNAPSHOT/apacheds-kerberos-codec-2.0.0-M24-SNAPSHOT.pom
[INFO] Installing <https://builds.apache.org/job/dir-apacheds-ubuntu-deploy/ws/trunk/kerberos-codec/target/apacheds-kerberos-codec-2.0.0-M24-SNAPSHOT-sources.jar>
to /home/jenkins/jenkins-slave/maven-repositories/0/org/apache/directory/server/apacheds-kerberos-codec/2.0.0-M24-SNAPSHOT/apacheds-kerberos-codec-2.0.0-M24-SNAPSHOT-sources.jar
[INFO] 
[INFO] --- maven-bundle-plugin:2.5.3:install (default-install) @ apacheds-kerberos-codec ---
[INFO] Installing org/apache/directory/server/apacheds-kerberos-codec/2.0.0-M24-SNAPSHOT/apacheds-kerberos-codec-2.0.0-M24-SNAPSHOT.jar
[INFO] Writing OBR metadata
[INFO] 
[INFO] --- maven-deploy-plugin:2.8.2:deploy (default-deploy) @ apacheds-kerberos-codec ---
[INFO] Downloading: https://repository.apache.org/content/repositories/snapshots/org/apache/directory/server/apacheds-kerberos-codec/2.0.0-M24-SNAPSHOT/maven-metadata.xml
[INFO] Downloaded: https://repository.apache.org/content/repositories/snapshots/org/apache/directory/server/apacheds-kerberos-codec/2.0.0-M24-SNAPSHOT/maven-metadata.xml
(2 KB at 1.2 KB/sec)
[INFO] Uploading: https://repository.apache.org/content/repositories/snapshots/org/apache/directory/server/apacheds-kerberos-codec/2.0.0-M24-SNAPSHOT/apacheds-kerberos-codec-2.0.0-M24-20160815.123852-5.jar
[INFO] Uploading: https://repository.apache.org/content/repositories/snapshots/org/apache/directory/server/apacheds-kerberos-codec/2.0.0-M24-SNAPSHOT/apacheds-kerberos-codec-2.0.0-M24-20160815.123852-5.pom
[INFO] Uploaded: https://repository.apache.org/content/repositories/snapshots/org/apache/directory/server/apacheds-kerberos-codec/2.0.0-M24-SNAPSHOT/apacheds-kerberos-codec-2.0.0-M24-20160815.123852-5.pom
(4 KB at 3.6 KB/sec)
[JENKINS] Archiving disabled
[JENKINS] Archiving disabled
[JENKINS] Archiving disabled
[JENKINS] Archiving disabled
[JENKINS] Archiving disabled
[JENKINS] Archiving disabled
[JENKINS] Archiving disabled
[JENKINS] Archiving disabled
[JENKINS] Archiving disabled
[JENKINS] Archiving disabled
[JENKINS] Archiving disabled
[JENKINS] Archiving disabled
[JENKINS] Archiving disabled
[JENKINS] Archiving disabled
[JENKINS] Archiving disabled
[JENKINS] Archiving disabled
[JENKINS] Archiving disabled
[JENKINS] Archiving disabled
[JENKINS] Archiving disabled
[JENKINS] Archiving disabled
[JENKINS] Archiving disabled
[JENKINS] Archiving disabled
[JENKINS] Archiving disabled
[JENKINS] Archiving disabled
[JENKINS] Archiving disabled
[JENKINS] Archiving disabled
[JENKINS] Archiving disabled
[JENKINS] Archiving disabled
[JENKINS] Archiving disabled
[JENKINS] Archiving disabled
[JENKINS] Archiving disabled
[JENKINS] Archiving disabled
[JENKINS] Archiving disabled
[JENKINS] Archiving disabled
[JENKINS] Archiving disabled
[JENKINS] Archiving disabled
[JENKINS] Archiving disabled
[JENKINS] Archiving disabled
[JENKINS] Archiving disabled
[JENKINS] Archiving disabled
[JENKINS] Archiving disabled
[JENKINS] Archiving disabled
[JENKINS] Archiving disabled
[JENKINS] Archiving disabled
[JENKINS] Archiving disabled
[JENKINS] Archiving disabled
[JENKINS] Archiving disabled
[JENKINS] Archiving disabled
[JENKINS] Archiving disabled
[JENKINS] Archiving disabled
[JENKINS] Archiving disabled
[JENKINS] Archiving disabled
[JENKINS] Archiving disabled
[JENKINS] Archiving disabled
[JENKINS] Archiving disabled
[JENKINS] Archiving disabled
[JENKINS] Archiving disabled
[JENKINS] Archiving disabled[INFO] ------------------------------------------------------------------------
[INFO] Reactor Summary:
[INFO] 
[INFO] ApacheDS ........................................... SUCCESS [ 22.242 s]
[INFO] ApacheDS I18n ...................................... SUCCESS [ 14.033 s]
[INFO] ApacheDS Core Constants ............................ SUCCESS [  8.647 s]
[INFO] ApacheDS Core API .................................. SUCCESS [01:03 min]
[INFO] ApacheDS Core Shared ............................... SUCCESS [ 15.617 s]
[INFO] ApacheDS Interceptors .............................. SUCCESS [  5.127 s]
[INFO] ApacheDS AdministrativePoint Interceptor ........... SUCCESS [ 14.469 s]
[INFO] ApacheDS Authentication Interceptor ................ SUCCESS [ 19.642 s]
[INFO] ApacheDS Interceptor to increment numeric attributes SUCCESS [01:26 min]
[INFO] ApacheDS Authorization Interceptor ................. SUCCESS [ 26.159 s]
[INFO] ApacheDS ChangeLog Interceptor ..................... SUCCESS [ 27.739 s]
[INFO] ApacheDS Collective Attribute Interceptor .......... SUCCESS [ 22.498 s]
[INFO] ApacheDS Event Interceptor ......................... SUCCESS [ 18.408 s]
[INFO] ApacheDS Exception Interceptor ..................... SUCCESS [ 17.629 s]
[INFO] ApacheDS Journal Interceptor ....................... SUCCESS [ 17.181 s]
[INFO] ApacheDS Normalization Interceptor ................. SUCCESS [ 21.171 s]
[INFO] ApacheDS Operational Attribute Interceptor ......... SUCCESS [ 10.879 s]
[INFO] ApacheDS Referral Interceptor ...................... SUCCESS [ 17.732 s]
[INFO] ApacheDS Schema Interceptor ........................ SUCCESS [ 22.818 s]
[INFO] ApacheDS Subtree Interceptor ....................... SUCCESS [ 25.084 s]
[INFO] ApacheDS Triggers Interceptor ...................... SUCCESS [ 24.044 s]
[INFO] ApacheDS Core ...................................... SUCCESS [ 26.987 s]
[INFO] ApacheDS Core AVL .................................. SUCCESS [ 22.929 s]
[INFO] ApacheDS Generalized (X) DBM Partition ............. SUCCESS [ 37.914 s]
[INFO] ApacheDS LDIF Partition ............................ SUCCESS [ 30.973 s]
[INFO] ApacheDS JDBM Partition ............................ SUCCESS [ 34.937 s]
[INFO] ApacheDS Mavibot Partition ......................... SUCCESS [01:01 min]
[INFO] ApacheDS Core Annotations .......................... SUCCESS [ 35.073 s]
[INFO] ApacheDS Core JNDI ................................. SUCCESS [ 25.232 s]
[INFO] ApacheDS Protocol Kerberos Codec ................... FAILURE [02:50 min]
[INFO] ApacheDS Interceptors for Kerberos ................. SKIPPED
[INFO] ApacheDS Protocol Dhcp ............................. SKIPPED
[INFO] ApacheDS Protocol Shared ........................... SKIPPED
[INFO] ApacheDS Protocol Dns .............................. SKIPPED
[INFO] ApacheDS Protocol Kerberos ......................... SKIPPED
[INFO] ApacheDS Protocol Ldap ............................. SKIPPED
[INFO] ApacheDS Protocol Ntp .............................. SKIPPED
[INFO] Apacheds Server Annotations ........................ SKIPPED
[INFO] ApacheDS Server Config ............................. SKIPPED
[INFO] ApacheDS Server JNDI ............................... SKIPPED
[INFO] ApacheDS Test Framework ............................ SKIPPED
[INFO] ApacheDS All ....................................... SKIPPED
[INFO] ApacheDS Logger Interceptor ........................ SKIPPED
[INFO] ApacheDS Password Hashing Interceptor .............. SKIPPED
[INFO] ApacheDS Core Integration .......................... SKIPPED
[INFO] ApacheDS Protocol Kerberos Test .................... SKIPPED
[INFO] ApacheDS Server Integration ........................ SKIPPED
[INFO] ApacheDS DirectoryService-WebApp bridge ............ SKIPPED
[INFO] ApacheDS Jetty HTTP Server Integration ............. SKIPPED
[INFO] ApacheDS Service Builder ........................... SKIPPED
[INFO] Apache Directory LDAP Client API test .............. SKIPPED
[INFO] kerberos-client .................................... SKIPPED
[INFO] ApacheDS Service ................................... SKIPPED
[INFO] ApacheDS Wrapper ................................... SKIPPED
[INFO] ApacheDS Installers Maven Plugin ................... SKIPPED
[INFO] ApacheDS Installers ................................ SKIPPED
[INFO] ApacheDS OSGi Integration Tests .................... SKIPPED
[INFO] ------------------------------------------------------------------------
[INFO] BUILD FAILURE
[INFO] ------------------------------------------------------------------------
[INFO] Total time: 16:41 min
[INFO] Finished at: 2016-08-15T12:41:30+00:00

[INFO] Final Memory: 86M/400M
[INFO] ------------------------------------------------------------------------
Waiting for Jenkins to finish collecting data
[ERROR] Failed to execute goal org.apache.maven.plugins:maven-deploy-plugin:2.8.2:deploy (default-deploy)
on project apacheds-kerberos-codec: Failed to deploy artifacts: Could not transfer artifact
org.apache.directory.server:apacheds-kerberos-codec:jar:2.0.0-M24-20160815.123852-5 from/to
apache.snapshots.https (https://repository.apache.org/content/repositories/snapshots): Failed
to transfer file: https://repository.apache.org/content/repositories/snapshots/org/apache/directory/server/apacheds-kerberos-codec/2.0.0-M24-SNAPSHOT/apacheds-kerberos-codec-2.0.0-M24-20160815.123852-5.jar.
Return code is: 400, ReasonPhrase: Bad Request. -> [Help 1]
[ERROR] 
[ERROR] To see the full stack trace of the errors, re-run Maven with the -e switch.
[ERROR] Re-run Maven using the -X switch to enable full debug logging.
[ERROR] 
[ERROR] For more information about the errors and possible solutions, please read the following
articles:
[ERROR] [Help 1] http://cwiki.apache.org/confluence/display/MAVEN/MojoExecutionException
[ERROR] 
[ERROR] After correcting the problems, you can resume the build with the command
[ERROR]   mvn <goals> -rf :apacheds-kerberos-codec
channel stopped

Mime
View raw message