directory-notifications mailing list archives

Site index · List index
Message view « Date » · « Thread »
Top « Date » · « Thread »
From pct...@apache.org
Subject Build failed in Jenkins: directory-fortress-commander #220
Date Wed, 20 Jul 2016 09:32:58 GMT
See <https://analysis.apache.org/jenkins/job/directory-fortress-commander/220/changes>

Changes:

[smckinney] add the jquery-ui css back

[smckinney] rename png file

[smckinney] rerun release steps

[smckinney] [maven-release-plugin] prepare release 1.0.1

[smckinney] release preps

[smckinney] [maven-release-plugin] prepare release 1.0.1

[smckinney] [maven-release-plugin] prepare for next development iteration

[smckinney] using .clear()

[smckinney] one more release prep 1.0.1

[smckinney] [maven-release-plugin] prepare release 1.0.1

[smckinney] [maven-release-plugin] prepare for next development iteration

------------------------------------------
Started by timer
Building in workspace <https://analysis.apache.org/jenkins/job/directory-fortress-commander/ws/>
Checkout:workspace / <https://analysis.apache.org/jenkins/job/directory-fortress-commander/ws/>
- hudson.remoting.LocalChannel@13c1c132
Using strategy: Default
Last Built Revision: Revision 6cec226badd2477c2ae78885370310724bcf66df (origin/master, origin/HEAD)
Fetching changes from 1 remote Git repository
Fetching upstream changes from origin
Seen branch in repository origin/1.0-RC41
Seen branch in repository origin/HEAD
Seen branch in repository origin/master
Seen 3 remote branches
Commencing build of Revision f3c91403c0ca32649b629eeda75cabd2f1fb3aea (origin/HEAD, origin/master)
Checking out Revision f3c91403c0ca32649b629eeda75cabd2f1fb3aea (origin/HEAD, origin/master)
Warning : There are multiple branch changesets here
Parsing POMs
[workspace] $ /x1/jenkins/jenkins-master/jenkins-home/tools/hudson.model.JDK/jdk1.7.0_65/bin/java
-Xms256m -Xmx512m -XX:+UseCompressedOops -XX:MaxPermSize=256m -cp /x1/jenkins/jenkins-master/jenkins-home/plugins/maven-plugin/WEB-INF/lib/maven3-agent-1.6.jar:/x1/jenkins/jenkins-master/jenkins-home/tools/hudson.tasks.Maven_MavenInstallation/maven-3.0.5/boot/plexus-classworlds-2.4.jar
org.jvnet.hudson.maven3.agent.Maven3Main /x1/jenkins/jenkins-master/jenkins-home/tools/hudson.tasks.Maven_MavenInstallation/maven-3.0.5
/x1/jenkins/jenkins-master/catalina-base/webapps/jenkins/WEB-INF/lib/remoting-2.36.jar /x1/jenkins/jenkins-master/jenkins-home/plugins/maven-plugin/WEB-INF/lib/maven3-interceptor-1.6.jar
/x1/jenkins/jenkins-master/jenkins-home/plugins/maven-plugin/WEB-INF/lib/maven3-interceptor-commons-1.6.jar
37189
<===[JENKINS REMOTING CAPACITY]===>   channel started
log4j:WARN No appenders could be found for logger (org.apache.commons.beanutils.converters.BooleanConverter).
log4j:WARN Please initialize the log4j system properly.
Executing Maven:  -B -f <https://analysis.apache.org/jenkins/job/directory-fortress-commander/ws/pom.xml>
clean install -U -DskipTests -fae
[INFO] Scanning for projects...
[INFO]                                                                         
[INFO] ------------------------------------------------------------------------
[INFO] Building Apache Fortress Web 1.0.2-SNAPSHOT
[INFO] ------------------------------------------------------------------------
Downloading: http://repo1.maven.org/maven2/org/apache/directory/fortress/fortress-realm-impl/1.0.1/fortress-realm-impl-1.0.1.pom
Downloading: http://repo.maven.apache.org/maven2/org/apache/directory/fortress/fortress-realm-impl/1.0.1/fortress-realm-impl-1.0.1.pom
[WARNING] The POM for org.apache.directory.fortress:fortress-realm-impl:jar:1.0.1 is missing,
no dependency information available
Downloading: http://repo1.maven.org/maven2/org/apache/directory/fortress/fortress-realm-impl/1.0.1/fortress-realm-impl-1.0.1.jar
Downloading: http://repo.maven.apache.org/maven2/org/apache/directory/fortress/fortress-realm-impl/1.0.1/fortress-realm-impl-1.0.1.jar
[INFO] ------------------------------------------------------------------------
[INFO] BUILD FAILURE
[INFO] ------------------------------------------------------------------------
[INFO] Total time: 9.970s
[INFO] Finished at: Wed Jul 20 09:32:57 UTC 2016
[INFO] Final Memory: 15M/246M
[INFO] ------------------------------------------------------------------------
Waiting for Jenkins to finish collecting data
[ERROR] Failed to execute goal on project fortress-web: Could not resolve dependencies for
project org.apache.directory.fortress:fortress-web:war:1.0.2-SNAPSHOT: Could not find artifact
org.apache.directory.fortress:fortress-realm-impl:jar:1.0.1 in maven2 (http://repo1.maven.org/maven2)
-> [Help 1]
[ERROR] 
[ERROR] To see the full stack trace of the errors, re-run Maven with the -e switch.
[ERROR] Re-run Maven using the -X switch to enable full debug logging.
[ERROR] 
[ERROR] For more information about the errors and possible solutions, please read the following
articles:
[ERROR] [Help 1] http://cwiki.apache.org/confluence/display/MAVEN/DependencyResolutionException
[JENKINS] Archiving <https://analysis.apache.org/jenkins/job/directory-fortress-commander/ws/pom.xml>
to org.apache.directory.fortress/fortress-web/1.0.2-SNAPSHOT/fortress-web-1.0.2-SNAPSHOT.pom
Sending e-mails to: notifications@directory.apache.org
channel stopped
Skipping sonar analysis due to bad build status FAILURE

Mime
View raw message