directory-notifications mailing list archives

Site index · List index
Message view « Date » · « Thread »
Top « Date » · « Thread »
From Apache Jenkins Server <jenk...@builds.apache.org>
Subject Build failed in Jenkins: dir-kerby-openjdk #41
Date Sat, 14 May 2016 22:36:53 GMT
See <https://builds.apache.org/job/dir-kerby-openjdk/41/changes>

Changes:

[jiajia.li] DIRKRB-569 Add unit test of multiple KDCs for a given realm in client.

------------------------------------------
Started by an SCM change
[EnvInject] - Loading node environment variables.
Building remotely on H11 (docker Ubuntu ubuntu yahoo-not-h2) in workspace <https://builds.apache.org/job/dir-kerby-openjdk/ws/>
 > git rev-parse --is-inside-work-tree # timeout=10
Fetching changes from the remote Git repository
 > git config remote.origin.url https://git-wip-us.apache.org/repos/asf/directory-kerby.git
# timeout=10
Fetching upstream changes from https://git-wip-us.apache.org/repos/asf/directory-kerby.git
 > git --version # timeout=10
 > git -c core.askpass=true fetch --tags --progress https://git-wip-us.apache.org/repos/asf/directory-kerby.git
+refs/heads/*:refs/remotes/origin/*
 > git rev-parse refs/remotes/origin/trunk^{commit} # timeout=10
 > git rev-parse refs/remotes/origin/origin/trunk^{commit} # timeout=10
Checking out Revision a412407061721d24db80c06546ceb9ccf18f9296 (refs/remotes/origin/trunk)
 > git config core.sparsecheckout # timeout=10
 > git checkout -f a412407061721d24db80c06546ceb9ccf18f9296
 > git rev-list 4bd0fb91fbdba4f3230e63309227affd6e6a6498 # timeout=10
Parsing POMs
Established TCP socket on 49393
maven3-agent.jar already up to date
maven3-interceptor.jar already up to date
maven3-interceptor-commons.jar already up to date
[dir-kerby-openjdk] $ /usr/lib/jvm/java-7-openjdk-amd64//bin/java -Xmx512m -XX:MaxPermSize=128m
-cp /home/jenkins/jenkins-slave/maven3-agent.jar:/home/jenkins/tools/maven/apache-maven-3.0.4/boot/plexus-classworlds-2.4.jar
org.jvnet.hudson.maven3.agent.Maven3Main /home/jenkins/tools/maven/apache-maven-3.0.4 /home/jenkins/jenkins-slave/slave.jar
/home/jenkins/jenkins-slave/maven3-interceptor.jar /home/jenkins/jenkins-slave/maven3-interceptor-commons.jar
49393
<===[JENKINS REMOTING CAPACITY]===>   channel started
Executing Maven:  -B -f <https://builds.apache.org/job/dir-kerby-openjdk/ws/pom.xml>
-Dmaven.repo.local=/home/jenkins/jenkins-slave/maven-repositories/1 -V clean deploy
Apache Maven 3.0.4 (r1232337; 2012-01-17 08:44:56+0000)
Maven home: /home/jenkins/tools/maven/apache-maven-3.0.4
Java version: 1.7.0_65, vendor: Oracle Corporation
Java home: /usr/lib/jvm/java-7-openjdk-amd64/jre
Default locale: en_US, platform encoding: ISO-8859-1
OS name: "linux", version: "3.13.0-36-lowlatency", arch: "amd64", family: "unix"
[INFO] Scanning for projects...
[INFO] ------------------------------------------------------------------------
[INFO] Reactor Build Order:
[INFO] 
[INFO] Apache Kerby Project
[INFO] Kerby-common Project
[INFO] Kerby ASN1 Project
[INFO] Kerby Config
[INFO] Kerby Util
[INFO] Kerby PKIX Project
[INFO] Kerby-kerb Project
[INFO] Kerby-kerb core
[INFO] Kerby-kerb Crypto
[INFO] Kerby-kerb Common
[INFO] Kerby-kerb Util
[INFO] Kerby-kerb Identity
[INFO] Kerby-kerb Identity Test
[INFO] Kerby-kerb Client
[INFO] Kerby-kerb Server
[INFO] Kerby-kerb Admin
[INFO] Kerb Simple Kdc
[INFO] Kerb Kdc Test
[INFO] Kerby providers
[INFO] Token provider
[INFO] Kerb Integration Test
[INFO] Kerby-kerb client api all
[INFO] Kerby-kerb server all
[INFO] Kerby KDC Server
[INFO] Kdc Tool Project
[INFO] Client Tool
[INFO] KDC Tool
[INFO] Kerby Backend
[INFO] Json identity backend
[INFO] Zookeeper identity backend
[INFO] Ldap identity backend
[INFO] Kerby Kdc Test
[INFO] Mavibot based backend
[INFO] Kerby Distribution
[INFO] KDC Dist
[INFO] Tool Dist
[INFO] Kerby benchmark
[INFO]                                                                         
[INFO] ------------------------------------------------------------------------
[INFO] Building Apache Kerby Project 1.0.0-RC3-SNAPSHOT
[INFO] ------------------------------------------------------------------------
[INFO] 
[INFO] --- maven-clean-plugin:2.5:clean (default-clean) @ kerby-all ---
[INFO] Deleting <https://builds.apache.org/job/dir-kerby-openjdk/ws/target>
[INFO] 
[INFO] --- maven-pmd-plugin:3.5:pmd (pmd) @ kerby-all ---
[INFO] 
[INFO] --- maven-pmd-plugin:3.5:check (validate) @ kerby-all ---
[INFO] 
[INFO] --- maven-checkstyle-plugin:2.17:check (validate) @ kerby-all ---
[INFO] 
[INFO] --- maven-remote-resources-plugin:1.5:process (default) @ kerby-all ---
[INFO] 
[INFO] --- maven-site-plugin:3.4:attach-descriptor (attach-descriptor) @ kerby-all ---
[INFO] 
[INFO] --- maven-pmd-plugin:3.5:pmd (pmd) @ kerby-all ---
[INFO] 
[INFO] --- maven-pmd-plugin:3.5:check (validate) @ kerby-all ---
[INFO] 
[INFO] --- maven-checkstyle-plugin:2.17:check (validate) @ kerby-all ---
[WARNING] Failed to getClass for org.apache.maven.plugin.source.SourceJarMojo
[INFO] 
[INFO] --- maven-source-plugin:2.4:jar (attach-sources) @ kerby-all ---
[INFO] 
[INFO] --- maven-install-plugin:2.5.2:install (default-install) @ kerby-all ---
[INFO] Installing <https://builds.apache.org/job/dir-kerby-openjdk/ws/pom.xml> to /home/jenkins/jenkins-slave/maven-repositories/1/org/apache/kerby/kerby-all/1.0.0-RC3-SNAPSHOT/kerby-all-1.0.0-RC3-SNAPSHOT.pom
[INFO] 
[INFO] --- maven-deploy-plugin:2.8.2:deploy (default-deploy) @ kerby-all ---
Downloading: https://repository.apache.org/content/repositories/snapshots/org/apache/kerby/kerby-all/1.0.0-RC3-SNAPSHOT/maven-metadata.xml
[WARNING] Could not transfer metadata org.apache.kerby:kerby-all:1.0.0-RC3-SNAPSHOT/maven-metadata.xml
from/to apache.snapshots.https (https://repository.apache.org/content/repositories/snapshots):
Failed to transfer file: https://repository.apache.org/content/repositories/snapshots/org/apache/kerby/kerby-all/1.0.0-RC3-SNAPSHOT/maven-metadata.xml.
Return code is: 503, ReasonPhrase:Service Unavailable.
[JENKINS] Archiving disabled
[INFO] ------------------------------------------------------------------------
[INFO] Reactor Summary:
[INFO] 
[INFO] Apache Kerby Project .............................. FAILURE [7.974s]
[INFO] Kerby-common Project .............................. SKIPPED
[INFO] Kerby ASN1 Project ................................ SKIPPED
[INFO] Kerby Config ...................................... SKIPPED
[INFO] Kerby Util ........................................ SKIPPED
[INFO] Kerby PKIX Project ................................ SKIPPED
[INFO] Kerby-kerb Project ................................ SKIPPED
[INFO] Kerby-kerb core ................................... SKIPPED
[INFO] Kerby-kerb Crypto ................................. SKIPPED
[INFO] Kerby-kerb Common ................................. SKIPPED
[INFO] Kerby-kerb Util ................................... SKIPPED
[INFO] Kerby-kerb Identity ............................... SKIPPED
[INFO] Kerby-kerb Identity Test .......................... SKIPPED
[INFO] Kerby-kerb Client ................................. SKIPPED
[INFO] Kerby-kerb Server ................................. SKIPPED
[INFO] Kerby-kerb Admin .................................. SKIPPED
[INFO] Kerb Simple Kdc ................................... SKIPPED
[INFO] Kerb Kdc Test ..................................... SKIPPED
[INFO] Kerby providers ................................... SKIPPED
[INFO] Token provider .................................... SKIPPED
[INFO] Kerb Integration Test ............................. SKIPPED
[INFO] Kerby-kerb client api all ......................... SKIPPED
[INFO] Kerby-kerb server all ............................. SKIPPED
[INFO] Kerby KDC Server .................................. SKIPPED
[INFO] Kdc Tool Project .................................. SKIPPED
[INFO] Client Tool ....................................... SKIPPED
[INFO] KDC Tool .......................................... SKIPPED
[INFO] Kerby Backend ..................................... SKIPPED
[INFO] Json identity backend ............................. SKIPPED
[INFO] Zookeeper identity backend ........................ SKIPPED
[INFO] Ldap identity backend ............................. SKIPPED
[INFO] Kerby Kdc Test .................................... SKIPPED
[INFO] Mavibot based backend ............................. SKIPPED
[INFO] Kerby Distribution ................................ SKIPPED
[INFO] KDC Dist .......................................... SKIPPED
[INFO] Tool Dist ......................................... SKIPPED
[INFO] Kerby benchmark ................................... SKIPPED
[INFO] ------------------------------------------------------------------------
[INFO] BUILD FAILURE
[INFO] ------------------------------------------------------------------------
[INFO] Total time: 9.639s
[INFO] Finished at: Sat May 14 22:36:52 UTC 2016
[INFO] Final Memory: 28M/491M
[INFO] ------------------------------------------------------------------------
[JENKINS] Archiving disabled
[JENKINS] Archiving disabled
[JENKINS] Archiving disabled
[JENKINS] Archiving disabled
[JENKINS] Archiving disabled
[JENKINS] Archiving disabled
[JENKINS] Archiving disabled
[JENKINS] Archiving disabled
[JENKINS] Archiving disabled
[JENKINS] Archiving disabled
[JENKINS] Archiving disabled
[JENKINS] Archiving disabled
[JENKINS] Archiving disabled
[JENKINS] Archiving disabled
[JENKINS] Archiving disabled
[JENKINS] Archiving disabled
[JENKINS] Archiving disabled
[JENKINS] Archiving disabled
[JENKINS] Archiving disabled
[JENKINS] Archiving disabled
[JENKINS] Archiving disabled
[JENKINS] Archiving disabled
[JENKINS] Archiving disabled
[JENKINS] Archiving disabled
[JENKINS] Archiving disabled
[JENKINS] Archiving disabled
[JENKINS] Archiving disabled
[JENKINS] Archiving disabled
[JENKINS] Archiving disabled
[JENKINS] Archiving disabled
[JENKINS] Archiving disabled
[JENKINS] Archiving disabled
[JENKINS] Archiving disabled
[JENKINS] Archiving disabled
[JENKINS] Archiving disabled
[JENKINS] Archiving disabled
[JENKINS] Archiving disabled
Waiting for Jenkins to finish collecting data[ERROR] Failed to execute goal org.apache.maven.plugins:maven-deploy-plugin:2.8.2:deploy
(default-deploy) on project kerby-all: Failed to retrieve remote metadata org.apache.kerby:kerby-all:1.0.0-RC3-SNAPSHOT/maven-metadata.xml:
Could not transfer metadata org.apache.kerby:kerby-all:1.0.0-RC3-SNAPSHOT/maven-metadata.xml
from/to apache.snapshots.https (https://repository.apache.org/content/repositories/snapshots):
Failed to transfer file: https://repository.apache.org/content/repositories/snapshots/org/apache/kerby/kerby-all/1.0.0-RC3-SNAPSHOT/maven-metadata.xml.
Return code is: 503, ReasonPhrase:Service Unavailable. -> [Help 1]
[ERROR] 
[ERROR] To see the full stack trace of the errors, re-run Maven with the -e switch.
[ERROR] Re-run Maven using the -X switch to enable full debug logging.
[ERROR] 
[ERROR] For more information about the errors and possible solutions, please read the following
articles:
[ERROR] [Help 1] http://cwiki.apache.org/confluence/display/MAVEN/MojoExecutionException

channel stopped

Mime
View raw message