directory-notifications mailing list archives

Site index · List index
Message view « Date » · « Thread »
Top « Date » · « Thread »
From Apache Jenkins Server <jenk...@builds.apache.org>
Subject Build failed in Jenkins: dir-apacheds-ubuntu-deploy #1906
Date Mon, 16 May 2016 12:48:40 GMT
See <https://builds.apache.org/job/dir-apacheds-ubuntu-deploy/1906/>

------------------------------------------
[...truncated 4043 lines...]
[INFO] Installing <https://builds.apache.org/job/dir-apacheds-ubuntu-deploy/ws/trunk/core-api/target/apacheds-core-api-2.0.0-M22-SNAPSHOT.jar>
to /home/jenkins/jenkins-slave/maven-repositories/2/org/apache/directory/server/apacheds-core-api/2.0.0-M22-SNAPSHOT/apacheds-core-api-2.0.0-M22-SNAPSHOT.jar
[INFO] Installing <https://builds.apache.org/job/dir-apacheds-ubuntu-deploy/ws/trunk/core-api/pom.xml>
to /home/jenkins/jenkins-slave/maven-repositories/2/org/apache/directory/server/apacheds-core-api/2.0.0-M22-SNAPSHOT/apacheds-core-api-2.0.0-M22-SNAPSHOT.pom
[INFO] Installing <https://builds.apache.org/job/dir-apacheds-ubuntu-deploy/ws/trunk/core-api/target/apacheds-core-api-2.0.0-M22-SNAPSHOT-tests.jar>
to /home/jenkins/jenkins-slave/maven-repositories/2/org/apache/directory/server/apacheds-core-api/2.0.0-M22-SNAPSHOT/apacheds-core-api-2.0.0-M22-SNAPSHOT-tests.jar
[INFO] Installing <https://builds.apache.org/job/dir-apacheds-ubuntu-deploy/ws/trunk/core-api/target/apacheds-core-api-2.0.0-M22-SNAPSHOT-sources.jar>
to /home/jenkins/jenkins-slave/maven-repositories/2/org/apache/directory/server/apacheds-core-api/2.0.0-M22-SNAPSHOT/apacheds-core-api-2.0.0-M22-SNAPSHOT-sources.jar
[INFO] 
[INFO] --- maven-bundle-plugin:2.5.3:install (default-install) @ apacheds-core-api ---
[INFO] Installing org/apache/directory/server/apacheds-core-api/2.0.0-M22-SNAPSHOT/apacheds-core-api-2.0.0-M22-SNAPSHOT.jar
[INFO] Writing OBR metadata
[INFO] 
[INFO] --- maven-deploy-plugin:2.8.2:deploy (default-deploy) @ apacheds-core-api ---
Downloading: https://repository.apache.org/content/repositories/snapshots/org/apache/directory/server/apacheds-core-api/2.0.0-M22-SNAPSHOT/maven-metadata.xml
Downloaded: https://repository.apache.org/content/repositories/snapshots/org/apache/directory/server/apacheds-core-api/2.0.0-M22-SNAPSHOT/maven-metadata.xml
(2 KB at 0.0 KB/sec)
Uploading: https://repository.apache.org/content/repositories/snapshots/org/apache/directory/server/apacheds-core-api/2.0.0-M22-SNAPSHOT/apacheds-core-api-2.0.0-M22-20160516.124337-38.jar
Uploaded: https://repository.apache.org/content/repositories/snapshots/org/apache/directory/server/apacheds-core-api/2.0.0-M22-SNAPSHOT/apacheds-core-api-2.0.0-M22-20160516.124337-38.jar
(248 KB at 20.1 KB/sec)
Uploading: https://repository.apache.org/content/repositories/snapshots/org/apache/directory/server/apacheds-core-api/2.0.0-M22-SNAPSHOT/apacheds-core-api-2.0.0-M22-20160516.124337-38.pom
Uploaded: https://repository.apache.org/content/repositories/snapshots/org/apache/directory/server/apacheds-core-api/2.0.0-M22-SNAPSHOT/apacheds-core-api-2.0.0-M22-20160516.124337-38.pom
(5 KB at 3.7 KB/sec)
Downloading: https://repository.apache.org/content/repositories/snapshots/org/apache/directory/server/apacheds-core-api/maven-metadata.xml
Downloaded: https://repository.apache.org/content/repositories/snapshots/org/apache/directory/server/apacheds-core-api/maven-metadata.xml
(412 B at 0.0 KB/sec)
Uploading: https://repository.apache.org/content/repositories/snapshots/org/apache/directory/server/apacheds-core-api/2.0.0-M22-SNAPSHOT/maven-metadata.xml
Uploaded: https://repository.apache.org/content/repositories/snapshots/org/apache/directory/server/apacheds-core-api/2.0.0-M22-SNAPSHOT/maven-metadata.xml
(2 KB at 0.1 KB/sec)
Uploading: https://repository.apache.org/content/repositories/snapshots/org/apache/directory/server/apacheds-core-api/maven-metadata.xml
Uploaded: https://repository.apache.org/content/repositories/snapshots/org/apache/directory/server/apacheds-core-api/maven-metadata.xml
(412 B at 0.7 KB/sec)
Uploading: https://repository.apache.org/content/repositories/snapshots/org/apache/directory/server/apacheds-core-api/2.0.0-M22-SNAPSHOT/apacheds-core-api-2.0.0-M22-20160516.124337-38-tests.jar
Uploaded: https://repository.apache.org/content/repositories/snapshots/org/apache/directory/server/apacheds-core-api/2.0.0-M22-SNAPSHOT/apacheds-core-api-2.0.0-M22-20160516.124337-38-tests.jar
(60 KB at 53.3 KB/sec)
Uploading: https://repository.apache.org/content/repositories/snapshots/org/apache/directory/server/apacheds-core-api/2.0.0-M22-SNAPSHOT/maven-metadata.xml
Uploaded: https://repository.apache.org/content/repositories/snapshots/org/apache/directory/server/apacheds-core-api/2.0.0-M22-SNAPSHOT/maven-metadata.xml
(2 KB at 0.6 KB/sec)
Uploading: https://repository.apache.org/content/repositories/snapshots/org/apache/directory/server/apacheds-core-api/2.0.0-M22-SNAPSHOT/apacheds-core-api-2.0.0-M22-20160516.124337-38-sources.jar
Uploaded: https://repository.apache.org/content/repositories/snapshots/org/apache/directory/server/apacheds-core-api/2.0.0-M22-SNAPSHOT/apacheds-core-api-2.0.0-M22-20160516.124337-38-sources.jar
(256 KB at 122.5 KB/sec)
Uploading: https://repository.apache.org/content/repositories/snapshots/org/apache/directory/server/apacheds-core-api/2.0.0-M22-SNAPSHOT/maven-metadata.xml
Uploaded: https://repository.apache.org/content/repositories/snapshots/org/apache/directory/server/apacheds-core-api/2.0.0-M22-SNAPSHOT/maven-metadata.xml
(2 KB at 7.6 KB/sec)
[INFO] 
[INFO] --- maven-bundle-plugin:2.5.3:deploy (default-deploy) @ apacheds-core-api ---
[INFO] Remote OBR update disabled (enable with -DremoteOBR)
[JENKINS] Archiving disabled
[INFO]                                                                         
[INFO] ------------------------------------------------------------------------
[INFO] Building ApacheDS Core Shared 2.0.0-M22-SNAPSHOT
[INFO] ------------------------------------------------------------------------
[INFO] 
[INFO] --- maven-clean-plugin:2.6.1:clean (default-clean) @ apacheds-core-shared ---
[INFO] 
[INFO] --- maven-checkstyle-plugin:2.16:check (validate) @ apacheds-core-shared ---
[INFO] 
[INFO] --- maven-remote-resources-plugin:1.5:process (default) @ apacheds-core-shared ---
[INFO] 
[INFO] --- maven-resources-plugin:2.7:resources (default-resources) @ apacheds-core-shared
---
[INFO] Using 'UTF-8' encoding to copy filtered resources.
[INFO] Copying 1 resource
[INFO] Copying 3 resources
[INFO] 
[INFO] --- maven-compiler-plugin:3.3:compile (default-compile) @ apacheds-core-shared ---
[INFO] Changes detected - recompiling the module!
[INFO] Compiling 9 source files to <https://builds.apache.org/job/dir-apacheds-ubuntu-deploy/ws/trunk/core-shared/target/classes>
[INFO] <https://builds.apache.org/job/dir-apacheds-ubuntu-deploy/ws/trunk/core-shared/src/main/java/org/apache/directory/server/core/shared/SortedEntryComparator.java>:
Some input files use unchecked or unsafe operations.
[INFO] <https://builds.apache.org/job/dir-apacheds-ubuntu-deploy/ws/trunk/core-shared/src/main/java/org/apache/directory/server/core/shared/SortedEntryComparator.java>:
Recompile with -Xlint:unchecked for details.
[INFO] 
[INFO] --- maven-resources-plugin:2.7:testResources (default-testResources) @ apacheds-core-shared
---
[INFO] Using 'UTF-8' encoding to copy filtered resources.
[INFO] skip non existing resourceDirectory <https://builds.apache.org/job/dir-apacheds-ubuntu-deploy/ws/trunk/core-shared/src/test/resources>
[INFO] Copying 3 resources
[INFO] 
[INFO] --- maven-compiler-plugin:3.3:testCompile (default-testCompile) @ apacheds-core-shared
---
[INFO] Nothing to compile - all classes are up to date
[INFO] 
[INFO] --- maven-surefire-plugin:2.18.1:test (default-test) @ apacheds-core-shared ---
[JENKINS] Recording test results[INFO] 

[INFO] --- maven-bundle-plugin:2.5.3:bundle (default-bundle) @ apacheds-core-shared ---
[INFO] 
[INFO] --- maven-site-plugin:3.4:attach-descriptor (attach-descriptor) @ apacheds-core-shared
---
[INFO] 
[INFO] --- maven-jar-plugin:2.6:test-jar (attach-tests) @ apacheds-core-shared ---
[INFO] Building jar: <https://builds.apache.org/job/dir-apacheds-ubuntu-deploy/ws/trunk/core-shared/target/apacheds-core-shared-2.0.0-M22-SNAPSHOT-tests.jar>
[INFO] 
[INFO] --- tools-maven-plugin:1.4:verify-legal-files (verify-legal-files) @ apacheds-core-shared
---
[INFO] Checking legal files in: apacheds-core-shared-2.0.0-M22-SNAPSHOT.jar
[INFO] Checking legal files in: apacheds-core-shared-2.0.0-M22-SNAPSHOT-tests.jar
[INFO] 
[INFO] --- maven-checkstyle-plugin:2.16:check (validate) @ apacheds-core-shared ---
[WARNING] Failed to getClass for org.apache.maven.plugin.source.SourceJarMojo
[INFO] 
[INFO] --- maven-source-plugin:2.4:jar (attach-sources) @ apacheds-core-shared ---
[INFO] Building jar: <https://builds.apache.org/job/dir-apacheds-ubuntu-deploy/ws/trunk/core-shared/target/apacheds-core-shared-2.0.0-M22-SNAPSHOT-sources.jar>
[INFO] 
[INFO] --- maven-install-plugin:2.5.2:install (default-install) @ apacheds-core-shared ---
[INFO] Installing <https://builds.apache.org/job/dir-apacheds-ubuntu-deploy/ws/trunk/core-shared/target/apacheds-core-shared-2.0.0-M22-SNAPSHOT.jar>
to /home/jenkins/jenkins-slave/maven-repositories/2/org/apache/directory/server/apacheds-core-shared/2.0.0-M22-SNAPSHOT/apacheds-core-shared-2.0.0-M22-SNAPSHOT.jar
[INFO] Installing <https://builds.apache.org/job/dir-apacheds-ubuntu-deploy/ws/trunk/core-shared/pom.xml>
to /home/jenkins/jenkins-slave/maven-repositories/2/org/apache/directory/server/apacheds-core-shared/2.0.0-M22-SNAPSHOT/apacheds-core-shared-2.0.0-M22-SNAPSHOT.pom
[INFO] Installing <https://builds.apache.org/job/dir-apacheds-ubuntu-deploy/ws/trunk/core-shared/target/apacheds-core-shared-2.0.0-M22-SNAPSHOT-tests.jar>
to /home/jenkins/jenkins-slave/maven-repositories/2/org/apache/directory/server/apacheds-core-shared/2.0.0-M22-SNAPSHOT/apacheds-core-shared-2.0.0-M22-SNAPSHOT-tests.jar
[INFO] Installing <https://builds.apache.org/job/dir-apacheds-ubuntu-deploy/ws/trunk/core-shared/target/apacheds-core-shared-2.0.0-M22-SNAPSHOT-sources.jar>
to /home/jenkins/jenkins-slave/maven-repositories/2/org/apache/directory/server/apacheds-core-shared/2.0.0-M22-SNAPSHOT/apacheds-core-shared-2.0.0-M22-SNAPSHOT-sources.jar
[INFO] 
[INFO] --- maven-bundle-plugin:2.5.3:install (default-install) @ apacheds-core-shared ---
[INFO] Installing org/apache/directory/server/apacheds-core-shared/2.0.0-M22-SNAPSHOT/apacheds-core-shared-2.0.0-M22-SNAPSHOT.jar
[INFO] Writing OBR metadata
[INFO] 
[INFO] --- maven-deploy-plugin:2.8.2:deploy (default-deploy) @ apacheds-core-shared ---
Downloading: https://repository.apache.org/content/repositories/snapshots/org/apache/directory/server/apacheds-core-shared/2.0.0-M22-SNAPSHOT/maven-metadata.xml
Downloaded: https://repository.apache.org/content/repositories/snapshots/org/apache/directory/server/apacheds-core-shared/2.0.0-M22-SNAPSHOT/maven-metadata.xml
(2 KB at 0.0 KB/sec)
Uploading: https://repository.apache.org/content/repositories/snapshots/org/apache/directory/server/apacheds-core-shared/2.0.0-M22-SNAPSHOT/apacheds-core-shared-2.0.0-M22-20160516.124528-38.jar
Uploaded: https://repository.apache.org/content/repositories/snapshots/org/apache/directory/server/apacheds-core-shared/2.0.0-M22-SNAPSHOT/apacheds-core-shared-2.0.0-M22-20160516.124528-38.jar
(48 KB at 42.5 KB/sec)
Uploading: https://repository.apache.org/content/repositories/snapshots/org/apache/directory/server/apacheds-core-shared/2.0.0-M22-SNAPSHOT/apacheds-core-shared-2.0.0-M22-20160516.124528-38.pom
Uploaded: https://repository.apache.org/content/repositories/snapshots/org/apache/directory/server/apacheds-core-shared/2.0.0-M22-SNAPSHOT/apacheds-core-shared-2.0.0-M22-20160516.124528-38.pom
(5 KB at 3.8 KB/sec)
Downloading: https://repository.apache.org/content/repositories/snapshots/org/apache/directory/server/apacheds-core-shared/maven-metadata.xml
Downloaded: https://repository.apache.org/content/repositories/snapshots/org/apache/directory/server/apacheds-core-shared/maven-metadata.xml
(415 B at 0.2 KB/sec)
Uploading: https://repository.apache.org/content/repositories/snapshots/org/apache/directory/server/apacheds-core-shared/2.0.0-M22-SNAPSHOT/maven-metadata.xml
Uploaded: https://repository.apache.org/content/repositories/snapshots/org/apache/directory/server/apacheds-core-shared/2.0.0-M22-SNAPSHOT/maven-metadata.xml
(2 KB at 0.0 KB/sec)
Uploading: https://repository.apache.org/content/repositories/snapshots/org/apache/directory/server/apacheds-core-shared/maven-metadata.xml
Uploaded: https://repository.apache.org/content/repositories/snapshots/org/apache/directory/server/apacheds-core-shared/maven-metadata.xml
(415 B at 0.1 KB/sec)
Uploading: https://repository.apache.org/content/repositories/snapshots/org/apache/directory/server/apacheds-core-shared/2.0.0-M22-SNAPSHOT/apacheds-core-shared-2.0.0-M22-20160516.124528-38-tests.jar
Uploaded: https://repository.apache.org/content/repositories/snapshots/org/apache/directory/server/apacheds-core-shared/2.0.0-M22-SNAPSHOT/apacheds-core-shared-2.0.0-M22-20160516.124528-38-tests.jar
(7 KB at 1.7 KB/sec)
Uploading: https://repository.apache.org/content/repositories/snapshots/org/apache/directory/server/apacheds-core-shared/2.0.0-M22-SNAPSHOT/maven-metadata.xml
Uploaded: https://repository.apache.org/content/repositories/snapshots/org/apache/directory/server/apacheds-core-shared/2.0.0-M22-SNAPSHOT/maven-metadata.xml
(2 KB at 0.0 KB/sec)
Uploading: https://repository.apache.org/content/repositories/snapshots/org/apache/directory/server/apacheds-core-shared/2.0.0-M22-SNAPSHOT/apacheds-core-shared-2.0.0-M22-20160516.124528-38-sources.jar
[JENKINS] Archiving disabled
[INFO] ------------------------------------------------------------------------
[INFO] Reactor Summary:
[INFO] 
[INFO] ApacheDS .......................................... SUCCESS [1:48.152s]
[INFO] ApacheDS I18n ..................................... SUCCESS [1:48.938s]
[INFO] ApacheDS Core Constants ........................... SUCCESS [1:33.385s]
[INFO] ApacheDS Core API ................................. SUCCESS [6:24.328s]
[INFO] ApacheDS Core Shared .............................. FAILURE [3:23.617s]
[INFO] ApacheDS Interceptors ............................. SKIPPED
[INFO] ApacheDS AdministrativePoint Interceptor .......... SKIPPED
[INFO] ApacheDS Authentication Interceptor ............... SKIPPED
[INFO] ApacheDS Interceptor to increment numeric attributes  SKIPPED
[INFO] ApacheDS Authorization Interceptor ................ SKIPPED
[INFO] ApacheDS ChangeLog Interceptor .................... SKIPPED
[INFO] ApacheDS Collective Attribute Interceptor ......... SKIPPED
[INFO] ApacheDS Event Interceptor ........................ SKIPPED
[INFO] ApacheDS Exception Interceptor .................... SKIPPED
[INFO] ApacheDS Journal Interceptor ...................... SKIPPED
[INFO] ApacheDS Normalization Interceptor ................ SKIPPED
[INFO] ApacheDS Operational Attribute Interceptor ........ SKIPPED
[INFO] ApacheDS Referral Interceptor ..................... SKIPPED
[INFO] ApacheDS Schema Interceptor ....................... SKIPPED
[INFO] ApacheDS Subtree Interceptor ...................... SKIPPED
[INFO] ApacheDS Triggers Interceptor ..................... SKIPPED
[INFO] ApacheDS Core ..................................... SKIPPED
[INFO] ApacheDS Core AVL ................................. SKIPPED
[INFO] ApacheDS Generalized (X) DBM Partition ............ SKIPPED
[INFO] ApacheDS LDIF Partition ........................... SKIPPED
[INFO] ApacheDS JDBM Partition ........................... SKIPPED
[INFO] ApacheDS Mavibot Partition ........................ SKIPPED
[INFO] ApacheDS Core Annotations ......................... SKIPPED
[INFO] ApacheDS Core JNDI ................................ SKIPPED
[INFO] ApacheDS Protocol Kerberos Codec .................. SKIPPED
[INFO] ApacheDS Interceptors for Kerberos ................ SKIPPED
[INFO] ApacheDS Protocol Dhcp ............................ SKIPPED
[INFO] ApacheDS Protocol Shared .......................... SKIPPED
[INFO] ApacheDS Protocol Dns ............................. SKIPPED
[INFO] ApacheDS Protocol Kerberos ........................ SKIPPED
[INFO] ApacheDS Protocol Ldap ............................ SKIPPED
[INFO] ApacheDS Protocol Ntp ............................. SKIPPED
[INFO] Apacheds Server Annotations ....................... SKIPPED
[INFO] ApacheDS Server Config ............................ SKIPPED
[INFO] ApacheDS Server JNDI .............................. SKIPPED
[INFO] ApacheDS Test Framework ........................... SKIPPED
[INFO] ApacheDS All ...................................... SKIPPED
[INFO] ApacheDS Logger Interceptor ....................... SKIPPED
[INFO] ApacheDS Password Hashing Interceptor ............. SKIPPED
[INFO] ApacheDS Core Integration ......................... SKIPPED
[INFO] ApacheDS Protocol Kerberos Test ................... SKIPPED
[INFO] ApacheDS Server Integration ....................... SKIPPED
[INFO] ApacheDS DirectoryService-WebApp bridge ........... SKIPPED
[INFO] ApacheDS Jetty HTTP Server Integration ............ SKIPPED
[INFO] ApacheDS Service Builder .......................... SKIPPED
[INFO] Apache Directory LDAP Client API test ............. SKIPPED
[INFO] kerberos-client ................................... SKIPPED
[INFO] ApacheDS Service .................................. SKIPPED
[INFO] ApacheDS Wrapper .................................. SKIPPED
[INFO] ApacheDS Installers Maven Plugin .................. SKIPPED
[INFO] ApacheDS Installers ............................... SKIPPED
[INFO] ApacheDS OSGi Integration Tests ................... SKIPPED
[INFO] ------------------------------------------------------------------------
[INFO] BUILD FAILURE
[INFO] ------------------------------------------------------------------------
[INFO] Total time: 15:02.429s
[INFO] Finished at: Mon May 16 12:48:01 UTC 2016
[INFO] Final Memory: 52M/371M
[INFO] ------------------------------------------------------------------------
[JENKINS] Archiving disabled
[JENKINS] Archiving disabled
[JENKINS] Archiving disabled
[JENKINS] Archiving disabled
[JENKINS] Archiving disabled
[JENKINS] Archiving disabled
[JENKINS] Archiving disabled
[JENKINS] Archiving disabled
[JENKINS] Archiving disabled
[JENKINS] Archiving disabled
[JENKINS] Archiving disabled
[JENKINS] Archiving disabled
[JENKINS] Archiving disabled
[JENKINS] Archiving disabled
[JENKINS] Archiving disabled
[JENKINS] Archiving disabled
[JENKINS] Archiving disabled
[JENKINS] Archiving disabled
[JENKINS] Archiving disabled
[JENKINS] Archiving disabled
[JENKINS] Archiving disabled
[JENKINS] Archiving disabled
[JENKINS] Archiving disabled
[JENKINS] Archiving disabled
[JENKINS] Archiving disabled
[JENKINS] Archiving disabled
[JENKINS] Archiving disabled
[JENKINS] Archiving disabled
[JENKINS] Archiving disabled
[JENKINS] Archiving disabled
[JENKINS] Archiving disabled
[JENKINS] Archiving disabled
[JENKINS] Archiving disabled
[JENKINS] Archiving disabled
[JENKINS] Archiving disabled
[JENKINS] Archiving disabled
[JENKINS] Archiving disabled
[JENKINS] Archiving disabled
[JENKINS] Archiving disabled
[JENKINS] Archiving disabled
[JENKINS] Archiving disabled
[JENKINS] Archiving disabled
[JENKINS] Archiving disabled
[JENKINS] Archiving disabled
[JENKINS] Archiving disabled
[JENKINS] Archiving disabled
[JENKINS] Archiving disabled
[JENKINS] Archiving disabled
[JENKINS] Archiving disabled
[JENKINS] Archiving disabled
[JENKINS] Archiving disabled
[JENKINS] Archiving disabled
[JENKINS] Archiving disabled
[JENKINS] Archiving disabled
[JENKINS] Archiving disabled
[JENKINS] Archiving disabled
[JENKINS] Archiving disabled
Waiting for Jenkins to finish collecting data
[ERROR] Failed to execute goal org.apache.maven.plugins:maven-deploy-plugin:2.8.2:deploy (default-deploy)
on project apacheds-core-shared: Failed to deploy artifacts: Could not transfer artifact org.apache.directory.server:apacheds-core-shared:jar:sources:2.0.0-M22-20160516.124528-38
from/to apache.snapshots.https (https://repository.apache.org/content/repositories/snapshots):
Failed to transfer file: https://repository.apache.org/content/repositories/snapshots/org/apache/directory/server/apacheds-core-shared/2.0.0-M22-SNAPSHOT/apacheds-core-shared-2.0.0-M22-20160516.124528-38-sources.jar.
Return code is: 502, ReasonPhrase:Proxy Error. -> [Help 1]
[ERROR] 
[ERROR] To see the full stack trace of the errors, re-run Maven with the -e switch.
[ERROR] Re-run Maven using the -X switch to enable full debug logging.
[ERROR] 
[ERROR] For more information about the errors and possible solutions, please read the following
articles:
[ERROR] [Help 1] http://cwiki.apache.org/confluence/display/MAVEN/MojoExecutionException
[ERROR] 
[ERROR] After correcting the problems, you can resume the build with the command
[ERROR]   mvn <goals> -rf :apacheds-core-shared
channel stopped

Mime
View raw message