directory-notifications mailing list archives

Site index · List index
Message view « Date » · « Thread »
Top « Date » · « Thread »
From pct...@apache.org
Subject Build failed in Jenkins: directory-fortress-enmasse #40
Date Wed, 18 May 2016 07:50:07 GMT
See <https://analysis.apache.org/jenkins/job/directory-fortress-enmasse/40/changes>

Changes:

[smckinney] FC-109 - use new package structure

[smckinney] upgrade to cxf latest for v2

[smckinney]  FC-128 - ReviewMgr.rolePermissions needs non-hierarchical option

[smckinney]  FC-130 - Add permission search that uses substring filters

[smckinney]  FC-131 -  new findPermissions returns all operations by perm object

[elecharny] Fixed some Java 8 javadoc errors

[elecharny] Some more Javadoc cleanup

[elecharny] Some more javadoc fixes

[smckinney] FC-132 - Fix javadoc issues

[smckinney] FC-132 - Fix javadoc issues

[elecharny] Recovered the file deleted by mistake during a merge

[smckinney] FC-137 - Add system properties in tests kicked off by maven

[smckinney] update readme

[smckinney] image added to readme

[smckinney] cleanup

[smckinney] cleanup

[smckinney] improve readme

[smckinney] cleanup

[smckinney] cleanup

[smckinney] cleanup

[smckinney] cleanup

[smckinney] readme prereqs

[smckinney] readme prereqs

[smckinney] readme prereqs

[smckinney] readme prereqs

[smckinney] readme props

[smckinney] readme proxy lib

[elecharny] added the needed apache header

[elecharny] Prepared the pom for the release

[elecharny] [maven-release-plugin] prepare release 1.0-RC42

[elecharny] [maven-release-plugin] rollback the release of 1.0-RC42

[elecharny] Fixed the scm link

[elecharny] [maven-release-plugin] prepare release 1.0-RC42

[elecharny] [maven-release-plugin] prepare for next development iteration

[elecharny] [maven-release-plugin] rollback the release of 1.0-RC42

[smckinney] Release preps

[smckinney] Release preps

[smckinney] Release preps

[smckinney] [maven-release-plugin] prepare release 1.0-RC42

[smckinney] Release preps

[smckinney] [maven-release-plugin] prepare release 1.0-RC42

[smckinney] [maven-release-plugin] prepare for next development iteration

[smckinney] Release preps

[smckinney] [maven-release-plugin] prepare release 1.0-RC42

[smckinney] [maven-release-plugin] prepare for next development iteration

[smckinney] release preps

[smckinney] [maven-release-plugin] prepare release 1.0-RC42

[smckinney] release preps

[smckinney] [maven-release-plugin] prepare release 1.0-RC42

[smckinney] [maven-release-plugin] prepare for next development iteration

[smckinney] revert to 1.0-RC42-SNAPSHOT

[smckinney] revert to 1.0-RC42-SNAPSHOT

[mail] Fix legal files.

[smckinney] release rollback

[smckinney] [maven-release-plugin] prepare release 1.0-RC42

[smckinney] [maven-release-plugin] prepare for next development iteration

[smckinney] remove unneeded dependency

[smckinney] change method name from findPermissions to findPermsByObj

[smckinney] remove old intellij file

[smckinney] 1.0.0 release preps

[smckinney] 1.0.0 release preps

[smckinney]  FC-131 - new findPermissions returns all operations by perm object

[smckinney] [maven-release-plugin] prepare release 1.0.0

[smckinney] [maven-release-plugin] prepare for next development iteration

[smckinney]  1.0.0 release preps

[smckinney] [maven-release-plugin] prepare release 1.0.0

[smckinney] [maven-release-plugin] prepare for next development iteration

[smckinney] add quickstart

[smckinney] doc cleanup

[smckinney] use the latest links

[smckinney] add test section

[smckinney] simplify steps

[smckinney] alternate testing procedure

[smckinney] fix the load step

[smckinney] cleanup

[smckinney] cleanup

[smckinney] cleanup

[smckinney] remove unneeded maven assembly config

[smckinney] use realm v1.0.1-SNAPSHOT

------------------------------------------
Started by timer
Building in workspace <https://analysis.apache.org/jenkins/job/directory-fortress-enmasse/ws/>
Checkout:workspace / <https://analysis.apache.org/jenkins/job/directory-fortress-enmasse/ws/>
- hudson.remoting.LocalChannel@51a4d273
Using strategy: Default
Last Built Revision: Revision f83d9364b839b63afda6ab278168811aeb6b6f18 (origin/master, origin/HEAD)
Fetching changes from 1 remote Git repository
Fetching upstream changes from origin
Seen branch in repository origin/1.0-RC41
Seen branch in repository origin/HEAD
Seen branch in repository origin/master
Seen 3 remote branches
Commencing build of Revision 55bb0c1f5a62e513a7028f76bd2fd24f2e84a87c (origin/master, origin/HEAD)
Checking out Revision 55bb0c1f5a62e513a7028f76bd2fd24f2e84a87c (origin/master, origin/HEAD)
Warning : There are multiple branch changesets here
Parsing POMs
Modules changed, recalculating dependency graph
[workspace] $ /x1/jenkins/jenkins-master/jenkins-home/tools/hudson.model.JDK/jdk1.7.0_65/bin/java
-Xms256m -Xmx512m -XX:+UseCompressedOops -XX:MaxPermSize=256m -cp /x1/jenkins/jenkins-master/jenkins-home/plugins/maven-plugin/WEB-INF/lib/maven3-agent-1.6.jar:/x1/jenkins/jenkins-master/jenkins-home/tools/hudson.tasks.Maven_MavenInstallation/maven-3.0.5/boot/plexus-classworlds-2.4.jar
org.jvnet.hudson.maven3.agent.Maven3Main /x1/jenkins/jenkins-master/jenkins-home/tools/hudson.tasks.Maven_MavenInstallation/maven-3.0.5
/x1/jenkins/jenkins-master/catalina-base/webapps/jenkins/WEB-INF/lib/remoting-2.36.jar /x1/jenkins/jenkins-master/jenkins-home/plugins/maven-plugin/WEB-INF/lib/maven3-interceptor-1.6.jar
/x1/jenkins/jenkins-master/jenkins-home/plugins/maven-plugin/WEB-INF/lib/maven3-interceptor-commons-1.6.jar
51713
<===[JENKINS REMOTING CAPACITY]===>   channel started
log4j:WARN No appenders could be found for logger (org.apache.commons.beanutils.converters.BooleanConverter).
log4j:WARN Please initialize the log4j system properly.
Executing Maven:  -B -f <https://analysis.apache.org/jenkins/job/directory-fortress-enmasse/ws/pom.xml>
clean install -U -DskipTests -fae
[INFO] Scanning for projects...
[WARNING] 
[WARNING] Some problems were encountered while building the effective model for org.apache.directory.fortress:fortress-rest:war:1.0.1-SNAPSHOT
[WARNING] 'build.plugins.plugin.version' for org.codehaus.mojo:tomcat-maven-plugin is missing.
@ line 323, column 15
[WARNING] 'reporting.plugins.plugin.version' for org.apache.maven.plugins:maven-javadoc-plugin
is missing. @ line 448, column 15
[WARNING] 
[WARNING] It is highly recommended to fix these problems because they threaten the stability
of your build.
[WARNING] 
[WARNING] For this reason, future Maven versions might no longer support building such malformed
projects.
[WARNING] 
[INFO]                                                                         
[INFO] ------------------------------------------------------------------------
[INFO] Building Apache Fortress Rest 1.0.1-SNAPSHOT
[INFO] ------------------------------------------------------------------------
Downloading: http://repo.maven.apache.org/maven2/org/codehaus/mojo/tomcat-maven-plugin/maven-metadata.xml
Downloaded: http://repo.maven.apache.org/maven2/org/codehaus/mojo/tomcat-maven-plugin/maven-metadata.xml
(439 B at 1.7 KB/sec)
Downloading: http://repo.maven.apache.org/maven2/org/codehaus/mojo/tomcat-maven-plugin/1.1/tomcat-maven-plugin-1.1.pom
Downloaded: http://repo.maven.apache.org/maven2/org/codehaus/mojo/tomcat-maven-plugin/1.1/tomcat-maven-plugin-1.1.pom
(9 KB at 118.9 KB/sec)
Downloading: http://repo.maven.apache.org/maven2/org/codehaus/mojo/tomcat-maven-plugin/1.1/tomcat-maven-plugin-1.1.jar
Downloaded: http://repo.maven.apache.org/maven2/org/codehaus/mojo/tomcat-maven-plugin/1.1/tomcat-maven-plugin-1.1.jar
(58 KB at 455.7 KB/sec)
Downloading: http://repo1.maven.org/maven2/org/apache/directory/fortress/fortress-realm-impl/1.0.1-SNAPSHOT/maven-metadata.xml
Downloading: http://repository.apache.org/snapshots/org/apache/directory/fortress/fortress-realm-impl/1.0.1-SNAPSHOT/maven-metadata.xml
Downloading: http://repo1.maven.org/maven2/org/apache/directory/fortress/fortress-realm-impl/1.0.1-SNAPSHOT/fortress-realm-impl-1.0.1-SNAPSHOT.pom
Downloading: http://repository.apache.org/snapshots/org/apache/directory/fortress/fortress-realm-impl/1.0.1-SNAPSHOT/fortress-realm-impl-1.0.1-SNAPSHOT.pom
[WARNING] The POM for org.apache.directory.fortress:fortress-realm-impl:jar:1.0.1-SNAPSHOT
is missing, no dependency information available
Downloading: http://repo1.maven.org/maven2/org/apache/cxf/cxf-bundle-jaxrs/2.7.18/cxf-bundle-jaxrs-2.7.18.pom
Downloaded: http://repo1.maven.org/maven2/org/apache/cxf/cxf-bundle-jaxrs/2.7.18/cxf-bundle-jaxrs-2.7.18.pom
(12 KB at 143.9 KB/sec)
Downloading: http://repo1.maven.org/maven2/org/apache/cxf/cxf-bundle-parent/2.7.18/cxf-bundle-parent-2.7.18.pom
Downloaded: http://repo1.maven.org/maven2/org/apache/cxf/cxf-bundle-parent/2.7.18/cxf-bundle-parent-2.7.18.pom
(9 KB at 142.2 KB/sec)
Downloading: http://repo1.maven.org/maven2/org/apache/cxf/cxf-parent/2.7.18/cxf-parent-2.7.18.pom
Downloaded: http://repo1.maven.org/maven2/org/apache/cxf/cxf-parent/2.7.18/cxf-parent-2.7.18.pom
(83 KB at 752.8 KB/sec)
Downloading: http://repo1.maven.org/maven2/org/apache/cxf/cxf/2.7.18/cxf-2.7.18.pom
Downloaded: http://repo1.maven.org/maven2/org/apache/cxf/cxf/2.7.18/cxf-2.7.18.pom (34 KB
at 538.6 KB/sec)
Downloading: http://repo1.maven.org/maven2/org/slf4j/slf4j-log4j12/1.7.18/slf4j-log4j12-1.7.18.pom
Downloaded: http://repo1.maven.org/maven2/org/slf4j/slf4j-log4j12/1.7.18/slf4j-log4j12-1.7.18.pom
(909 B at 12.0 KB/sec)
Downloading: http://repo1.maven.org/maven2/org/slf4j/slf4j-parent/1.7.18/slf4j-parent-1.7.18.pom
Downloaded: http://repo1.maven.org/maven2/org/slf4j/slf4j-parent/1.7.18/slf4j-parent-1.7.18.pom
(14 KB at 227.3 KB/sec)
Downloading: http://repo1.maven.org/maven2/org/slf4j/slf4j-api/1.7.18/slf4j-api-1.7.18.pom
Downloaded: http://repo1.maven.org/maven2/org/slf4j/slf4j-api/1.7.18/slf4j-api-1.7.18.pom
(3 KB at 48.4 KB/sec)
Downloading: http://repo1.maven.org/maven2/org/springframework/spring-oxm/4.0.0.RELEASE/spring-oxm-4.0.0.RELEASE.pom
Downloaded: http://repo1.maven.org/maven2/org/springframework/spring-oxm/4.0.0.RELEASE/spring-oxm-4.0.0.RELEASE.pom
(3 KB at 46.0 KB/sec)
Downloading: http://repo1.maven.org/maven2/org/springframework/security/spring-security-acl/4.0.0.RELEASE/spring-security-acl-4.0.0.RELEASE.pom
Downloaded: http://repo1.maven.org/maven2/org/springframework/security/spring-security-acl/4.0.0.RELEASE/spring-security-acl-4.0.0.RELEASE.pom
(5 KB at 84.6 KB/sec)
Downloading: http://repo1.maven.org/maven2/org/springframework/security/spring-security-core/4.0.0.RELEASE/spring-security-core-4.0.0.RELEASE.pom
Downloaded: http://repo1.maven.org/maven2/org/springframework/security/spring-security-core/4.0.0.RELEASE/spring-security-core-4.0.0.RELEASE.pom
(9 KB at 108.8 KB/sec)
Downloading: http://repo1.maven.org/maven2/org/springframework/spring-aop/4.1.6.RELEASE/spring-aop-4.1.6.RELEASE.pom
Downloaded: http://repo1.maven.org/maven2/org/springframework/spring-aop/4.1.6.RELEASE/spring-aop-4.1.6.RELEASE.pom
(3 KB at 34.1 KB/sec)
Downloading: http://repo1.maven.org/maven2/org/springframework/spring-beans/4.1.6.RELEASE/spring-beans-4.1.6.RELEASE.pom
Downloaded: http://repo1.maven.org/maven2/org/springframework/spring-beans/4.1.6.RELEASE/spring-beans-4.1.6.RELEASE.pom
(3 KB at 36.5 KB/sec)
Downloading: http://repo1.maven.org/maven2/org/springframework/spring-core/4.1.6.RELEASE/spring-core-4.1.6.RELEASE.pom
Downloaded: http://repo1.maven.org/maven2/org/springframework/spring-core/4.1.6.RELEASE/spring-core-4.1.6.RELEASE.pom
(3 KB at 31.2 KB/sec)
Downloading: http://repo1.maven.org/maven2/org/springframework/spring-context/4.1.6.RELEASE/spring-context-4.1.6.RELEASE.pom
Downloaded: http://repo1.maven.org/maven2/org/springframework/spring-context/4.1.6.RELEASE/spring-context-4.1.6.RELEASE.pom
(5 KB at 57.5 KB/sec)
Downloading: http://repo1.maven.org/maven2/org/springframework/spring-expression/4.1.6.RELEASE/spring-expression-4.1.6.RELEASE.pom
Downloaded: http://repo1.maven.org/maven2/org/springframework/spring-expression/4.1.6.RELEASE/spring-expression-4.1.6.RELEASE.pom
(2 KB at 25.9 KB/sec)
Downloading: http://repo1.maven.org/maven2/org/springframework/spring-jdbc/4.1.6.RELEASE/spring-jdbc-4.1.6.RELEASE.pom
Downloaded: http://repo1.maven.org/maven2/org/springframework/spring-jdbc/4.1.6.RELEASE/spring-jdbc-4.1.6.RELEASE.pom
(4 KB at 60.5 KB/sec)
Downloading: http://repo1.maven.org/maven2/org/springframework/spring-tx/4.1.6.RELEASE/spring-tx-4.1.6.RELEASE.pom
Downloaded: http://repo1.maven.org/maven2/org/springframework/spring-tx/4.1.6.RELEASE/spring-tx-4.1.6.RELEASE.pom
(4 KB at 43.9 KB/sec)
Downloading: http://repo1.maven.org/maven2/org/springframework/security/spring-security-config/4.0.0.RELEASE/spring-security-config-4.0.0.RELEASE.pom
Downloaded: http://repo1.maven.org/maven2/org/springframework/security/spring-security-config/4.0.0.RELEASE/spring-security-config-4.0.0.RELEASE.pom
(13 KB at 175.3 KB/sec)
Downloading: http://repo1.maven.org/maven2/org/springframework/security/spring-security-web/4.0.0.RELEASE/spring-security-web-4.0.0.RELEASE.pom
Downloaded: http://repo1.maven.org/maven2/org/springframework/security/spring-security-web/4.0.0.RELEASE/spring-security-web-4.0.0.RELEASE.pom
(8 KB at 109.0 KB/sec)
Downloading: http://repo1.maven.org/maven2/org/springframework/spring-web/4.1.6.RELEASE/spring-web-4.1.6.RELEASE.pom
Downloaded: http://repo1.maven.org/maven2/org/springframework/spring-web/4.1.6.RELEASE/spring-web-4.1.6.RELEASE.pom
(8 KB at 105.1 KB/sec)
Downloading: http://repo1.maven.org/maven2/org/apache/directory/fortress/fortress-realm-impl/1.0.1-SNAPSHOT/fortress-realm-impl-1.0.1-SNAPSHOT.jar
Downloading: http://repo1.maven.org/maven2/org/apache/cxf/cxf-bundle-jaxrs/2.7.18/cxf-bundle-jaxrs-2.7.18.jar
Downloading: http://repo1.maven.org/maven2/org/slf4j/slf4j-log4j12/1.7.18/slf4j-log4j12-1.7.18.jar
Downloading: http://repo1.maven.org/maven2/org/springframework/spring-oxm/4.0.0.RELEASE/spring-oxm-4.0.0.RELEASE.jar
Downloading: http://repo1.maven.org/maven2/org/springframework/security/spring-security-acl/4.0.0.RELEASE/spring-security-acl-4.0.0.RELEASE.jar
Downloaded: http://repo1.maven.org/maven2/org/slf4j/slf4j-log4j12/1.7.18/slf4j-log4j12-1.7.18.jar
(10 KB at 98.1 KB/sec)
Downloading: http://repo1.maven.org/maven2/org/springframework/security/spring-security-core/4.0.0.RELEASE/spring-security-core-4.0.0.RELEASE.jar
Downloading: http://repo1.maven.org/maven2/org/springframework/spring-jdbc/4.1.6.RELEASE/spring-jdbc-4.1.6.RELEASE.jar
Downloaded: http://repo1.maven.org/maven2/org/springframework/spring-oxm/4.0.0.RELEASE/spring-oxm-4.0.0.RELEASE.jar
(78 KB at 480.2 KB/sec)
Downloading: http://repo1.maven.org/maven2/org/springframework/spring-tx/4.1.6.RELEASE/spring-tx-4.1.6.RELEASE.jar
Downloaded: http://repo1.maven.org/maven2/org/springframework/security/spring-security-acl/4.0.0.RELEASE/spring-security-acl-4.0.0.RELEASE.jar
(81 KB at 501.8 KB/sec)
Downloading: http://repo1.maven.org/maven2/org/springframework/security/spring-security-config/4.0.0.RELEASE/spring-security-config-4.0.0.RELEASE.jar
Downloaded: http://repo1.maven.org/maven2/org/springframework/spring-tx/4.1.6.RELEASE/spring-tx-4.1.6.RELEASE.jar
(247 KB at 1826.9 KB/sec)
Downloading: http://repo1.maven.org/maven2/org/springframework/security/spring-security-web/4.0.0.RELEASE/spring-security-web-4.0.0.RELEASE.jar
Downloaded: http://repo1.maven.org/maven2/org/springframework/security/spring-security-core/4.0.0.RELEASE/spring-security-core-4.0.0.RELEASE.jar
(347 KB at 1552.7 KB/sec)
Downloading: http://repo1.maven.org/maven2/org/springframework/spring-web/4.1.6.RELEASE/spring-web-4.1.6.RELEASE.jar
Downloaded: http://repo1.maven.org/maven2/org/springframework/security/spring-security-config/4.0.0.RELEASE/spring-security-config-4.0.0.RELEASE.jar
(461 KB at 2664.4 KB/sec)
Downloaded: http://repo1.maven.org/maven2/org/springframework/spring-jdbc/4.1.6.RELEASE/spring-jdbc-4.1.6.RELEASE.jar
(417 KB at 1549.0 KB/sec)
Downloaded: http://repo1.maven.org/maven2/org/springframework/security/spring-security-web/4.0.0.RELEASE/spring-security-web-4.0.0.RELEASE.jar
(315 KB at 2963.7 KB/sec)
Downloaded: http://repo1.maven.org/maven2/org/apache/cxf/cxf-bundle-jaxrs/2.7.18/cxf-bundle-jaxrs-2.7.18.jar
(2767 KB at 6175.2 KB/sec)
Downloaded: http://repo1.maven.org/maven2/org/springframework/spring-web/4.1.6.RELEASE/spring-web-4.1.6.RELEASE.jar
(702 KB at 5357.7 KB/sec)
Downloading: http://repository.apache.org/snapshots/org/apache/directory/fortress/fortress-realm-impl/1.0.1-SNAPSHOT/fortress-realm-impl-1.0.1-SNAPSHOT.jar
[INFO] ------------------------------------------------------------------------
[INFO] BUILD FAILURE
[INFO] ------------------------------------------------------------------------
[INFO] Total time: 8.497s
[INFO] Finished at: Wed May 18 07:50:06 UTC 2016
[INFO] Final Memory: 12M/246M
[INFO] ------------------------------------------------------------------------
Waiting for Jenkins to finish collecting data
[ERROR] Failed to execute goal on project fortress-rest: Could not resolve dependencies for
project org.apache.directory.fortress:fortress-rest:war:1.0.1-SNAPSHOT: Could not find artifact
org.apache.directory.fortress:fortress-realm-impl:jar:1.0.1-SNAPSHOT in maven2 (http://repo1.maven.org/maven2)
-> [Help 1]
[ERROR] 
[ERROR] To see the full stack trace of the errors, re-run Maven with the -e switch.
[ERROR] Re-run Maven using the -X switch to enable full debug logging.
[ERROR] 
[ERROR] For more information about the errors and possible solutions, please read the following
articles:
[ERROR] [Help 1] http://cwiki.apache.org/confluence/display/MAVEN/DependencyResolutionException
[JENKINS] Archiving <https://analysis.apache.org/jenkins/job/directory-fortress-enmasse/ws/pom.xml>
to org.apache.directory.fortress/fortress-rest/1.0.1-SNAPSHOT/fortress-rest-1.0.1-SNAPSHOT.pom
Sending e-mails to: notifications@directory.apache.org
channel stopped
Skipping sonar analysis due to bad build status FAILURE

Mime
View raw message