directory-notifications mailing list archives

Site index · List index
Message view « Date » · « Thread »
Top « Date » · « Thread »
Subject Build failed in Jenkins: directory-fortress-commander #828
Date Thu, 10 Mar 2016 09:41:53 GMT
See <>


[smckinney] release preps

[smckinney] [maven-release-plugin] prepare release 1.0-RC42

[smckinney] [maven-release-plugin] prepare for next development iteration

Started by timer
Building in workspace <>
 > git rev-parse --is-inside-work-tree # timeout=10
Fetching changes from the remote Git repository
 > git config remote.origin.url
# timeout=10
Fetching upstream changes from
 > git --version # timeout=10
 > git -c core.askpass=true fetch --tags --progress
Seen branch in repository origin/1.0-RC41
Seen branch in repository origin/master
Seen 2 remote branches
Checking out Revision 186b1fb8f94ccba73782ac5c12de9da26a3f6bc2 (origin/master)
 > git config core.sparsecheckout # timeout=10
 > git checkout -f 186b1fb8f94ccba73782ac5c12de9da26a3f6bc2
 > git rev-list 694b80e86de9966740c9fcbd0523edae3ebf0bb4 # timeout=10
 > git tag -a -f -m Jenkins Build #828 jenkins-directory-fortress-commander-828 # timeout=10
Parsing POMs
Established TCP socket on 36717
[workspace] $ /x1/jenkins/jenkins-master/jenkins-home/tools/hudson.model.JDK/jdk1.7.0_65/bin/java
-Xms256m -Xmx512m -XX:+UseCompressedOops -XX:MaxPermSize=256m -cp /x1/jenkins/jenkins-master/jenkins-home/plugins/maven-plugin/WEB-INF/lib/maven3-agent-1.7.jar:/x1/jenkins/jenkins-master/jenkins-home/tools/hudson.tasks.Maven_MavenInstallation/maven-3.0.5/boot/plexus-classworlds-2.4.jar
org.jvnet.hudson.maven3.agent.Maven3Main /x1/jenkins/jenkins-master/jenkins-home/tools/hudson.tasks.Maven_MavenInstallation/maven-3.0.5
<===[JENKINS REMOTING CAPACITY]===>   channel started
Executing Maven:  -B -f <>
clean install -U -DskipTests -fae
[INFO] Scanning for projects...
[INFO] ------------------------------------------------------------------------
[INFO] Building Apache Fortress Web 1.0-RC43-SNAPSHOT
[INFO] ------------------------------------------------------------------------
[WARNING] The POM for is missing,
no dependency information available
[INFO] ------------------------------------------------------------------------
[INFO] ------------------------------------------------------------------------
[INFO] Total time: 17.795s
[INFO] Finished at: Thu Mar 10 09:41:51 UTC 2016
[INFO] Final Memory: 15M/310M
[INFO] ------------------------------------------------------------------------
Waiting for Jenkins to finish collecting data
[ERROR] Failed to execute goal on project fortress-web: Could not resolve dependencies for
project Could not find artifact in maven2 (
-> [Help 1]
[ERROR] To see the full stack trace of the errors, re-run Maven with the -e switch.
[ERROR] Re-run Maven using the -X switch to enable full debug logging.
[ERROR] For more information about the errors and possible solutions, please read the following
[ERROR] [Help 1]
[JENKINS] Archiving <>
Sending e-mails to:
channel stopped
Skipping sonar analysis due to bad build status FAILURE

View raw message