directory-notifications mailing list archives

Site index · List index
Message view « Date » · « Thread »
Top « Date » · « Thread »
From gmcdon...@apache.org
Subject Build failed in Jenkins: directory-fortress-commander #830
Date Sat, 12 Mar 2016 09:32:48 GMT
See <https://analysis.apache.org/jenkins/job/directory-fortress-commander/830/>

------------------------------------------
Started by timer
Building in workspace <https://analysis.apache.org/jenkins/job/directory-fortress-commander/ws/>
 > git rev-parse --is-inside-work-tree # timeout=10
Fetching changes from the remote Git repository
 > git config remote.origin.url https://git-wip-us.apache.org/repos/asf/directory-fortress-commander.git
# timeout=10
Fetching upstream changes from https://git-wip-us.apache.org/repos/asf/directory-fortress-commander.git
 > git --version # timeout=10
 > git -c core.askpass=true fetch --tags --progress https://git-wip-us.apache.org/repos/asf/directory-fortress-commander.git
+refs/heads/*:refs/remotes/origin/*
Seen branch in repository origin/1.0-RC41
Seen branch in repository origin/master
Seen 2 remote branches
Checking out Revision 186b1fb8f94ccba73782ac5c12de9da26a3f6bc2 (origin/master)
 > git config core.sparsecheckout # timeout=10
 > git checkout -f 186b1fb8f94ccba73782ac5c12de9da26a3f6bc2
 > git rev-list 186b1fb8f94ccba73782ac5c12de9da26a3f6bc2 # timeout=10
 > git tag -a -f -m Jenkins Build #830 jenkins-directory-fortress-commander-830 # timeout=10
Parsing POMs
Established TCP socket on 42845
[workspace] $ /x1/jenkins/jenkins-master/jenkins-home/tools/hudson.model.JDK/jdk1.7.0_65/bin/java
-Xms256m -Xmx512m -XX:+UseCompressedOops -XX:MaxPermSize=256m -cp /x1/jenkins/jenkins-master/jenkins-home/plugins/maven-plugin/WEB-INF/lib/maven3-agent-1.7.jar:/x1/jenkins/jenkins-master/jenkins-home/tools/hudson.tasks.Maven_MavenInstallation/maven-3.0.5/boot/plexus-classworlds-2.4.jar
org.jvnet.hudson.maven3.agent.Maven3Main /x1/jenkins/jenkins-master/jenkins-home/tools/hudson.tasks.Maven_MavenInstallation/maven-3.0.5
/x1/jenkins/jenkins-master/catalina-base/work/Catalina/localhost/jenkins/WEB-INF/lib/remoting-2.53.3.jar
/x1/jenkins/jenkins-master/jenkins-home/plugins/maven-plugin/WEB-INF/lib/maven3-interceptor-1.7.jar
/x1/jenkins/jenkins-master/jenkins-home/plugins/maven-plugin/WEB-INF/lib/maven3-interceptor-commons-1.7.jar
42845
<===[JENKINS REMOTING CAPACITY]===>   channel started
Executing Maven:  -B -f <https://analysis.apache.org/jenkins/job/directory-fortress-commander/ws/pom.xml>
clean install -U -DskipTests -fae
[INFO] Scanning for projects...
[INFO]                                                                         
[INFO] ------------------------------------------------------------------------
[INFO] Building Apache Fortress Web 1.0-RC43-SNAPSHOT
[INFO] ------------------------------------------------------------------------
Downloading: http://repo1.maven.org/maven2/org/apache/directory/fortress/fortress-realm-impl/1.0-RC42/fortress-realm-impl-1.0-RC42.pom
Downloading: http://repo.maven.apache.org/maven2/org/apache/directory/fortress/fortress-realm-impl/1.0-RC42/fortress-realm-impl-1.0-RC42.pom
[WARNING] The POM for org.apache.directory.fortress:fortress-realm-impl:jar:1.0-RC42 is missing,
no dependency information available
Downloading: http://repo1.maven.org/maven2/org/apache/directory/fortress/fortress-realm-impl/1.0-RC42/fortress-realm-impl-1.0-RC42.jar
Downloading: http://repo.maven.apache.org/maven2/org/apache/directory/fortress/fortress-realm-impl/1.0-RC42/fortress-realm-impl-1.0-RC42.jar
[INFO] ------------------------------------------------------------------------
[INFO] BUILD FAILURE
[INFO] ------------------------------------------------------------------------
[INFO] Total time: 15.757s
[INFO] Finished at: Sat Mar 12 09:32:46 UTC 2016
[INFO] Final Memory: 15M/246M
[INFO] ------------------------------------------------------------------------
Waiting for Jenkins to finish collecting data[ERROR] Failed to execute goal on project fortress-web:
Could not resolve dependencies for project org.apache.directory.fortress:fortress-web:war:1.0-RC43-SNAPSHOT:
Could not find artifact org.apache.directory.fortress:fortress-realm-impl:jar:1.0-RC42 in
maven2 (http://repo1.maven.org/maven2) -> [Help 1]
[ERROR] 
[ERROR] To see the full stack trace of the errors, re-run Maven with the -e switch.
[ERROR] Re-run Maven using the -X switch to enable full debug logging.
[ERROR] 
[ERROR] For more information about the errors and possible solutions, please read the following
articles:
[ERROR] [Help 1] http://cwiki.apache.org/confluence/display/MAVEN/DependencyResolutionException

[JENKINS] Archiving <https://analysis.apache.org/jenkins/job/directory-fortress-commander/ws/pom.xml>
to org.apache.directory.fortress/fortress-web/1.0-RC43-SNAPSHOT/fortress-web-1.0-RC43-SNAPSHOT.pom
Sending e-mails to: notifications@directory.apache.org
channel stopped
Skipping sonar analysis due to bad build status FAILURE

Mime
View raw message